Gentoo Forums
Gentoo Forums
Gentoo Forums
Quick Search: in
Unable to update ruby-2.0.0...
View unanswered posts
View posts from last 24 hours

 
Reply to topic    Gentoo Forums Forum Index Portage & Programming
View previous topic :: View next topic  
Author Message
Naib
Advocate
Advocate


Joined: 21 May 2004
Posts: 4109
Location: Removed by Neddy

PostPosted: Tue Sep 10, 2013 10:47 pm    Post subject: Unable to update ruby-2.0.0... Reply with quote

A few weeks back ruby20 was "forced" unto ~arch (and it seems its coming to stable).
unfortunately I am unable to emerge ruby 20


Quote:
emerge ruby -va

These are the packages that would be merged, in order:

Calculating dependencies... done!
[ebuild NS ] dev-lang/ruby-2.0.0_p247-r1:2.0 [1.8.7_p374-r1:1.8, 1.9.3_p448-r1:1.9] USE="berkdb gdbm ipv6 ncurses rdoc readline ssl yaml -debug -doc -examples -rubytests -socks5 -tk -xemacs" 0 kB
[ebuild U ] dev-ruby/rubygems-2.0.8 [2.0.3] USE="-server {-test}" RUBY_TARGETS="ruby18 ruby19 (ruby20%*) -jruby" 0 kB
[ebuild NS ] virtual/rubygems-6:ruby20 [1:ruby18, 4:ruby19] RUBY_TARGETS="(ruby20)" 0 kB
[ebuild R ] dev-ruby/rake-0.9.6 USE="-doc {-test}" RUBY_TARGETS="ruby18 ruby19 (ruby20%*) -jruby" 0 kB
[ebuild U ] dev-ruby/json-1.8.0-r1 [1.8.0] USE="-doc {-test}" RUBY_TARGETS="ruby18 ruby19 (ruby20%*) -jruby" 0 kB
[ebuild R ] dev-ruby/racc-1.4.9 USE="-doc {-test}" RUBY_TARGETS="ruby18 ruby19 (ruby20%*) -jruby" 0 kB
[ebuild U ] dev-ruby/rdoc-4.0.1-r1 [4.0.1] USE="-doc {-test}" RUBY_TARGETS="ruby18 ruby19 (ruby20%*) -jruby" 0 kB

Total: 7 packages (3 upgrades, 2 in new slots, 2 reinstalls), Size of downloads: 0 kB

Would you like to merge these packages? [Yes/No]


Code:

...
make[2]: Entering directory `/media/backup/portage_tmp/portage/dev-lang/ruby-2.0.0_p247-r1/work/ruby-2.0.0-p247/ext/-test-/exception'
make[2]: Entering directory `/media/backup/portage_tmp/portage/dev-lang/ruby-2.0.0_p247-r1/work/ruby-2.0.0-p247/ext/-test-/fatal'
make[2]: Entering directory `/media/backup/portage_tmp/portage/dev-lang/ruby-2.0.0_p247-r1/work/ruby-2.0.0-p247/ext/-test-/funcall'
make[2]: Entering directory `/media/backup/portage_tmp/portage/dev-lang/ruby-2.0.0_p247-r1/work/ruby-2.0.0-p247/ext/-test-/debug'
x86_64-pc-linux-gnu-gcc -I. -I../../../.ext/include/x86_64-linux -I../../.././include -I../../.././ext/-test-/exception -DRUBY_EXTCONF_H=\"extconf.h\" -U_FORTIFY_SOURCE=2   -fPIC -march=corei7 -O2 -pipe -mtune=corei7 -Wno-format-security -fno-strict-aliasing -fPIC  -o enc_raise.o -c enc_raise.c
x86_64-pc-linux-gnu-gcc -I. -I../../../.ext/include/x86_64-linux -I../../.././include -I../../.././ext/-test-/funcall -DRUBY_EXTCONF_H=\"extconf.h\" -U_FORTIFY_SOURCE=2   -fPIC -march=corei7 -O2 -pipe -mtune=corei7 -Wno-format-security -fno-strict-aliasing -fPIC  -o passing_block.o -c passing_block.c
x86_64-pc-linux-gnu-gcc -I. -I../../../.ext/include/x86_64-linux -I../../.././include -I../../.././ext/-test-/fatal -DRUBY_EXTCONF_H=\"extconf.h\" -U_FORTIFY_SOURCE=2   -fPIC -march=corei7 -O2 -pipe -mtune=corei7 -Wno-format-security -fno-strict-aliasing -fPIC  -o rb_fatal.o -c rb_fatal.c
x86_64-pc-linux-gnu-gcc -I. -I../../../.ext/include/x86_64-linux -I../../.././include -I../../.././ext/-test-/debug -DRUBY_EXTCONF_H=\"extconf.h\" -U_FORTIFY_SOURCE=2   -fPIC -march=corei7 -O2 -pipe -mtune=corei7 -Wno-format-security -fno-strict-aliasing -fPIC  -o init.o -c init.c
<command-line>:0:16: warning: extra tokens at end of #undef directive [enabled by default]
<command-line>:0:16: warning: extra tokens at end of #undef directive [enabled by default]
<command-line>:0:16: warning: extra tokens at end of #undef directive [enabled by default]
<command-line>:0:16: warning: extra tokens at end of #undef directive [enabled by default]
x86_64-pc-linux-gnu-gcc -I. -I../../../.ext/include/x86_64-linux -I../../.././include -I../../.././ext/-test-/debug -DRUBY_EXTCONF_H=\"extconf.h\" -U_FORTIFY_SOURCE=2   -fPIC -march=corei7 -O2 -pipe -mtune=corei7 -Wno-format-security -fno-strict-aliasing -fPIC  -o inspector.o -c inspector.c
/bin/mkdir -p ../../../.ext/x86_64-linux/-test-/fatal
exit > .RUBYARCHDIR.time
x86_64-pc-linux-gnu-gcc -I. -I../../../.ext/include/x86_64-linux -I../../.././include -I../../.././ext/-test-/exception -DRUBY_EXTCONF_H=\"extconf.h\" -U_FORTIFY_SOURCE=2   -fPIC -march=corei7 -O2 -pipe -mtune=corei7 -Wno-format-security -fno-strict-aliasing -fPIC  -o init.o -c init.c
/bin/mkdir -p ../../../.ext/x86_64-linux/-test-/funcall
exit > .RUBYARCHDIR.time
rm -f ../../../.ext/x86_64-linux/-test-/fatal/rb_fatal.so
x86_64-pc-linux-gnu-gcc -shared -o ../../../.ext/x86_64-linux/-test-/fatal/rb_fatal.so rb_fatal.o -L. -L../../.. -L. -Wl,-O1 -Wl,--as-needed -rdynamic -Wl,-export-dynamic -Wl,--no-undefined    -lruby20  -lpthread -lrt -ldl -lcrypt -lm   -lc
rm -f ../../../.ext/x86_64-linux/-test-/funcall/funcall.so
x86_64-pc-linux-gnu-gcc -shared -o ../../../.ext/x86_64-linux/-test-/funcall/funcall.so passing_block.o -L. -L../../.. -L. -Wl,-O1 -Wl,--as-needed -rdynamic -Wl,-export-dynamic -Wl,--no-undefined    -lruby20  -lpthread -lrt -ldl -lcrypt -lm   -lc
<command-line>:0:16: warning: extra tokens at end of #undef directive [enabled by default]
<command-line>:0:16: warning: extra tokens at end of #undef directive [enabled by default]
make[2]: Leaving directory `/media/backup/portage_tmp/portage/dev-lang/ruby-2.0.0_p247-r1/work/ruby-2.0.0-p247/ext/-test-/fatal'
x86_64-pc-linux-gnu-gcc -I. -I../../../.ext/include/x86_64-linux -I../../.././include -I../../.././ext/-test-/exception -DRUBY_EXTCONF_H=\"extconf.h\" -U_FORTIFY_SOURCE=2   -fPIC -march=corei7 -O2 -pipe -mtune=corei7 -Wno-format-security -fno-strict-aliasing -fPIC  -o ensured.o -c ensured.c
make[2]: Leaving directory `/media/backup/portage_tmp/portage/dev-lang/ruby-2.0.0_p247-r1/work/ruby-2.0.0-p247/ext/-test-/funcall'
/bin/mkdir -p ../../../.ext/x86_64-linux/-test-
exit > .RUBYARCHDIR.time
cd ext/-test-/iter && exec make -wl 4 - --jobserver-fds=4,5 -j V=1 all
make[2]: Entering directory `/media/backup/portage_tmp/portage/dev-lang/ruby-2.0.0_p247-r1/work/ruby-2.0.0-p247/ext/-test-/iter'
<command-line>:0:16: warning: extra tokens at end of #undef directive [enabled by default]
x86_64-pc-linux-gnu-gcc -I. -I../../../.ext/include/x86_64-linux -I../../.././include -I../../.././ext/-test-/iter -DRUBY_EXTCONF_H=\"extconf.h\" -U_FORTIFY_SOURCE=2   -fPIC -march=corei7 -O2 -pipe -mtune=corei7 -Wno-format-security -fno-strict-aliasing -fPIC  -o break.o -c break.c
/bin/mkdir -p ../../../.ext/x86_64-linux/-test-/iter
exit > .RUBYARCHDIR.time
/bin/mkdir -p ../../../.ext/x86_64-linux/-test-
exit > .RUBYARCHDIR.time
<command-line>:0:16: warning: extra tokens at end of #undef directive [enabled by default]
cd ext/-test-/load/dot.dot && exec make -wl 4 - --jobserver-fds=4,5 -j V=1 all
rm -f ../../../.ext/x86_64-linux/-test-/debug.so
x86_64-pc-linux-gnu-gcc -shared -o ../../../.ext/x86_64-linux/-test-/debug.so init.o inspector.o -L. -L../../.. -L. -Wl,-O1 -Wl,--as-needed -rdynamic -Wl,-export-dynamic -Wl,--no-undefined    -lruby20  -lpthread -lrt -ldl -lcrypt -lm   -lc
make[2]: Entering directory `/media/backup/portage_tmp/portage/dev-lang/ruby-2.0.0_p247-r1/work/ruby-2.0.0-p247/ext/-test-/load/dot.dot'
x86_64-pc-linux-gnu-gcc -I. -I../../../../.ext/include/x86_64-linux -I../../../.././include -I../../../.././ext/-test-/load/dot.dot -DRUBY_EXTCONF_H=\"extconf.h\" -U_FORTIFY_SOURCE=2   -fPIC -march=corei7 -O2 -pipe -mtune=corei7 -Wno-format-security -fno-strict-aliasing -fPIC  -o dot.dot.o -c dot.dot.c
<command-line>:0:16: warning: extra tokens at end of #undef directive [enabled by default]
/bin/mkdir -p ../../../../.ext/x86_64-linux/-test-/load/dot.dot
exit > .RUBYARCHDIR.time
rm -f ../../../../.ext/x86_64-linux/-test-/load/dot.dot/dot.dot.so
x86_64-pc-linux-gnu-gcc -shared -o ../../../../.ext/x86_64-linux/-test-/load/dot.dot/dot.dot.so dot.dot.o -L. -L../../../.. -L. -Wl,-O1 -Wl,--as-needed -rdynamic -Wl,-export-dynamic -Wl,--no-undefined    -lruby20  -lpthread -lrt -ldl -lcrypt -lm   -lc
make[2]: Leaving directory `/media/backup/portage_tmp/portage/dev-lang/ruby-2.0.0_p247-r1/work/ruby-2.0.0-p247/ext/-test-/debug'
cd ext/-test-/marshal/compat && exec make -wl 4 - --jobserver-fds=4,5 -j V=1 all
rm -f ../../../.ext/x86_64-linux/-test-/exception.so
x86_64-pc-linux-gnu-gcc -shared -o ../../../.ext/x86_64-linux/-test-/exception.so enc_raise.o init.o ensured.o -L. -L../../.. -L. -Wl,-O1 -Wl,--as-needed -rdynamic -Wl,-export-dynamic -Wl,--no-undefined    -lruby20  -lpthread -lrt -ldl -lcrypt -lm   -lc
make[2]: Entering directory `/media/backup/portage_tmp/portage/dev-lang/ruby-2.0.0_p247-r1/work/ruby-2.0.0-p247/ext/-test-/marshal/compat'
x86_64-pc-linux-gnu-gcc -I. -I../../../../.ext/include/x86_64-linux -I../../../.././include -I../../../.././ext/-test-/marshal/compat -DRUBY_EXTCONF_H=\"extconf.h\" -U_FORTIFY_SOURCE=2   -fPIC -march=corei7 -O2 -pipe -mtune=corei7 -Wno-format-security -fno-strict-aliasing -fPIC  -o usrcompat.o -c usrcompat.c
rm -f ../../../.ext/x86_64-linux/-test-/iter/break.so
x86_64-pc-linux-gnu-gcc -shared -o ../../../.ext/x86_64-linux/-test-/iter/break.so break.o -L. -L../../.. -L. -Wl,-O1 -Wl,--as-needed -rdynamic -Wl,-export-dynamic -Wl,--no-undefined    -lruby20  -lpthread -lrt -ldl -lcrypt -lm   -lc
<command-line>:0:16: warning: extra tokens at end of #undef directive [enabled by default]
make[2]: Leaving directory `/media/backup/portage_tmp/portage/dev-lang/ruby-2.0.0_p247-r1/work/ruby-2.0.0-p247/ext/-test-/load/dot.dot'
/bin/mkdir -p ../../../../.ext/x86_64-linux/-test-/marshal
exit > .RUBYARCHDIR.time
cd ext/-test-/marshal/usr && exec make -wl 4 - --jobserver-fds=4,5 -j V=1 all
make[2]: Leaving directory `/media/backup/portage_tmp/portage/dev-lang/ruby-2.0.0_p247-r1/work/ruby-2.0.0-p247/ext/-test-/exception'
make[2]: Entering directory `/media/backup/portage_tmp/portage/dev-lang/ruby-2.0.0_p247-r1/work/ruby-2.0.0-p247/ext/-test-/marshal/usr'
/bin/mkdir -p ../../../../.ext/x86_64-linux/-test-/marshal
x86_64-pc-linux-gnu-gcc -I. -I../../../../.ext/include/x86_64-linux -I../../../.././include -I../../../.././ext/-test-/marshal/usr -DRUBY_EXTCONF_H=\"extconf.h\" -U_FORTIFY_SOURCE=2   -fPIC -march=corei7 -O2 -pipe -mtune=corei7 -Wno-format-security -fno-strict-aliasing -fPIC  -o usrmarshal.o -c usrmarshal.c
exit > .RUBYARCHDIR.time
cd ext/-test-/method && exec make -wl 4 - --jobserver-fds=4,5 -j V=1 all
make[2]: Leaving directory `/media/backup/portage_tmp/portage/dev-lang/ruby-2.0.0_p247-r1/work/ruby-2.0.0-p247/ext/-test-/iter'
cd ext/-test-/num2int && exec make -wl 4 - --jobserver-fds=4,5 -j V=1 all
make[2]: Entering directory `/media/backup/portage_tmp/portage/dev-lang/ruby-2.0.0_p247-r1/work/ruby-2.0.0-p247/ext/-test-/method'
x86_64-pc-linux-gnu-gcc -I. -I../../../.ext/include/x86_64-linux -I../../.././include -I../../.././ext/-test-/method -DRUBY_EXTCONF_H=\"extconf.h\" -U_FORTIFY_SOURCE=2   -fPIC -march=corei7 -O2 -pipe -mtune=corei7 -Wno-format-security -fno-strict-aliasing -fPIC  -o init.o -c init.c
<command-line>:0:16: warning: extra tokens at end of #undef directive [enabled by default]
make[2]: Entering directory `/media/backup/portage_tmp/portage/dev-lang/ruby-2.0.0_p247-r1/work/ruby-2.0.0-p247/ext/-test-/num2int'
x86_64-pc-linux-gnu-gcc -I. -I../../../.ext/include/x86_64-linux -I../../.././include -I../../.././ext/-test-/num2int -DRUBY_EXTCONF_H=\"extconf.h\" -U_FORTIFY_SOURCE=2   -fPIC -march=corei7 -O2 -pipe -mtune=corei7 -Wno-format-security -fno-strict-aliasing -fPIC  -o num2int.o -c num2int.c
<command-line>:0:16: warning: extra tokens at end of #undef directive [enabled by default]
<command-line>:0:16: warning: extra tokens at end of #undef directive [enabled by default]
rm -f ../../../../.ext/x86_64-linux/-test-/marshal/compat.so
x86_64-pc-linux-gnu-gcc -shared -o ../../../../.ext/x86_64-linux/-test-/marshal/compat.so usrcompat.o -L. -L../../../.. -L. -Wl,-O1 -Wl,--as-needed -rdynamic -Wl,-export-dynamic -Wl,--no-undefined    -lruby20  -lpthread -lrt -ldl -lcrypt -lm   -lc
num2int.c: In function ‘print_num2ll’:
num2int.c:82:21: error: expected ‘)’ before ‘PRI_LL_PREFIX’
num2int.c:82:21: warning: spurious trailing ‘%’ in format [-Wformat]
num2int.c: In function ‘print_num2ull’:
num2int.c:94:21: error: expected ‘)’ before ‘PRI_LL_PREFIX’
num2int.c:94:21: warning: spurious trailing ‘%’ in format [-Wformat]
x86_64-pc-linux-gnu-gcc -I. -I../../../.ext/include/x86_64-linux -I../../.././include -I../../.././ext/-test-/method -DRUBY_EXTCONF_H=\"extconf.h\" -U_FORTIFY_SOURCE=2   -fPIC -march=corei7 -O2 -pipe -mtune=corei7 -Wno-format-security -fno-strict-aliasing -fPIC  -o arity.o -c arity.c
make[2]: *** [num2int.o] Error 1
make[2]: Leaving directory `/media/backup/portage_tmp/portage/dev-lang/ruby-2.0.0_p247-r1/work/ruby-2.0.0-p247/ext/-test-/num2int'
make[1]: *** [ext/-test-/num2int/all] Error 2
make[1]: *** Waiting for unfinished jobs....
/bin/mkdir -p ../../../.ext/x86_64-linux/-test-
exit > .RUBYARCHDIR.time
<command-line>:0:16: warning: extra tokens at end of #undef directive [enabled by default]
rm -f ../../../../.ext/x86_64-linux/-test-/marshal/usr.so
x86_64-pc-linux-gnu-gcc -shared -o ../../../../.ext/x86_64-linux/-test-/marshal/usr.so usrmarshal.o -L. -L../../../.. -L. -Wl,-O1 -Wl,--as-needed -rdynamic -Wl,-export-dynamic -Wl,--no-undefined    -lruby20  -lpthread -lrt -ldl -lcrypt -lm   -lc
make[2]: Leaving directory `/media/backup/portage_tmp/portage/dev-lang/ruby-2.0.0_p247-r1/work/ruby-2.0.0-p247/ext/-test-/marshal/compat'
make[2]: Leaving directory `/media/backup/portage_tmp/portage/dev-lang/ruby-2.0.0_p247-r1/work/ruby-2.0.0-p247/ext/-test-/marshal/usr'
rm -f ../../../.ext/x86_64-linux/-test-/method.so
x86_64-pc-linux-gnu-gcc -shared -o ../../../.ext/x86_64-linux/-test-/method.so init.o arity.o -L. -L../../.. -L. -Wl,-O1 -Wl,--as-needed -rdynamic -Wl,-export-dynamic -Wl,--no-undefined    -lruby20  -lpthread -lrt -ldl -lcrypt -lm   -lc
make[2]: Leaving directory `/media/backup/portage_tmp/portage/dev-lang/ruby-2.0.0_p247-r1/work/ruby-2.0.0-p247/ext/-test-/method'
make[1]: Leaving directory `/media/backup/portage_tmp/portage/dev-lang/ruby-2.0.0_p247-r1/work/ruby-2.0.0-p247'
make: *** [build-ext] Error 2
 * ERROR: dev-lang/ruby-2.0.0_p247-r1::gentoo failed (compile phase):
 *   emake failed
 *
 * If you need support, post the output of `emerge --info '=dev-lang/ruby-2.0.0_p247-r1::gentoo'`,
 * the complete build log and the output of `emerge -pqv '=dev-lang/ruby-2.0.0_p247-r1::gentoo'`.
 * The complete build log is located at '/media/backup/portage_tmp/portage/dev-lang/ruby-2.0.0_p247-r1/temp/build.log'.
 * The ebuild environment file is located at '/media/backup/portage_tmp/portage/dev-lang/ruby-2.0.0_p247-r1/temp/environment'.
 * Working directory: '/media/backup/portage_tmp/portage/dev-lang/ruby-2.0.0_p247-r1/work/ruby-2.0.0-p247'
 * S: '/media/backup/portage_tmp/portage/dev-lang/ruby-2.0.0_p247-r1/work/ruby-2.0.0-p247'

 * Messages for package dev-lang/ruby-2.0.0_p247-r1:

 * ERROR: dev-lang/ruby-2.0.0_p247-r1::gentoo failed (compile phase):
 *   emake failed
 *
 * If you need support, post the output of `emerge --info '=dev-lang/ruby-2.0.0_p247-r1::gentoo'`,
 * the complete build log and the output of `emerge -pqv '=dev-lang/ruby-2.0.0_p247-r1::gentoo'`.
 * The complete build log is located at '/media/backup/portage_tmp/portage/dev-lang/ruby-2.0.0_p247-r1/temp/build.log'.
 * The ebuild environment file is located at '/media/backup/portage_tmp/portage/dev-lang/ruby-2.0.0_p247-r1/temp/environment'.
 * Working directory: '/media/backup/portage_tmp/portage/dev-lang/ruby-2.0.0_p247-r1/work/ruby-2.0.0-p247'
 * S: '/media/backup/portage_tmp/portage/dev-lang/ruby-2.0.0_p247-r1/work/ruby-2.0.0-p247'

http://bpaste.net/show/131266/


Code:

 emerge --info
Portage 2.2.2 (default/linux/amd64/13.0/desktop, gcc-4.7.3, glibc-2.17, 3.9.4-gentoo x86_64)
=================================================================
System uname: Linux-3.9.4-gentoo-x86_64-Intel-R-_Core-TM-_i7_CPU_870_@_2.93GHz-with-gentoo-2.2
KiB Mem:     8172988 total,   1925120 free
KiB Swap:          0 total,         0 free
Timestamp of tree: Tue, 10 Sep 2013 19:00:01 +0000
ld GNU ld (GNU Binutils) 2.23.1
ccache version 3.1.9 [disabled]
app-shells/bash:          4.2_p45
dev-java/java-config:     2.2.0
dev-lang/python:          2.7.5-r2, 3.2.5-r2, 3.3.2-r2
dev-util/ccache:          3.1.9
dev-util/cmake:           2.8.11.1
dev-util/pkgconfig:       0.28
sys-apps/baselayout:      2.2
sys-apps/openrc:          0.12
sys-apps/sandbox:         2.6-r1
sys-devel/autoconf:       2.13::<unknown repository>, 2.69
sys-devel/automake:       1.11.6, 1.12.6, 1.14
sys-devel/binutils:       2.23.1
sys-devel/gcc:            4.7.3
sys-devel/gcc-config:     1.8
sys-devel/libtool:        2.4.2
sys-devel/make:           3.82-r4
sys-kernel/linux-headers: 3.11 (virtual/os-headers)
sys-libs/glibc:           2.17
Repositories: gentoo local
Installed sets: @system
ACCEPT_KEYWORDS="amd64 ~amd64"
ACCEPT_LICENSE="* -@EULA"
CBUILD="x86_64-pc-linux-gnu"
CFLAGS="-march=corei7 -O2 -pipe -mtune=corei7 -Wno-format-security"
CHOST="x86_64-pc-linux-gnu"
CONFIG_PROTECT="/etc /usr/share/gnupg/qualified.txt /var/lib/hsqldb"
CONFIG_PROTECT_MASK="/etc/ca-certificates.conf /etc/dconf /etc/env.d /etc/fonts/fonts.conf /etc/gconf /etc/gentoo-release /etc/revdep-rebuild /etc/sandbox.d /etc/splash /etc/terminfo /etc/texmf/language.dat.d /etc/texmf/language.def.d /etc/texmf/updmap.d /etc/texmf/web2c"
CPPFLAGS="-U_FORTIFY_SOURCE=2"
CXXFLAGS="-march=corei7 -O2 -pipe -mtune=corei7 -Wno-format-security"
DISTDIR="/usr/portage/distfiles"
EMERGE_DEFAULT_OPTS="--jobs=4"
FCFLAGS="-O2 -pipe"
FEATURES="assume-digests binpkg-logs config-protect-if-modified distlocks ebuild-locks fixlafiles merge-sync metadata-transfer news parallel-fetch preserve-libs protect-owned sfperms strict unknown-features-warn unmerge-logs unmerge-orphans userfetch userpriv usersandbox usersync"
FFLAGS="-O2 -pipe"
GENTOO_MIRRORS=" ftp://ftp.wh2.tu-dresden.de/pub/mirrors/gentoo http://mirror.switch.ch/mirror/gentoo/ ftp://mirror.switch.ch/mirror/gentoo/ ftp://ftp.solnet.ch/mirror/Gentoo http://www.mirror.ac.uk/mirror/www.ibiblio.org/"
LANG="en_GB.UTF-8"
LC_ALL="en_GB.UTF-8"
LDFLAGS="-Wl,-O1 -Wl,--as-needed"
MAKEOPTS="-j4 -l4"
PKGDIR="/usr/portage/packages"
PORTAGE_CONFIGROOT="/"
PORTAGE_RSYNC_OPTS="--recursive --links --safe-links --perms --times --omit-dir-times --compress --force --whole-file --delete --stats --human-readable --timeout=180 --exclude=/distfiles --exclude=/local --exclude=/packages"
PORTAGE_TMPDIR="/media/backup/portage_tmp"
PORTDIR="/usr/portage"
PORTDIR_OVERLAY="/usr/local/portage"
SYNC="rsync://192.168.0.2/gentoo-portage"
USE="X a52 aac acl acpi aiglx alsa amd64 bash-completion berkdb bluetooth branding bzip2 cairo cdda cdr cleartype cli consolekit corefonts cracklib crypt cups cxx dbus dri dts dvd dvdr emboss encode evdev exif fam flac fortran gdbm gif gpm gstreamer gtk gtk2 gtk3 iconv imlib introspection ipv6 java jpeg lcms libnotify mad mmx mng modules mp3 mp4 mpeg mudflap multilib ncurses nls nptl nptlonly nsplugin ogg opengl openmp oss pam pango pcre pdf pgo png policykit ppds pulseaudio python readline samba sdl session smbclient spell sse sse2 ssl startup-notification svg tcpd threads tiff truetype type1 udev udisks unicode upower usb vorbis wxwidgets x264 xcb xml xulrunner xv xvid zlib" ABI_X86="64 32" ALSA_CARDS="cmipci hda-intel" APACHE2_MODULES="authn_core authz_core socache_shmcb unixd actions alias auth_basic authn_alias authn_anon authn_dbm authn_default authn_file authz_dbm authz_default authz_groupfile authz_host authz_owner authz_user autoindex cache cgi cgid dav dav_fs dav_lock deflate dir disk_cache env expires ext_filter file_cache filter headers include info log_config logio mem_cache mime mime_magic negotiation rewrite setenvif speling status unique_id userdir usertrack vhost_alias" CALLIGRA_FEATURES="kexi words flow plan sheets stage tables krita karbon braindump author" CAMERAS="ptp2" COLLECTD_PLUGINS="df interface irq load memory rrdtool swap syslog" ELIBC="glibc" GPSD_PROTOCOLS="ashtech aivdm earthmate evermore fv18 garmin garmintxt gpsclock itrax mtk3301 nmea ntrip navcom oceanserver oldstyle oncore rtcm104v2 rtcm104v3 sirf superstar2 timing tsip tripmate tnt ubx" GRUB_PLATFORMS="pc" INPUT_DEVICES="keyboard mouse evdev" KERNEL="linux" LCD_DEVICES="bayrad cfontz cfontz633 glk hd44780 lb216 lcdm001 mtxorb ncurses text" LIBREOFFICE_EXTENSIONS="presenter-console presenter-minimizer" LINGUAS="en_GB en uk" OFFICE_IMPLEMENTATION="libreoffice" PHP_TARGETS="php5-5" PYTHON_SINGLE_TARGET="python2_7" PYTHON_TARGETS="python2_7 python3_2" RUBY_TARGETS="ruby18 ruby19 ruby20" USERLAND="GNU" VIDEO_CARDS="nv nvidia vesa" XTABLES_ADDONS="quota2 psd pknock lscan length2 ipv4options ipset ipp2p iface geoip fuzzy condition tee tarpit sysrq steal rawnat logmark ipmark dhcpmac delude chaos account"
Unset:  CTARGET, INSTALL_MASK, PORTAGE_BUNZIP2_COMMAND, PORTAGE_COMPRESS, PORTAGE_COMPRESS_FLAGS, PORTAGE_RSYNC_EXTRA_OPTS, USE_PYTHON




any ideas?
_________________
A free press is the unsleeping guardian of every other right that free men prize; it is the most dangerous foe of tyranny. Where men have the habit of liberty, the Press will continue to be the vigilant guardian of the rights of the ordinary citizen.
Back to top
View user's profile Send private message
eyoung100
Veteran
Veteran


Joined: 23 Jan 2004
Posts: 1411

PostPosted: Wed Sep 11, 2013 3:41 pm    Post subject: Reply with quote

Try Reporting a bug at:Ruby Issue Tracker, so they can attach your duplicate bug to the real one. I searched and couldnt find the bug, but Googling reported Ruby Discussion, which pointed to this: Feature 6265

Out of curiousity, why are you Sync'ing to a Private IP Address??
Code:
SYNC="rsync://192.168.0.2/gentoo-portage"

_________________
The Birth and Growth of Science is the Death and Atrophy of Art -- Unknown
Registerd Linux User #363735
Adopt a Post | Strip Comments| Emerge Wrapper
Back to top
View user's profile Send private message
Naib
Advocate
Advocate


Joined: 21 May 2004
Posts: 4109
Location: Removed by Neddy

PostPosted: Mon Sep 16, 2013 10:56 pm    Post subject: Reply with quote

mmm ok,

im syncing to a private IP because I have a number of gentoo boxes in my house. Once machine sync's from gentoo and the others from that one machine
_________________
A free press is the unsleeping guardian of every other right that free men prize; it is the most dangerous foe of tyranny. Where men have the habit of liberty, the Press will continue to be the vigilant guardian of the rights of the ordinary citizen.
Back to top
View user's profile Send private message
Naib
Advocate
Advocate


Joined: 21 May 2004
Posts: 4109
Location: Removed by Neddy

PostPosted: Sun Oct 13, 2013 6:40 pm    Post subject: Reply with quote

still doesn't explain why a broken program (if it is the program) is not masked and in fact forced.

still not compiling btw
_________________
A free press is the unsleeping guardian of every other right that free men prize; it is the most dangerous foe of tyranny. Where men have the habit of liberty, the Press will continue to be the vigilant guardian of the rights of the ordinary citizen.
Back to top
View user's profile Send private message
Display posts from previous:   
Reply to topic    Gentoo Forums Forum Index Portage & Programming All times are GMT
Page 1 of 1

 
Jump to:  
You cannot post new topics in this forum
You cannot reply to topics in this forum
You cannot edit your posts in this forum
You cannot delete your posts in this forum
You cannot vote in polls in this forum