Gentoo Forums
Gentoo Forums
Gentoo Forums
Quick Search: in
app-emulation/vmware-modules-271.2 failed [solved]
View unanswered posts
View posts from last 24 hours

 
Reply to topic    Gentoo Forums Forum Index Portage & Programming
View previous topic :: View next topic  
Author Message
padoor
Advocate
Advocate


Joined: 30 Dec 2005
Posts: 3992
Location: india

PostPosted: Wed Jul 03, 2013 12:43 pm    Post subject: app-emulation/vmware-modules-271.2 failed [solved] Reply with quote

Code:
 CC [M]  /var/tmp/portage/app-emulation/vmware-modules-271.2/work/vmblock-only/linux/module.o
  CC [M]  /var/tmp/portage/app-emulation/vmware-modules-271.2/work/vmblock-only/linux/super.o
  CC [M]  /var/tmp/portage/app-emulation/vmware-modules-271.2/work/vmblock-only/linux/control.o
  CC [M]  /var/tmp/portage/app-emulation/vmware-modules-271.2/work/vmblock-only/linux/inode.o
/var/tmp/portage/app-emulation/vmware-modules-271.2/work/vmblock-only/linux/control.c: In function 'SetupProcDevice':
/var/tmp/portage/app-emulation/vmware-modules-271.2/work/vmblock-only/linux/control.c:211:4: error: implicit declaration of function 'create_proc_entry' [-Werror=implicit-function-declaration]
/var/tmp/portage/app-emulation/vmware-modules-271.2/work/vmblock-only/linux/control.c:211:21: warning: assignment makes pointer from integer without a cast [enabled by default]
/var/tmp/portage/app-emulation/vmware-modules-271.2/work/vmblock-only/linux/control.c:221:20: error: dereferencing pointer to incomplete type
/var/tmp/portage/app-emulation/vmware-modules-271.2/work/vmblock-only/linux/control.c: In function 'ExecuteBlockOp':
/var/tmp/portage/app-emulation/vmware-modules-271.2/work/vmblock-only/linux/control.c:285:9: warning: assignment from incompatible pointer type [enabled by default]
cc1: some warnings being treated as errors
make[3]: *** [/var/tmp/portage/app-emulation/vmware-modules-271.2/work/vmblock-only/linux/control.o] Error 1
make[3]: *** Waiting for unfinished jobs....
/var/tmp/portage/app-emulation/vmware-modules-271.2/work/vmblock-only/linux/inode.c:49:4: warning: initialization from incompatible pointer type [enabled by default]
/var/tmp/portage/app-emulation/vmware-modules-271.2/work/vmblock-only/linux/inode.c:49:4: warning: (near initialization for 'RootInodeOps.lookup') [enabled by default]
make[2]: *** [_module_/var/tmp/portage/app-emulation/vmware-modules-271.2/work/vmblock-only] Error 2
make[1]: *** [sub-make] Error 2
make[1]: Leaving directory `/usr/src/linux-3.10.0-gentoo'
make: *** [vmblock.ko] Error 2
 * ERROR: app-emulation/vmware-modules-271.2 failed (compile phase):
 *   emake failed
 *
 * If you need support, post the output of `emerge --info '=app-emulation/vmware-modules-271.2'`,
 * the complete build log and the output of `emerge -pqv '=app-emulation/vmware-modules-271.2'`.
 * The complete build log is located at '/var/tmp/portage/app-emulation/vmware-modules-271.2/temp/build.log'.
 * The ebuild environment file is located at '/var/tmp/portage/app-emulation/vmware-modules-271.2/temp/environment'.
 * Working directory: '/var/tmp/portage/app-emulation/vmware-modules-271.2/work/vmblock-only'
 * S: '/var/tmp/portage/app-emulation/vmware-modules-271.2/work'


Code:

tux ramaswamy # emerge --info '=app-emulation/vmware-modules-271.2'
Portage 2.1.12.2 (default/linux/amd64/13.0, gcc-4.6.3, glibc-2.15-r3, 3.10.0-gentoo x86_64)
=================================================================
                         System Settings
=================================================================
System uname: Linux-3.10.0-gentoo-x86_64-AMD_E1-1200_APU_with_Radeon-tm-_HD_Graphics-with-gentoo-2.2
KiB Mem:     3626344 total,   2650236 free
KiB Swap:          0 total,         0 free
Timestamp of tree: Wed, 03 Jul 2013 09:30:01 +0000
ld GNU ld (GNU Binutils) 2.22
app-shells/bash:          4.2_p45
dev-lang/python:          2.7.5, 3.2.3-r2
dev-util/cmake:           2.8.10.2-r2
dev-util/pkgconfig:       0.28
sys-apps/baselayout:      2.2
sys-apps/openrc:          0.11.8
sys-apps/sandbox:         2.6-r1
sys-devel/autoconf:       2.13, 2.69
sys-devel/automake:       1.11.6, 1.12.6
sys-devel/binutils:       2.22-r1
sys-devel/gcc:            4.5.4, 4.6.3
sys-devel/gcc-config:     1.7.3
sys-devel/libtool:        2.4-r1
sys-devel/make:           3.82-r4
sys-kernel/linux-headers: 3.7 (virtual/os-headers)
sys-libs/glibc:           2.15-r3
Repositories: gentoo
ACCEPT_KEYWORDS="amd64"
ACCEPT_LICENSE="* -@EULA"
CBUILD="x86_64-pc-linux-gnu"
CFLAGS="-march=k8 -O2 -pipe"
CHOST="x86_64-pc-linux-gnu"
CONFIG_PROTECT="/etc /usr/share/gnupg/qualified.txt"
CONFIG_PROTECT_MASK="/etc/ca-certificates.conf /etc/dconf /etc/env.d /etc/fonts/fonts.conf /etc/gconf /etc/gentoo-release /etc/revdep-rebuild /etc/sandbox.d /etc/terminfo"
CXXFLAGS="-march=k8 -O2 -pipe"
DISTDIR="/usr/portage/distfiles"
FCFLAGS="-O2 -pipe"
FEATURES="assume-digests binpkg-logs config-protect-if-modified distlocks ebuild-locks fixlafiles merge-sync news parallel-fetch preserve-libs protect-owned sandbox sfperms strict unknown-features-warn unmerge-logs unmerge-orphans userfetch"
FFLAGS="-O2 -pipe"
GENTOO_MIRRORS="http://distfiles.gentoo.org"
LDFLAGS="-Wl,-O1 -Wl,--as-needed"
MAKEOPTS="-j3"
PKGDIR="/usr/portage/packages"
PORTAGE_CONFIGROOT="/"
PORTAGE_RSYNC_OPTS="--recursive --links --safe-links --perms --times --compress --force --whole-file --delete --stats --human-readable --timeout=180 --exclude=/distfiles --exclude=/local --exclude=/packages"
PORTAGE_TMPDIR="/var/tmp"
PORTDIR="/usr/portage"
PORTDIR_OVERLAY=""
SYNC="rsync://rsync.gentoo.org/gentoo-portage"
USE="acl alsa amd64 berkdb bzip2 cdr cli cracklib crypt cxx dri dvd fortran gdbm gnome gpm iconv ipv6 mmx modules mudflap multilib ncurses nls nptl openmp pam pcre qt4 readline session sse sse2 ssl tcpd unicode zlib" ABI_X86="64" ALSA_CARDS="ali5451 als4000 atiixp atiixp-modem bt87x ca0106 cmipci emu10k1x ens1370 ens1371 es1938 es1968 fm801 hda-intel intel8x0 intel8x0m maestro3 trident usb-audio via82xx via82xx-modem ymfpci" APACHE2_MODULES="authn_core authz_core socache_shmcb unixd actions alias auth_basic authn_alias authn_anon authn_dbm authn_default authn_file authz_dbm authz_default authz_groupfile authz_host authz_owner authz_user autoindex cache cgi cgid dav dav_fs dav_lock deflate dir disk_cache env expires ext_filter file_cache filter headers include info log_config logio mem_cache mime mime_magic negotiation rewrite setenvif speling status unique_id userdir usertrack vhost_alias" CALLIGRA_FEATURES="kexi words flow plan sheets stage tables krita karbon braindump author" CAMERAS="ptp2" COLLECTD_PLUGINS="df interface irq load memory rrdtool swap syslog" ELIBC="glibc" GPSD_PROTOCOLS="ashtech aivdm earthmate evermore fv18 garmin garmintxt gpsclock itrax mtk3301 nmea ntrip navcom oceanserver oldstyle oncore rtcm104v2 rtcm104v3 sirf superstar2 timing tsip tripmate tnt ubx" INPUT_DEVICES="keyboard mouse evdev" KERNEL="linux" LCD_DEVICES="bayrad cfontz cfontz633 glk hd44780 lb216 lcdm001 mtxorb ncurses text" LIBREOFFICE_EXTENSIONS="presenter-console presenter-minimizer" OFFICE_IMPLEMENTATION="libreoffice" PHP_TARGETS="php5-3" PYTHON_SINGLE_TARGET="python2_7" PYTHON_TARGETS="python2_7 python3_2 pypy1_9 jython2_5" RUBY_TARGETS="ruby19 ruby18" USERLAND="GNU" VIDEO_CARDS="radeon vmware fglrx vesa" XTABLES_ADDONS="quota2 psd pknock lscan length2 ipv4options ipset ipp2p iface geoip fuzzy condition tee tarpit sysrq steal rawnat logmark ipmark dhcpmac delude chaos account"
Unset:  CPPFLAGS, CTARGET, EMERGE_DEFAULT_OPTS, INSTALL_MASK, LANG, LC_ALL, PORTAGE_BUNZIP2_COMMAND, PORTAGE_COMPRESS, PORTAGE_COMPRESS_FLAGS, PORTAGE_RSYNC_EXTRA_OPTS, USE_PYTHON

=================================================================
                        Package Settings
=================================================================

app-emulation/vmware-modules-271.2 was built with the following:
USE="(multilib) -pax_kernel" ABI_X86="64"

tux ramaswamy #


just upgraded kernel and vmware-modules dont compile.

old kernel is 3.9.6-gentoo
current kernel 3.10.0-gentoo
is it a use= error ?
_________________
reach out a little bit more to catch it (DON'T BELIEVE the advocate part under my user name)


Last edited by padoor on Mon Jul 22, 2013 6:11 am; edited 1 time in total
Back to top
View user's profile Send private message
pota
n00b
n00b


Joined: 25 Jan 2005
Posts: 22

PostPosted: Thu Jul 11, 2013 5:55 pm    Post subject: Reply with quote

http://pkgbuild.com/git/aur-mirror.git/tree/vmware-patch/vmblock-9.0.2-5.0.2-3.10.patch
http://pkgbuild.com/git/aur-mirror.git/tree/vmware-patch/vmnet-9.0.2-5.0.2-3.10.patch
Back to top
View user's profile Send private message
padoor
Advocate
Advocate


Joined: 30 Dec 2005
Posts: 3992
Location: india

PostPosted: Fri Jul 12, 2013 5:15 pm    Post subject: Reply with quote

thanks for the patches.
my vm starting complains vmmon is not found and cannot make monitor
after that only vmnet and vmlock comes in question.
yesterday here was a reinstallation of kernel 3.10.0
did not make any dfference in vmware-modules merge
i dont know how to apply the patches.
to kernel or vmware-modules ?
_________________
reach out a little bit more to catch it (DON'T BELIEVE the advocate part under my user name)
Back to top
View user's profile Send private message
regaleali
n00b
n00b


Joined: 14 Jan 2005
Posts: 31
Location: Switzerland

PostPosted: Thu Jul 18, 2013 10:19 pm    Post subject: Reply with quote

Maybe you've solved this problem in the meantime. Anyway, here's how I've applied the patches to vmware-modules-271.2, kernel gentoo-sources-3.10.1:

Copy http://pkgbuild.com/git/aur-mirror.git/tree/vmware-patch/vmblock-9.0.2-5.0.2-3.10.patch to /etc/portage/patches/app-emulation/vmware-modules/271-vmblock-only.patch

The second part of the patch is not required, so you need to delete it:

Edit /etc/portage/patches/app-emulation/vmware-modules/271-vmblock-only.patch

Remove anything below of and including the following line:

@@ -293,7 +294,7 @@

Copy http://pkgbuild.com/git/aur-mirror.git/tree/vmware-patch/vmnet-9.0.2-5.0.2-3.10.patch to /etc/portage/patches/app-emulation/vmware-modules/271-vmnet-only.patch

Run emerge vmware-modules again.
Back to top
View user's profile Send private message
padoor
Advocate
Advocate


Joined: 30 Dec 2005
Posts: 3992
Location: india

PostPosted: Mon Jul 22, 2013 6:11 am    Post subject: Reply with quote

yes regaleali

after i patch as you have done following the links given vmware-modules merged fine on my kernel-3.10.0
workstaion comes on correctly.

thanks for the help :)
_________________
reach out a little bit more to catch it (DON'T BELIEVE the advocate part under my user name)
Back to top
View user's profile Send private message
chias
n00b
n00b


Joined: 06 Nov 2009
Posts: 69
Location: everywhere

PostPosted: Mon Sep 09, 2013 9:07 pm    Post subject: Reply with quote

I get the same errors trying to compile vmware-modules-271.2 on gentoo-sources kernel 3.11.0, but those patches no longer exist and their nearest equivalents fail to patch
Back to top
View user's profile Send private message
pums974
n00b
n00b


Joined: 27 Feb 2010
Posts: 74

PostPosted: Tue Sep 10, 2013 6:04 am    Post subject: Reply with quote

Your can find your answer here.
Back to top
View user's profile Send private message
Display posts from previous:   
Reply to topic    Gentoo Forums Forum Index Portage & Programming All times are GMT
Page 1 of 1

 
Jump to:  
You cannot post new topics in this forum
You cannot reply to topics in this forum
You cannot edit your posts in this forum
You cannot delete your posts in this forum
You cannot vote in polls in this forum