Gentoo Forums
Gentoo Forums
Gentoo Forums
Quick Search: in
[SOLVED] Failed to emerge kde-base/kdelibs-4.10.2
View unanswered posts
View posts from last 24 hours

 
Reply to topic    Gentoo Forums Forum Index Desktop Environments
View previous topic :: View next topic  
Author Message
temporary_user
n00b
n00b


Joined: 26 Aug 2012
Posts: 37

PostPosted: Mon Apr 22, 2013 2:30 pm    Post subject: [SOLVED] Failed to emerge kde-base/kdelibs-4.10.2 Reply with quote

Hello!

I'm having troubles with emerging the latest KDE. The only error I can see is "emake failed".
Here's some more info:
emerge --info '=kde-base/kdelibs-4.10.2'
emerge -pqv '=kde-base/kdelibs-4.10.2'
build.log is super long, so I've just pasted end of it.

Can anyone tell me why does it happen? Also, if you need any additional info, just let me know.

Have a nice day!
temporary_user


Last edited by temporary_user on Mon Apr 22, 2013 7:40 pm; edited 1 time in total
Back to top
View user's profile Send private message
LukynZ
Apprentice
Apprentice


Joined: 19 Dec 2008
Posts: 225
Location: The Czech Republic

PostPosted: Mon Apr 22, 2013 2:49 pm    Post subject: Reply with quote

try -O2 instead of -O3
Back to top
View user's profile Send private message
temporary_user
n00b
n00b


Joined: 26 Aug 2012
Posts: 37

PostPosted: Mon Apr 22, 2013 3:19 pm    Post subject: Reply with quote

Nothing changed with -O2.
Back to top
View user's profile Send private message
VoidMage
Watchman
Watchman


Joined: 14 Oct 2006
Posts: 5652

PostPosted: Mon Apr 22, 2013 7:02 pm    Post subject: Reply with quote

temporary_user wrote:
build.log is super long, so I've just pasted end of it.


That snippet is useless, pastebin a bigger portion or search for the actual error.
Back to top
View user's profile Send private message
krinn
Advocate
Advocate


Joined: 02 May 2003
Posts: 4399

PostPosted: Mon Apr 22, 2013 7:14 pm    Post subject: Reply with quote

Like VoidMage said :
Quote:
make: *** [all] Error 2

So we miss the error 1, and what you see is just another job from the make file that was running until it could catch an error appears somewhere and bail out all jobs.
Back to top
View user's profile Send private message
temporary_user
n00b
n00b


Joined: 26 Aug 2012
Posts: 37

PostPosted: Mon Apr 22, 2013 7:25 pm    Post subject: Reply with quote

Ok, here it is - full build.log. I tried uploading it to pastebin, but the file is so big (~10MB), that my browser kept crashing.

EDIT:
Code:
Scanning dependencies of target kcolorutilsdemo
Could not find parser plugin for encoding trig
make[2]: *** [nepomuk/ndo.h] Error 1
make[2]: Leaving directory `/var/tmp/portage/kde-base/kdelibs-4.10.2/work/kdelibs-4.10.2_build'
make[1]: *** [nepomuk/CMakeFiles/nepomuk.dir/all] Error 2
make[1]: *** Waiting for unfinished jobs....


EDIT2:
Aaaand it's working! Found solution HERE, had to recompile 'raptor' package.
Thank you very much for your help.
Back to top
View user's profile Send private message
Display posts from previous:   
Reply to topic    Gentoo Forums Forum Index Desktop Environments All times are GMT
Page 1 of 1

 
Jump to:  
You cannot post new topics in this forum
You cannot reply to topics in this forum
You cannot edit your posts in this forum
You cannot delete your posts in this forum
You cannot vote in polls in this forum