Gentoo Forums
Gentoo Forums
Gentoo Forums
Quick Search: in
Chromium compilation problem
View unanswered posts
View posts from last 24 hours

 
Reply to topic    Gentoo Forums Forum Index Multimedia
View previous topic :: View next topic  
Author Message
finarfin
n00b
n00b


Joined: 20 Sep 2011
Posts: 62

PostPosted: Sun Feb 24, 2013 12:08 am    Post subject: Chromium compilation problem Reply with quote

Hi all,

after last update, chromium failed to compile. With following message error:

Code:

third_party/smhasher/src/City.cpp: In function âvoid CityHashCrc256Long(const char*, size_t, uint32, uint64*)â:
third_party/smhasher/src/City.cpp:393:5: error: â_mm_crc32_u64â was not declared in this scope
third_party/smhasher/src/City.cpp:399:5: error: â_mm_crc32_u64â was not declared in this scope
third_party/smhasher/src/City.cpp:404:5: error: â_mm_crc32_u64â was not declared in this scope
make: *** [out/Release/obj.target/cityhash/third_party/smhasher/src/City.o] Error 1
make: *** Waiting for unfinished jobs....
 * ERROR: www-client/chromium-26.0.1410.5 failed (compile phase):
 *   emake failed
 *
 * If you need support, post the output of `emerge --info '=www-client/chromium-26.0.1410.5'`,
 * the complete build log and the output of `emerge -pqv '=www-client/chromium-26.0.1410.5'`.
 * The complete build log is located at '/var/tmp/portage/www-client/chromium-26.0.1410.5/temp/build.log'.
 * The ebuild environment file is located at '/var/tmp/portage/www-client/chromium-26.0.1410.5/temp/environment'.
 * Working directory: '/var/tmp/portage/www-client/chromium-26.0.1410.5/work/chromium-26.0.1410.5'



This happen with the version above (that i have unmasked trying to solve the problem, but also with version: 25.0.1364.97

I tried to unmerge and emerg it again.

I launched revdep-rebuild.

Any idea on how to solve that problem?

Ivan
_________________
printf("hello world")
Back to top
View user's profile Send private message
Pol
Tux's lil' helper
Tux's lil' helper


Joined: 01 May 2003
Posts: 111

PostPosted: Sun Feb 24, 2013 9:54 am    Post subject: Reply with quote

Same here
Back to top
View user's profile Send private message
phajdan.jr
Developer
Developer


Joined: 23 Mar 2006
Posts: 1767
Location: Poland

PostPosted: Mon Feb 25, 2013 4:36 am    Post subject: Reply with quote

Please file a bug, with full build log and emerge --info.
_________________
http://phajdan-jr.blogspot.com/
Back to top
View user's profile Send private message
javamonkey
n00b
n00b


Joined: 28 Oct 2003
Posts: 25
Location: Porto - Portugal

PostPosted: Mon Feb 25, 2013 10:12 am    Post subject: Reply with quote

I have the same problem.

Created issue https://bugs.gentoo.org/show_bug.cgi?id=459126
Back to top
View user's profile Send private message
javamonkey
n00b
n00b


Joined: 28 Oct 2003
Posts: 25
Location: Porto - Portugal

PostPosted: Mon Feb 25, 2013 11:31 am    Post subject: Reply with quote

It seems that changing my CFLAGS from -march=native to -march=core2 makes the build go past the failuer point, will post back if it finishes.
Back to top
View user's profile Send private message
javamonkey
n00b
n00b


Joined: 28 Oct 2003
Posts: 25
Location: Porto - Portugal

PostPosted: Mon Feb 25, 2013 12:40 pm    Post subject: Reply with quote

It works.

For me, changing my CFLAGS from -march=native to -march=core2 solves the problem.
Back to top
View user's profile Send private message
Featherfoot
l33t
l33t


Joined: 28 Dec 2002
Posts: 656
Location: Stuart, Florida

PostPosted: Wed Feb 27, 2013 12:59 am    Post subject: Reply with quote

I have the same problem on an amd64 system.
Back to top
View user's profile Send private message
Q-collective
Advocate
Advocate


Joined: 22 Mar 2004
Posts: 2056

PostPosted: Wed Feb 27, 2013 5:00 pm    Post subject: Reply with quote

I can confirm the issue both with versions 26.0.1410.5 and 26.0.1410.12.

Currently recompiling 25.0.1364.97 to have a working install again.
Back to top
View user's profile Send private message
Display posts from previous:   
Reply to topic    Gentoo Forums Forum Index Multimedia All times are GMT
Page 1 of 1

 
Jump to:  
You cannot post new topics in this forum
You cannot reply to topics in this forum
You cannot edit your posts in this forum
You cannot delete your posts in this forum
You cannot vote in polls in this forum