Gentoo Forums
Gentoo Forums
Gentoo Forums
Quick Search: in
kde-base/kdelibs-3.5.10-r10 ipp.h:365:16 error
View unanswered posts
View posts from last 24 hours

 
Reply to topic    Gentoo Forums Forum Index Unsupported Software
View previous topic :: View next topic  
Author Message
padoor
Advocate
Advocate


Joined: 30 Dec 2005
Posts: 4055
Location: india

PostPosted: Sat Sep 01, 2012 5:11 pm    Post subject: kde-base/kdelibs-3.5.10-r10 ipp.h:365:16 error Reply with quote

Code:
-DHAVE_CONFIG_H -I. -I. -I../../.. -I../../../dcop -I../../../kdecore -I../../../kio/kssl -I../../../kjs -I../../.. -I../../../kio -I../../../kfile -I../../../dcop -I../../../libltdl -I../../../kdefx -I../../../kdecore -I../../../kdecore -I../../../kdecore/network -I../../../kdeui -I../../../kio -I../../../kio/kio -I../../../kio/kfile -I../../.. -I/usr/qt/3/include -I. -I/usr/kde/3.5/include   -DQT_THREAD_SUPPORT  -D_REENTRANT  -Wno-long-long -Wundef -ansi -D_XOPEN_SOURCE=500 -D_BSD_SOURCE -Wcast-align -Wchar-subscripts -Wall -W -Wpointer-arith -DNDEBUG -DNO_DEBUG -O2 -O2 -march=i686 -pipe -Wformat-security -Wmissing-format-attribute -Wno-non-virtual-dtor -fno-exceptions -fno-check-new -fno-common  -DQT_CLEAN_NAMESPACE -DQT_NO_ASCII_CAST -DQT_NO_STL -DQT_NO_COMPAT -DQT_NO_TRANSLATION  -c -o cupsdsplash.lo cupsdsplash.cpp
cupsdconf.cpp: In member function 'bool CupsdConf::loadAvailableResources()':
cupsdconf.cpp:632:10: error: invalid use of incomplete type 'struct ipp_t'
/usr/include/cups/ipp.h:365:16: error: forward declaration of 'struct ipp_t'
cupsdconf.cpp:638:35: error: invalid use of incomplete type 'struct ipp_t'
/usr/include/cups/ipp.h:365:16: error: forward declaration of 'struct ipp_t'
cupsdconf.cpp:642:13: error: invalid use of incomplete type 'struct ipp_attribute_t'
/usr/include/cups/ipp.h:366:16: error: forward declaration of 'struct ipp_attribute_t'
cupsdconf.cpp:649:24: error: invalid use of incomplete type 'struct ipp_attribute_t'
/usr/include/cups/ipp.h:366:16: error: forward declaration of 'struct ipp_attribute_t'
cupsdconf.cpp:649:65: error: invalid use of incomplete type 'struct ipp_attribute_t'
/usr/include/cups/ipp.h:366:16: error: forward declaration of 'struct ipp_attribute_t'
cupsdconf.cpp:650:24: error: invalid use of incomplete type 'struct ipp_attribute_t'
/usr/include/cups/ipp.h:366:16: error: forward declaration of 'struct ipp_attribute_t'
cupsdconf.cpp:650:65: error: invalid use of incomplete type 'struct ipp_attribute_t'
/usr/include/cups/ipp.h:366:16: error: forward declaration of 'struct ipp_attribute_t'
cupsdconf.cpp:651:15: error: invalid use of incomplete type 'struct ipp_attribute_t'
/usr/include/cups/ipp.h:366:16: error: forward declaration of 'struct ipp_attribute_t'
cupsdconf.cpp:661:10: error: invalid use of incomplete type 'struct ipp_t'
/usr/include/cups/ipp.h:365:16: error: forward declaration of 'struct ipp_t'
cupsdconf.cpp:667:35: error: invalid use of incomplete type 'struct ipp_t'
/usr/include/cups/ipp.h:365:16: error: forward declaration of 'struct ipp_t'
cupsdconf.cpp:671:13: error: invalid use of incomplete type 'struct ipp_attribute_t'
/usr/include/cups/ipp.h:366:16: error: forward declaration of 'struct ipp_attribute_t'
cupsdconf.cpp:678:24: error: invalid use of incomplete type 'struct ipp_attribute_t'
/usr/include/cups/ipp.h:366:16: error: forward declaration of 'struct ipp_attribute_t'
cupsdconf.cpp:678:65: error: invalid use of incomplete type 'struct ipp_attribute_t'
/usr/include/cups/ipp.h:366:16: error: forward declaration of 'struct ipp_attribute_t'
cupsdconf.cpp:679:24: error: invalid use of incomplete type 'struct ipp_attribute_t'
/usr/include/cups/ipp.h:366:16: error: forward declaration of 'struct ipp_attribute_t'
cupsdconf.cpp:679:65: error: invalid use of incomplete type 'struct ipp_attribute_t'
/usr/include/cups/ipp.h:366:16: error: forward declaration of 'struct ipp_attribute_t'
cupsdconf.cpp:680:15: error: invalid use of incomplete type 'struct ipp_attribute_t'
/usr/include/cups/ipp.h:366:16: error: forward declaration of 'struct ipp_attribute_t'
make[4]: *** [cupsdconf.lo] Error 1
make[4]: *** Waiting for unfinished jobs....
make[4]: Leaving directory `/var/tmp/portage/kde-base/kdelibs-3.5.10-r10/work/kdelibs-3.5.10/kdeprint/cups/cupsdconf2'
make[3]: *** [all-recursive] Error 1
make[3]: Leaving directory `/var/tmp/portage/kde-base/kdelibs-3.5.10-r10/work/kdelibs-3.5.10/kdeprint/cups'
make[2]: *** [all-recursive] Error 1
make[2]: Leaving directory `/var/tmp/portage/kde-base/kdelibs-3.5.10-r10/work/kdelibs-3.5.10/kdeprint'
make[1]: *** [all-recursive] Error 1
make[1]: Leaving directory `/var/tmp/portage/kde-base/kdelibs-3.5.10-r10/work/kdelibs-3.5.10'
make: *** [all] Error 2
emake failed
 * ERROR: kde-base/kdelibs-3.5.10-r10 failed (compile phase):
 *   died running emake, kde_src_compile:make
 *
 * Call stack:
 *     ebuild.sh, line   85:  Called src_compile
 *   environment, line 4567:  Called kde_src_compile


this reinstall of kdelibs:3.5 fails with ipp error[needed by world update]
do i merge sci-libs/ipp ?
this much it did after downgrading libpcre to 7.9-r1
_________________
reach out a little bit more to catch it (DON'T BELIEVE the advocate part under my user name)
Back to top
View user's profile Send private message
Display posts from previous:   
Reply to topic    Gentoo Forums Forum Index Unsupported Software All times are GMT
Page 1 of 1

 
Jump to:  
You cannot post new topics in this forum
You cannot reply to topics in this forum
You cannot edit your posts in this forum
You cannot delete your posts in this forum
You cannot vote in polls in this forum