Gentoo Forums
Gentoo Forums
Gentoo Forums
Quick Search: in
gst-python-0.10.21 don't emerge
View unanswered posts
View posts from last 24 hours

 
Reply to topic    Gentoo Forums Forum Index Installing Gentoo
View previous topic :: View next topic  
Author Message
Yczo
Tux's lil' helper
Tux's lil' helper


Joined: 09 Jul 2011
Posts: 145

PostPosted: Wed Aug 15, 2012 9:52 pm    Post subject: gst-python-0.10.21 don't emerge Reply with quote

I solved it installing the gst-python-0.10.22 version.

The end of the build log for 0.10.21 version is

Making install in extend
make[3]: se ingresa al directorio `/var/tmp/portage/dev-python/gst-python-0.10.21/work/gst-python-0.10.21-2.7/gst/extend'
make[4]: se ingresa al directorio `/var/tmp/portage/dev-python/gst-python-0.10.21/work/gst-python-0.10.21-2.7/gst/extend'
make[4]: No se hace nada para `install-exec-am'.
/bin/mkdir -p '/var/tmp/portage/dev-python/gst-python-0.10.21/image//usr/lib64/python2.7/site-packages/gst-0.10/gst/extend'
/usr/bin/install -c -m 644 __init__.py pygobject.py utils.py discoverer.py sources.py leveller.py jukebox.py '/var/tmp/portage/dev-python/gst-python-0.10.21/image//usr/lib64/python2.7/site-packages/gst-0.10/gst/extend'
../../py-compile: ../../py-compile: no se puede ejecutar el fichero binario
make[4]: *** [install-pygstPYTHON] Error 126
make[4]: se sale del directorio `/var/tmp/portage/dev-python/gst-python-0.10.21/work/gst-python-0.10.21-2.7/gst/extend'
make[3]: *** [install-am] Error 2
make[3]: se sale del directorio `/var/tmp/portage/dev-python/gst-python-0.10.21/work/gst-python-0.10.21-2.7/gst/extend'
make[2]: *** [install-recursive] Error 1
make[2]: se sale del directorio `/var/tmp/portage/dev-python/gst-python-0.10.21/work/gst-python-0.10.21-2.7/gst'
make[1]: *** [install-recursive] Error 1
make[1]: se sale del directorio `/var/tmp/portage/dev-python/gst-python-0.10.21/work/gst-python-0.10.21-2.7'
make: *** [install] Error 2
emake failed
* ERROR: dev-python/gst-python-0.10.21 failed (install phase):
* Installation failed with CPython 2.7 in python_default_function() function
*
* Call stack:
* ebuild.sh, line 85: Called src_install
* environment, line 5464: Called python_src_install
* environment, line 5401: Called python_execute_function '-d' '-s' '--'
* environment, line 3823: Called die
* The specific snippet of code:
* die "${failure_message}";
*
* If you need support, post the output of `emerge --info '=dev-python/gst-python-0.10.21'`,
* the complete build log and the output of `emerge -pqv '=dev-python/gst-python-0.10.21'`.
* The complete build log is located at '/var/tmp/portage/dev-python/gst-python-0.10.21/temp/build.log'.
* The ebuild environment file is located at '/var/tmp/portage/dev-python/gst-python-0.10.21/temp/environment'.
* Working directory: '/var/tmp/portage/dev-python/gst-python-0.10.21/work/gst-python-0.10.21-2.7'
* S: '/var/tmp/portage/dev-python/gst-python-0.10.21/work/gst-python-0.10.21'

>>> Failed to emerge dev-python/gst-python-0.10.21, Log file:

>>> '/var/tmp/portage/dev-python/gst-python-0.10.21/temp/build.log'

* Messages for package dev-python/gst-python-0.10.21:

* ERROR: dev-python/gst-python-0.10.21 failed (install phase):
* Installation failed with CPython 2.7 in python_default_function() function
*
* Call stack:
* ebuild.sh, line 85: Called src_install
* environment, line 5464: Called python_src_install
* environment, line 5401: Called python_execute_function '-d' '-s' '--'
* environment, line 3823: Called die
* The specific snippet of code:
* die "${failure_message}";
*
* If you need support, post the output of `emerge --info '=dev-python/gst-python-0.10.21'`,
* the complete build log and the output of `emerge -pqv '=dev-python/gst-python-0.10.21'`.
* The complete build log is located at '/var/tmp/portage/dev-python/gst-python-0.10.21/temp/build.log'.
* The ebuild environment file is located at '/var/tmp/portage/dev-python/gst-python-0.10.21/temp/environment'.
* Working directory: '/var/tmp/portage/dev-python/gst-python-0.10.21/work/gst-python-0.10.21-2.7'
* S: '/var/tmp/portage/dev-python/gst-python-0.10.21/work/gst-python-0.10.21'


[install-pygstPYTHON] Error 126 Again


Regards!
Back to top
View user's profile Send private message
witcxc
n00b
n00b


Joined: 10 Feb 2012
Posts: 4

PostPosted: Sun Aug 19, 2012 11:23 am    Post subject: Re: gst-python-0.10.21 don't emerge Reply with quote

Thanks, I solved it in this way too.
But as the gst-python-0.10.22 version is test yet,how to manage to install the 21 version?
Back to top
View user's profile Send private message
steak-sandwich
n00b
n00b


Joined: 27 Aug 2012
Posts: 21

PostPosted: Thu Aug 30, 2012 11:01 pm    Post subject: similar problem Reply with quote

Hi,
I'm having a similar problem. I didn't want to open a new thread because it concerns the same package. This is the output I'm getting when trying to emerge gst-python-0.10.21

Code:

 * Package:    dev-python/gst-python-0.10.21
 * Repository: gentoo
 * Maintainer: gstreamer@gentoo.org
 * USE:        amd64 elibc_glibc kernel_linux multilib userland_GNU
 * FEATURES:   sandbox
>>> Unpacking source...
>>> Unpacking gst-python-0.10.21.tar.bz2 to /var/tmp/portage/dev-python/gst-python-0.10.21/work
>>> Source unpacked in /var/tmp/portage/dev-python/gst-python-0.10.21/work
>>> Preparing source in /var/tmp/portage/dev-python/gst-python-0.10.21/work/gst-python-0.10.21 ...
 * Applying gst-python-0.10.9-lazy.patch ...
 [ ok ]
 * Running eautoreconf in '/var/tmp/portage/dev-python/gst-python-0.10.21/work/gst-python-0.10.21' ...
 * Running libtoolize --install --copy --force --automake ...
 [ ok ]
 * Running aclocal -I common/m4 -I m4 -I common/m4 ...
 [ ok ]
 * Running autoconf -I common/m4 ...
 [ ok ]
 * Running autoheader -I common/m4 ...
 [ ok ]
 * Running automake --add-missing --copy ...
 [ ok ]
 * Running elibtoolize in: gst-python-0.10.21/
 *   Applying portage/1.2.0 patch ...
 *   Applying sed/1.5.6 patch ...
 *   Applying as-needed/2.2.6 patch ...
>>> Source prepared.
>>> Configuring source in /var/tmp/portage/dev-python/gst-python-0.10.21/work/gst-python-0.10.21 ...
 * Configuration of dev-python/gst-python-0.10.21 with CPython 2.7...
 * econf: updating gst-python-0.10.21/config.guess with /usr/share/gnuconfig/config.guess
 * econf: updating gst-python-0.10.21/config.sub with /usr/share/gnuconfig/config.sub
 * econf: updating gst-python-0.10.21-2.7/config.guess with /usr/share/gnuconfig/config.guess
 * econf: updating gst-python-0.10.21-2.7/config.sub with /usr/share/gnuconfig/config.sub
./configure --prefix=/usr --build=x86_64-pc-linux-gnu --host=x86_64-pc-linux-gnu --mandir=/usr/share/man --infodir=/usr/share/info --datadir=/usr/share --sysconfdir=/etc --localstatedir=/var/lib --libdir=/usr/lib64
checking for a BSD-compatible install... /usr/bin/install -c
checking whether build environment is sane... yes
checking for a thread-safe mkdir -p... /bin/mkdir -p
checking for gawk... gawk
checking whether make sets $(MAKE)... yes
checking nano version... 0 (release)
checking whether to enable maintainer-specific portions of Makefiles... no
checking whether make supports nested variables... yes
checking build system type... x86_64-pc-linux-gnu
checking host system type... x86_64-pc-linux-gnu
checking how to print strings... printf
checking for style of include used by make... GNU
checking for x86_64-pc-linux-gnu-gcc... x86_64-pc-linux-gnu-gcc
checking whether the C compiler works... yes
checking for C compiler default output file name... a.out
checking for suffix of executables...
checking whether we are cross compiling... no
checking for suffix of object files... o
checking whether we are using the GNU C compiler... yes
checking whether x86_64-pc-linux-gnu-gcc accepts -g... yes
checking for x86_64-pc-linux-gnu-gcc option to accept ISO C89... none needed
checking dependency style of x86_64-pc-linux-gnu-gcc... gcc3
checking for a sed that does not truncate output... /bin/sed
checking for grep that handles long lines and -e... /bin/grep
checking for egrep... /bin/grep -E
checking for fgrep... /bin/grep -F
checking for ld used by x86_64-pc-linux-gnu-gcc... /usr/x86_64-pc-linux-gnu/bin/ld
checking if the linker (/usr/x86_64-pc-linux-gnu/bin/ld) is GNU ld... yes
checking for BSD- or MS-compatible name lister (nm)... /usr/bin/nm -B
checking the name lister (/usr/bin/nm -B) interface... BSD nm
checking whether ln -s works... yes
checking the maximum length of command line arguments... 1572864
checking whether the shell understands some XSI constructs... yes
checking whether the shell understands "+="... yes
checking how to convert x86_64-pc-linux-gnu file names to x86_64-pc-linux-gnu format... func_convert_file_noop
checking how to convert x86_64-pc-linux-gnu file names to toolchain format... func_convert_file_noop
checking for /usr/x86_64-pc-linux-gnu/bin/ld option to reload object files... -r
checking for x86_64-pc-linux-gnu-objdump... objdump
checking how to recognize dependent libraries... pass_all
checking for x86_64-pc-linux-gnu-dlltool... dlltool
checking how to associate runtime and link libraries... printf %s\n
checking for x86_64-pc-linux-gnu-ar... x86_64-pc-linux-gnu-ar
checking for archiver @FILE support... @
checking for x86_64-pc-linux-gnu-strip... x86_64-pc-linux-gnu-strip
checking for x86_64-pc-linux-gnu-ranlib... x86_64-pc-linux-gnu-ranlib
checking command to parse /usr/bin/nm -B output from x86_64-pc-linux-gnu-gcc object... ok
checking for sysroot... no
checking for x86_64-pc-linux-gnu-mt... no
checking for mt... no
checking if : is a manifest tool... no
checking how to run the C preprocessor... x86_64-pc-linux-gnu-gcc -E
checking for ANSI C header files... yes
checking for sys/types.h... yes
checking for sys/stat.h... yes
checking for stdlib.h... yes
checking for string.h... yes
checking for memory.h... yes
checking for strings.h... yes
checking for inttypes.h... yes
checking for stdint.h... yes
checking for unistd.h... yes
checking for dlfcn.h... yes
checking for objdir... .libs
checking if x86_64-pc-linux-gnu-gcc supports -fno-rtti -fno-exceptions... no
checking for x86_64-pc-linux-gnu-gcc option to produce PIC... -fPIC -DPIC
checking if x86_64-pc-linux-gnu-gcc PIC flag -fPIC -DPIC works... yes
checking if x86_64-pc-linux-gnu-gcc static flag -static works... yes
checking if x86_64-pc-linux-gnu-gcc supports -c -o file.o... yes
checking if x86_64-pc-linux-gnu-gcc supports -c -o file.o... (cached) yes
checking whether the x86_64-pc-linux-gnu-gcc linker (/usr/x86_64-pc-linux-gnu/bin/ld -m elf_x86_64) supports shared libraries... yes
checking whether -lc should be explicitly linked in... no
checking dynamic linker characteristics... GNU/Linux ld.so
checking how to hardcode library paths into programs... immediate
checking whether stripping libraries is possible... yes
checking if libtool supports shared libraries... yes
checking whether to build shared libraries... yes
checking whether to build static libraries... no
checking for x86_64-pc-linux-gnu-gcc... (cached) x86_64-pc-linux-gnu-gcc
checking whether we are using the GNU C compiler... (cached) yes
checking whether x86_64-pc-linux-gnu-gcc accepts -g... (cached) yes
checking for x86_64-pc-linux-gnu-gcc option to accept ISO C89... (cached) none needed
checking dependency style of x86_64-pc-linux-gnu-gcc... (cached) gcc3
checking for x86_64-pc-linux-gnu-gcc option to accept ISO C99... -std=gnu99
checking for x86_64-pc-linux-gnu-gcc -std=gnu99 option to accept ISO Standard C... (cached) -std=gnu99
checking whether x86_64-pc-linux-gnu-gcc -std=gnu99 and cc understand -c and -o together... yes
checking for python... /usr/bin/python
checking for python version... 2.7
checking for python platform... linux2
checking for python script directory... ${prefix}/lib64/python2.7/site-packages
checking for python extension module directory... ${exec_prefix}/lib64/python2.7/site-packages
checking for python >= 2.3... okay
checking for headers required to compile python extensions... found
checking for x86_64-pc-linux-gnu-pkg-config... no
checking for pkg-config... /usr/bin/pkg-config
checking pkg-config is at least version 0.9.0... yes
checking for GST... yes
Building against GStreamer core 0.10.35 , ignoring API additions if needed
checking for GST_BASE... yes
checking for GST_CONTROLLER... yes
checking for GST_NET... yes
checking for GST_DP... yes
checking for GST_PLUGINS_BASE... yes
checking for PYGOBJECT... yes
yes
checking for PYGOBJECT_2_12... yes
yes
checking for PYGOBJECT_2_16... yes
yes
checking to see if compiler understands -Wall... yes
checking to see if compiler understands -Wdeclaration-after-statement... yes
checking to see if compiler understands -Wvla... yes
checking to see if compiler understands -Wpointer-arith... yes
configure: set WARNING_CFLAGS to  -Wall -Wdeclaration-after-statement -Wvla -Wpointer-arith
configure: set ERROR_CFLAGS to
checking for valgrind... no
checking for libraries required to embed python... yes
configure: Using /usr/lib64/gstreamer-0.10 as the plugin install location
checking whether /usr/x86_64-pc-linux-gnu/bin/ld -m elf_x86_64 accepts -z,lazy... yes
configure: creating ./config.status
config.status: creating Makefile
config.status: creating codegen/Makefile
config.status: creating common/Makefile
config.status: creating common/m4/Makefile
config.status: creating gst/Makefile
config.status: creating gst/gstversion.override
config.status: creating gst/extend/Makefile
config.status: creating examples/Makefile
config.status: creating pkgconfig/Makefile
config.status: creating pkgconfig/gst-python.pc
config.status: WARNING:  'pkgconfig/gst-python.pc.in' seems to ignore the --datarootdir setting
config.status: creating pkgconfig/gst-python-uninstalled.pc
config.status: creating plugin/Makefile
config.status: creating testsuite/Makefile
config.status: creating win32/common/config.h
config.status: creating gst-python.spec
config.status: creating gst/__init__.py
config.status: creating config.h
config.status: executing depfiles commands
config.status: executing libtool commands
>>> Source configured.
>>> Compiling source in /var/tmp/portage/dev-python/gst-python-0.10.21/work/gst-python-0.10.21 ...
 * Building of dev-python/gst-python-0.10.21 with CPython 2.7...
make -j5
if test -f pygst.py; then chmod +w pygst.py; fi
sed -e "s|@PYGSTDIR\@|/var/tmp/portage/dev-python/gst-python-0.10.21/work/gst-python-0.10.21-2.7|g" \
    -e "s|@GST_MAJORMINOR\@|0.10|g" \
    pygst.py.in > pygst.py
chmod -w pygst.py
make  all-recursive
make[1]: Entering directory `/var/tmp/portage/dev-python/gst-python-0.10.21/work/gst-python-0.10.21-2.7'
Making all in common
make[2]: Entering directory `/var/tmp/portage/dev-python/gst-python-0.10.21/work/gst-python-0.10.21-2.7/common'
Making all in m4
make[3]: Entering directory `/var/tmp/portage/dev-python/gst-python-0.10.21/work/gst-python-0.10.21-2.7/common/m4'
make[3]: Nothing to be done for `all'.
make[3]: Leaving directory `/var/tmp/portage/dev-python/gst-python-0.10.21/work/gst-python-0.10.21-2.7/common/m4'
make[3]: Entering directory `/var/tmp/portage/dev-python/gst-python-0.10.21/work/gst-python-0.10.21-2.7/common'
make[3]: Nothing to be done for `all-am'.
make[3]: Leaving directory `/var/tmp/portage/dev-python/gst-python-0.10.21/work/gst-python-0.10.21-2.7/common'
make[2]: Leaving directory `/var/tmp/portage/dev-python/gst-python-0.10.21/work/gst-python-0.10.21-2.7/common'
Making all in codegen
make[2]: Entering directory `/var/tmp/portage/dev-python/gst-python-0.10.21/work/gst-python-0.10.21-2.7/codegen'
make[2]: Nothing to be done for `all'.
make[2]: Leaving directory `/var/tmp/portage/dev-python/gst-python-0.10.21/work/gst-python-0.10.21-2.7/codegen'
Making all in gst
make[2]: Entering directory `/var/tmp/portage/dev-python/gst-python-0.10.21/work/gst-python-0.10.21-2.7/gst'
Making all in extend
make[3]: Entering directory `/var/tmp/portage/dev-python/gst-python-0.10.21/work/gst-python-0.10.21-2.7/gst/extend'
make[3]: Nothing to be done for `all'.
make[3]: Leaving directory `/var/tmp/portage/dev-python/gst-python-0.10.21/work/gst-python-0.10.21-2.7/gst/extend'
make[3]: Entering directory `/var/tmp/portage/dev-python/gst-python-0.10.21/work/gst-python-0.10.21-2.7/gst'
  CC     _gst_la-gst-argtypes.lo
  CC     _gst_la-gstmodule.lo
  CC     _gst_la-pygstminiobject.lo
  CC     _gst_la-pygstvalue.lo
  CC     _gst_la-pygstiterator.lo
  CC     _gst_la-pygstexception.lo
  GEN    gst.c
  CC     interfaces_la-interfacesmodule.lo
  GEN    interfaces.c
  CC     pbutils_la-pbutilsmodule.lo
  CC     pbutils_la-gst-argtypes.lo
  GEN    pbutils.c
Could not write getter for GstTunerNorm.framerate: No ArgType for 'GValue*'
Could not write virtual accessor method GstColorBalance.list_channels: No ArgType for 'const-GList*'
Could not write interface proxy GstColorBalance.list_channels: No ArgType for 'const-GList*'
Could not write method GstMixer.volume_changed: No ArgType for 'gint*'
Could not write virtual accessor method GstMixer.list_tracks: No ArgType for 'const-GList*'
Could not write virtual accessor method GstMixer.set_volume: No ArgType for 'gint*'
Could not write virtual accessor method GstMixer.get_volume: No ArgType for 'gint*'
Could not write interface proxy GstMixer.list_tracks: No ArgType for 'const-GList*'
Could not write interface proxy GstMixer.set_volume: cannot use int* parameter with direction 'None'
Could not write interface proxy GstMixer.get_volume: cannot use int* parameter with direction 'None'
Could not write method GstPropertyProbe.probe_property: No ArgType for 'const-GParamSpec*'
Could not write method GstPropertyProbe.needs_probe: No ArgType for 'const-GParamSpec*'
Could not write method GstPropertyProbe.get_values: No ArgType for 'const-GParamSpec*'
Could not write method GstPropertyProbe.probe_and_get_values: No ArgType for 'const-GParamSpec*'
Could not write method GstPropertyProbe.probe_and_get_values_name: No ArgType for 'GValueArray*'
Could not write virtual accessor method GstPropertyProbe.get_properties: No ArgType for 'const-GList*'
Could not write virtual accessor method GstPropertyProbe.needs_probe: No ArgType for 'const-GParamSpec*'
Could not write virtual accessor method GstPropertyProbe.probe_property: No ArgType for 'const-GParamSpec*'
Could not write virtual accessor method GstPropertyProbe.get_values: No ArgType for 'const-GParamSpec*'
Could not write interface proxy GstPropertyProbe.get_properties: No ArgType for 'const-GList*'
Could not write interface proxy GstPropertyProbe.needs_probe: No ArgType for 'const-GParamSpec*'
Could not write interface proxy GstPropertyProbe.probe_property: No ArgType for 'const-GParamSpec*'
Could not write interface proxy GstPropertyProbe.get_values: No ArgType for 'GValueArray*'
Could not write virtual accessor method GstTuner.list_channels: No ArgType for 'const-GList*'
Could not write virtual accessor method GstTuner.list_norms: No ArgType for 'const-GList*'
Could not write interface proxy GstTuner.list_channels: No ArgType for 'const-GList*'
Could not write interface proxy GstTuner.list_norms: No ArgType for 'const-GList*'
Could not write function gst_mixer_message_parse_options_list_changed: No ArgType for 'GstMixerOptions**'
Could not write function navigation_query_set_commands: varargs functions not supported
Could not write function navigation_query_set_commandsv: No ArgType for 'GstNavigationCommand*'
Could not write function navigation_query_parse_commands_length: No ArgType for 'guint*'
Could not write function navigation_query_parse_commands_nth: No ArgType for 'GstNavigationCommand*'
Could not write function navigation_query_parse_angles: No ArgType for 'guint*'
Could not write function navigation_message_parse_mouse_over: No ArgType for 'gboolean*'
Could not write function navigation_message_parse_angles_changed: No ArgType for 'guint*'
Could not write function navigation_event_parse_key_event: No ArgType for 'const-gchar**'
Could not write function navigation_event_parse_mouse_button_event: No ArgType for 'gint*'
Could not write function navigation_event_parse_mouse_move_event: No ArgType for 'gdouble*'
Could not write function navigation_event_parse_command: No ArgType for 'GstNavigationCommand*'
***INFO*** The coverage of global functions is 47.83% (11/23)
***INFO*** The coverage of methods is 89.83% (53/59)
***INFO*** There are no declared virtual proxies.***INFO*** The coverage of virtual accessors is 54.55% (12/22)
***INFO*** The coverage of interface proxies is 54.55% (12/22)
  CC     audio_la-audiomodule.lo
  CC     audio_la-gst-argtypes.lo
Could not write method GstCaps.set_value: No ArgType for 'const-GValue*'
Could not write method GstStructure.id_take_value: No ArgType for 'GQuark'
Could not write method GstStructure.take_value: No ArgType for 'GValue*'
Could not write method GstStructure.id_set: varargs functions not supported
Could not write method GstStructure.get: varargs functions not supported
Could not write method GstStructure.id_get: varargs functions not supported
Could not write method GstStructure.id_has_field: No ArgType for 'GQuark'
Could not write method GstStructure.id_has_field_typed: No ArgType for 'GQuark'
Could not write method GstStructure.get_uint: No ArgType for 'guint*'
Warning: generating old-style constructor for:gst_discoverer_new
Could not write method GstTagList.add_value: No ArgType for 'const-GValue*'
Could not write method GstTagList.peek_string_index: No ArgType for 'const-gchar**'
Could not write method GstIndexEntry.assoc_map: No ArgType for 'gint64*'
Could not write getter for GstStaticCaps.caps: write_return not implemented for GstCaps
Could not write function codec_utils_aac_get_profile: No ArgType for 'const-guint8*'
Could not write function codec_utils_aac_get_level: No ArgType for 'const-guint8*'
Could not write function codec_utils_h264_get_profile: No ArgType for 'const-guint8*'
Could not write function codec_utils_h264_get_level: No ArgType for 'const-guint8*'
Could not write function codec_utils_mpeg4video_get_profile: No ArgType for 'const-guint8*'
Could not write function codec_utils_mpeg4video_get_level: No ArgType for 'const-guint8*'
Could not write method GstTypeFind.suggest_simple: varargs functions not supported
Warning: Constructor for GstDiscoverer needs to be updated to new API
         See http://live.gnome.org/PyGTK_2fWhatsNew28#update-constructors
***INFO*** The coverage of global functions is 84.21% (32/38)
***INFO*** The coverage of methods is 100.00% (70/70)
***INFO*** There are no declared virtual proxies.***INFO*** There are no declared virtual accessors.***INFO*** There are no declared interface proxies.Could not write method GstIndex.set_filter: No ArgType for 'GstIndexFilter'
Could not write method GstIndex.set_filter_full: No ArgType for 'GstIndexFilter'
Could not write method GstIndex.set_resolver: No ArgType for 'GstIndexResolver'
Could not write method GstIndex.set_resolver_full: No ArgType for 'GstIndexResolver'
Could not write method GstIndex.get_writer_id: No ArgType for 'gint*'
Could not write method GstIndex.add_associationv: No ArgType for 'const-GstIndexAssociation*'
Could not write method GstIndex.add_association: varargs functions not supported
Could not write method GstIndex.add_object: No ArgType for 'gpointer'
Could not write method GstIndex.get_assoc_entry_full: No ArgType for 'GCompareDataFunc'
Could not write virtual accessor method GstIndex.get_assoc_entry: No ArgType for 'GCompareDataFunc'
Could not write virtual proxy GstIndex.get_assoc_entry: No ArgType for 'GCompareDataFunc'
Could not write method GstElement.message_full: No ArgType for 'GQuark'
Could not write virtual accessor method GstElement.get_query_types: No ArgType for 'const-GstQueryType*'
Could not write virtual accessor method GstElement.get_state: No ArgType for 'GstState*'
Could not write virtual proxy GstElement.get_query_types: No ArgType for 'const-GstQueryType*'
Could not write virtual proxy GstElement.get_state: No ArgType for 'GstState*'
Could not write virtual accessor method GstClock.wait: No ArgType for 'GstClockEntry*'
Could not write virtual accessor method GstClock.wait_jitter: No ArgType for 'GstClockEntry*'
Could not write virtual accessor method GstClock.wait_async: No ArgType for 'GstClockEntry*'
Could not write virtual accessor method GstClock.unschedule: No ArgType for 'GstClockEntry'
Could not write virtual proxy GstClock.wait: No ArgType for 'GstClockEntry*'
Could not write virtual proxy GstClock.wait_jitter: No ArgType for 'GstClockEntry*'
Could not write virtual proxy GstClock.wait_async: No ArgType for 'GstClockEntry*'
Could not write virtual proxy GstClock.unschedule: No ArgType for 'GstClockEntry'
Could not write method GstBus.add_watch_full: No ArgType for 'GstBusFunc'
Could not write method GstPad.set_bufferalloc_function: No ArgType for 'GstPadBufferAllocFunction'
Could not write method GstPad.set_chain_list_function: No ArgType for 'GstPadChainListFunction'
Could not write method GstPad.set_getrange_function: No ArgType for 'GstPadGetRangeFunction'
Could not write method GstPad.set_checkgetrange_function: No ArgType for 'GstPadCheckGetRangeFunction'
Could not write method GstPad.set_unlink_function: No ArgType for 'GstPadUnlinkFunction'
Could not write method GstPad.set_acceptcaps_function: No ArgType for 'GstPadAcceptCapsFunction'
Could not write method GstPad.set_fixatecaps_function: No ArgType for 'GstPadFixateCapsFunction'
Could not write method GstPad.set_internal_link_function: No ArgType for 'GstPadIntLinkFunction'
Could not write method GstPad.set_iterate_internal_links_function: No ArgType for 'GstPadIterIntLinkFunction'
Could not write method GstPad.set_query_type_function: No ArgType for 'GstPadQueryTypeFunction'
Could not write method GstPad.dispatcher: No ArgType for 'GstPadDispatcherFunction'
Warning: generating old-style constructor for:gst_ghost_pad_new
Warning: generating old-style constructor for:gst_pad_template_new
Could not write method GstPluginFeature.type_name_filter: No ArgType for 'GstTypeNameData*'
Could not write method GstRegistry.plugin_filter: No ArgType for 'GstPluginFilter'
Could not write method GstRegistry.feature_filter: No ArgType for 'GstPluginFeatureFilter'
Could not write method GstTask.set_priority: No ArgType for 'GThreadPriority'
Could not write method GstTask.set_thread_callbacks: No ArgType for 'GstTaskThreadCallbacks*'
Could not write method GstTaskPool.push: No ArgType for 'GstTaskPoolFunction'
Could not write method GstTaskPool.join: No ArgType for 'gpointer'
Warning: generating old-style constructor for:gst_net_client_clock_new
Warning: generating old-style constructor for:gst_net_time_provider_new
Could not write method GstControlSource.get_value: No ArgType for 'GValue*'
Could not write method GstControlSource.get_value_array: No ArgType for 'GstValueArray*'
Could not write method GstControlSource.bind: No ArgType for 'GParamSpec*'
Could not write method GstController.get_all: No ArgType for 'const-GList*'
Could not write method GstController.get_value_arrays: No ArgType for 'GSList*'
Could not write method GstController.get_value_array: No ArgType for 'GstValueArray*'
  GEN    audio.c
Could not write method GstInterpolationControlSource.set: No ArgType for 'GValue*'
Could not write method GstInterpolationControlSource.set_from_list: No ArgType for 'GSList*'
Could not write method GstInterpolationControlSource.get_all: No ArgType for 'GList*'
Could not write method GstAdapter.take_list: No ArgType for 'GList*'
Could not write method GstAdapter.prev_timestamp: No ArgType for 'guint64*'
Could not write method GstAdapter.masked_scan_uint32_peek: No ArgType for 'guint32*'
Could not write method GstBaseSink.wait_eos: No ArgType for 'GstClockTimeDiff*'
Could not write virtual accessor method GstBaseSink.buffer_alloc: No ArgType for 'GstBuffer**'
Could not write virtual proxy GstBaseSink.buffer_alloc: No ArgType for 'GstBuffer**'
Could not write virtual accessor method GstBaseTransform.prepare_output_buffer: No ArgType for 'GstBuffer**'
Could not write virtual proxy GstBaseTransform.prepare_output_buffer: No ArgType for 'GstBuffer**'
Could not write method GstCollectPads.set_function: No ArgType for 'GstCollectPadsFunction'
Could not write method GstCollectPads.set_clip_function: No ArgType for 'GstCollectPadsClipFunction'
Could not write method GstCollectPads.add_pad: No ArgType for 'GstCollectData*'
Could not write method GstCollectPads.add_pad_full: No ArgType for 'GstCollectDataDestroyNotify'
Could not write method GstCollectPads.peek: No ArgType for 'GstCollectData*'
Could not write method GstCollectPads.pop: No ArgType for 'GstCollectData*'
Could not write method GstCollectPads.read: No ArgType for 'GstCollectData*'
Could not write method GstCollectPads.read_buffer: No ArgType for 'GstCollectData*'
Could not write method GstCollectPads.take_buffer: No ArgType for 'GstCollectData*'
Could not write method GstCollectPads.flush: No ArgType for 'GstCollectData*'
Warning: generating old-style constructor for:gst_data_queue_new
Could not write constructor for GstDataQueue: No ArgType for 'GstDataQueueCheckFullFunction'
Could not write method GstDataQueue.push: No ArgType for 'GstDataQueueItem*'
Could not write method GstDataQueue.pop: No ArgType for 'GstDataQueueItem**'
Could not write method GstDataQueue.get_level: No ArgType for 'GstDataQueueSize*'
Could not write method GstBufferList.foreach: No ArgType for 'GstBufferListFunc'
Could not write method GstBufferList.iterate: No ArgType for 'GstBufferListIterator*'
Could not write method GstMessage.set_stream_status_object: No ArgType for 'const-GValue*'
Could not write method GstMessage.get_stream_status_object: No ArgType for 'const-GValue*'
Could not write method GstQuery.parse_nth_buffering_range: No ArgType for 'gint64*'
Could not write method GstTagSetter.add_tags: varargs functions not supported
Could not write method GstTagSetter.add_tag_values: varargs functions not supported
Could not write method GstTagSetter.add_tag_valist_values: No ArgType for 'va_list'
Could not write method GstTagSetter.add_tag_value: No ArgType for 'const-GValue*'
Could not write method GstPreset.get_meta: No ArgType for 'gchar**'
Could not write function object_control_properties: varargs functions not supported
Could not write function object_uncontrol_properties: varargs functions not supported
Could not write function object_get_value_arrays: No ArgType for 'GSList*'
Could not write function object_get_value_array: No ArgType for 'GstValueArray*'
Could not write function gst_controller_init: No ArgType for 'int*'
Could not write function gst_dp_crc: No ArgType for 'const-guint8*'
Could not write function dp_header_from_buffer: No ArgType for 'guint*'
Could not write function dp_packet_from_caps: No ArgType for 'guint*'
Could not write function dp_packet_from_event: No ArgType for 'guint*'
Could not write function type_find_helper_get_range: No ArgType for 'GstTypeFindHelperGetRangeFunction'
Could not write function type_find_helper_get_range_ext: No ArgType for 'GstTypeFindHelperGetRangeFunction'
  CC     video_la-videomodule.lo
Could not write function debug_add_log_function: No ArgType for 'GstLogFunction'
Could not write function debug_remove_log_function: No ArgType for 'GstLogFunction'
Could not write function debug_remove_log_function_by_data: No ArgType for 'gpointer'
Could not write function debug_get_all_categories: No ArgType for 'GSList*'
Could not write function debug_remove_log_function: No ArgType for 'GstLogFunction'
Could not write function debug_remove_log_function_by_data: No ArgType for 'gpointer'
Could not write function util_array_binary_search: No ArgType for 'gpointer'
Could not write function util_fraction_to_double: No ArgType for 'gdouble*'
Could not write function util_double_to_fraction: No ArgType for 'gint*'
Could not write function util_fraction_multiply: No ArgType for 'gint*'
Could not write function util_fraction_add: No ArgType for 'gint*'
Could not write function parse_launch_full: No ArgType for 'GstParseContext*'
Could not write function parse_launchv_full: No ArgType for 'const-gchar**'
Could not write function plugin_register_static: No ArgType for 'const-GstPluginDesc*'
Could not write function plugin_feature_rank_compare_func: No ArgType for 'gconstpointer'
Could not write function poll_new_timer: No ArgType for 'GstPoll*'
Could not write function tag_register: No ArgType for 'GstTagMergeFunc'
Could not write function tag_merge_use_first: No ArgType for 'GValue*'
Could not write function tag_merge_strings_with_comma: No ArgType for 'GValue*'
Could not write function task_create: No ArgType for 'GstTaskFunction'
Warning: Constructor for GstGhostPad needs to be updated to new API
         See http://live.gnome.org/PyGTK_2fWhatsNew28#update-constructors
Warning: Constructor for GstPadTemplate needs to be updated to new API
         See http://live.gnome.org/PyGTK_2fWhatsNew28#update-constructors
Warning: Constructor for GstNetClientClock needs to be updated to new API
         See http://live.gnome.org/PyGTK_2fWhatsNew28#update-constructors
Warning: Constructor for GstNetTimeProvider needs to be updated to new API
         See http://live.gnome.org/PyGTK_2fWhatsNew28#update-constructors
Warning: Constructor for GstController needs to be updated to new API
         See http://live.gnome.org/PyGTK_2fWhatsNew28#update-constructors
Warning: Constructor for GstDataQueue needs to be updated to new API
         See http://live.gnome.org/PyGTK_2fWhatsNew28#update-constructors
***INFO*** The coverage of global functions is 85.31% (180/211)
***INFO*** The coverage of methods is 87.44% (543/621)
***INFO*** The coverage of virtual proxies is 86.76% (59/68)
***INFO*** The coverage of virtual accessors is 87.67% (64/73)
***INFO*** The coverage of interface proxies is 100.00% (5/5)
  GEN    video.c
  CC     video_la-gst-argtypes.lo
Warning: generating old-style constructor for:gst_audio_clock_new
Could not write constructor for GstAudioClock: No ArgType for 'GstAudioClockGetTimeFunc'
Could not write virtual accessor method GstAudioFilter.setup: No ArgType for 'GstRingBufferSpec*'
Could not write virtual proxy GstAudioFilter.setup: No ArgType for 'GstRingBufferSpec*'
Could not write virtual accessor method GstAudioSink.prepare: No ArgType for 'GstRingBufferSpec*'
Could not write virtual accessor method GstAudioSink.write: No ArgType for 'gpointer'
Could not write virtual proxy GstAudioSink.prepare: No ArgType for 'GstRingBufferSpec*'
Could not write virtual proxy GstAudioSink.write: No ArgType for 'gpointer'
Could not write method GstRingBuffer.set_callback: No ArgType for 'GstRingBufferCallback'
Could not write method GstRingBuffer.convert: No ArgType for 'gint64*'
Could not write method GstRingBuffer.acquire: No ArgType for 'GstRingBufferSpec*'
Could not write method GstRingBuffer.commit_full: No ArgType for 'guint64*'
Could not write method GstRingBuffer.prepare_read: No ArgType for 'gint*'
Could not write virtual accessor method GstRingBuffer.acquire: No ArgType for 'GstRingBufferSpec*'
Could not write virtual proxy GstRingBuffer.acquire: No ArgType for 'GstRingBufferSpec*'
Could not write function audio_clock_new_full: No ArgType for 'GstAudioClockGetTimeFunc'
Could not write function ring_buffer_parse_caps: No ArgType for 'GstRingBufferSpec*'
Could not write function ring_buffer_debug_spec_caps: No ArgType for 'GstRingBufferSpec*'
Could not write function ring_buffer_debug_spec_buff: No ArgType for 'GstRingBufferSpec*'
Could not write function default_registry_mixer_filter: No ArgType for 'GstAudioMixerFilterFunc'
Could not write function get_channel_positions: No ArgType for 'GstAudioChannelPosition*'
Could not write function set_channel_positions: No ArgType for 'const-GstAudioChannelPosition*'
Could not write function set_structure_channel_positions_list: No ArgType for 'const-GstAudioChannelPosition*'
Could not write function set_caps_channel_positions_list: No ArgType for 'const-GstAudioChannelPosition*'
Could not write function fixate_channel_positions: No ArgType for 'GstAudioChannelPosition*'
Could not write function check_channel_positions: No ArgType for 'const-GstAudioChannelPosition*'
Warning: Constructor for GstAudioClock needs to be updated to new API
         See http://live.gnome.org/PyGTK_2fWhatsNew28#update-constructors
Warning: Constructor for GstAudioFilter needs to be updated to new API
         See http://live.gnome.org/PyGTK_2fWhatsNew28#update-constructors
Warning: Constructor for GstBaseAudioSink needs to be updated to new API
         See http://live.gnome.org/PyGTK_2fWhatsNew28#update-constructors
Warning: Constructor for GstAudioSink needs to be updated to new API
         See http://live.gnome.org/PyGTK_2fWhatsNew28#update-constructors
Warning: Constructor for GstRingBuffer needs to be updated to new API
         See http://live.gnome.org/PyGTK_2fWhatsNew28#update-constructors
***INFO*** The coverage of global functions is 42.11% (8/19)
***INFO*** The coverage of methods is 84.85% (28/33)
***INFO*** The coverage of virtual proxies is 78.95% (15/19)
***INFO*** The coverage of virtual accessors is 78.95% (15/19)
***INFO*** There are no declared interface proxies.  CC     tag_la-tagmodule.lo
  CC     tag_la-gst-argtypes.lo
Could not write function video_sink_center_rect: No ArgType for 'GstVideoRectangle'
Could not write function get_size: No ArgType for 'gint*'
Could not write function calculate_display_ratio: No ArgType for 'guint*'
Could not write function format_parse_caps: No ArgType for 'GstVideoFormat*'
Could not write function format_parse_caps_interlaced: No ArgType for 'gboolean*'
Could not write function parse_caps_framerate: No ArgType for 'int*'
Could not write function parse_caps_pixel_aspect_ratio: No ArgType for 'int*'
Could not write function event_parse_still_frame: No ArgType for 'gboolean*'
Could not write function video_convert_frame_async: No ArgType for 'GstVideoConvertFrameCallback'
Warning: Constructor for GstVideoFilter needs to be updated to new API
         See http://live.gnome.org/PyGTK_2fWhatsNew28#update-constructors
Warning: Constructor for GstVideoSink needs to be updated to new API
         See http://live.gnome.org/PyGTK_2fWhatsNew28#update-constructors
***INFO*** The coverage of global functions is 40.00% (6/15)
***INFO*** There are no declared methods.***INFO*** There are no declared virtual proxies.***INFO*** There are no declared virtual accessors.***INFO*** There are no declared interface proxies.  GEN    tag.c
  CC     _gst_la-gst.lo
  CC     interfaces_la-interfaces.lo
  CC     pbutils_la-pbutils.lo
Could not write function list_from_vorbiscomment_buffer: No ArgType for 'const-guint8*'
Could not write function id3_genre_get: No ArgType for 'const-guint'
Could not write function list_new_from_id3v1: No ArgType for 'const-guint8*'
Could not write function parse_extended_comment: No ArgType for 'gchar**'
Could not write function freeform_string_to_utf8: No ArgType for 'const-gchar**'
Could not write function image_data_to_image_buffer: No ArgType for 'const-guint8*'
Could not write function get_language_codes: No ArgType for 'gchar**'
Warning: Constructor for GstTagDemux needs to be updated to new API
         See http://live.gnome.org/PyGTK_2fWhatsNew28#update-constructors
***INFO*** The coverage of global functions is 70.83% (17/24)
***INFO*** There are no declared methods.***INFO*** There are no declared virtual proxies.***INFO*** There are no declared virtual accessors.***INFO*** There are no declared interface proxies.  CC     audio_la-audio.lo
  CC     video_la-video.lo
  CC     tag_la-tag.lo
  CCLD   tag.la
  CCLD   video.la
  CCLD   interfaces.la
  CCLD   audio.la
  CCLD   pbutils.la
  CCLD   _gst.la
make[3]: Leaving directory `/var/tmp/portage/dev-python/gst-python-0.10.21/work/gst-python-0.10.21-2.7/gst'
make[2]: Leaving directory `/var/tmp/portage/dev-python/gst-python-0.10.21/work/gst-python-0.10.21-2.7/gst'
Making all in examples
make[2]: Entering directory `/var/tmp/portage/dev-python/gst-python-0.10.21/work/gst-python-0.10.21-2.7/examples'
make[2]: Nothing to be done for `all'.
make[2]: Leaving directory `/var/tmp/portage/dev-python/gst-python-0.10.21/work/gst-python-0.10.21-2.7/examples'
Making all in plugin
make[2]: Entering directory `/var/tmp/portage/dev-python/gst-python-0.10.21/work/gst-python-0.10.21-2.7/plugin'
  CC     gstpythonplugin.lo
  CCLD   libgstpython.la
make[2]: Leaving directory `/var/tmp/portage/dev-python/gst-python-0.10.21/work/gst-python-0.10.21-2.7/plugin'
Making all in testsuite
make[2]: Entering directory `/var/tmp/portage/dev-python/gst-python-0.10.21/work/gst-python-0.10.21-2.7/testsuite'
  CC     testhelper_la-test-object.lo
  CC     testhelper_la-testhelpermodule.lo
  CCLD   testhelper.la
make[2]: Leaving directory `/var/tmp/portage/dev-python/gst-python-0.10.21/work/gst-python-0.10.21-2.7/testsuite'
Making all in pkgconfig
make[2]: Entering directory `/var/tmp/portage/dev-python/gst-python-0.10.21/work/gst-python-0.10.21-2.7/pkgconfig'
  CP     gst-python-0.10-uninstalled.pc
  CP     gst-python-0.10.pc
make[2]: Leaving directory `/var/tmp/portage/dev-python/gst-python-0.10.21/work/gst-python-0.10.21-2.7/pkgconfig'
make[2]: Entering directory `/var/tmp/portage/dev-python/gst-python-0.10.21/work/gst-python-0.10.21-2.7'
  CC     gstoption_la-gstoptionmodule.lo
  CCLD   gstoption.la
make[2]: Leaving directory `/var/tmp/portage/dev-python/gst-python-0.10.21/work/gst-python-0.10.21-2.7'
make[1]: Leaving directory `/var/tmp/portage/dev-python/gst-python-0.10.21/work/gst-python-0.10.21-2.7'
>>> Source compiled.
>>> Test phase [not enabled]: dev-python/gst-python-0.10.21

>>> Install gst-python-0.10.21 into /var/tmp/portage/dev-python/gst-python-0.10.21/image/ category dev-python
 * Installation of dev-python/gst-python-0.10.21 with CPython 2.7...
make -j5 DESTDIR=/var/tmp/portage/dev-python/gst-python-0.10.21/image/ install
make  install-recursive
make[1]: Entering directory `/var/tmp/portage/dev-python/gst-python-0.10.21/work/gst-python-0.10.21-2.7'
Making install in common
make[2]: Entering directory `/var/tmp/portage/dev-python/gst-python-0.10.21/work/gst-python-0.10.21-2.7/common'
Making install in m4
make[3]: Entering directory `/var/tmp/portage/dev-python/gst-python-0.10.21/work/gst-python-0.10.21-2.7/common/m4'
make[4]: Entering directory `/var/tmp/portage/dev-python/gst-python-0.10.21/work/gst-python-0.10.21-2.7/common/m4'
make[4]: Nothing to be done for `install-exec-am'.
make[4]: Nothing to be done for `install-data-am'.
make[4]: Leaving directory `/var/tmp/portage/dev-python/gst-python-0.10.21/work/gst-python-0.10.21-2.7/common/m4'
make[3]: Leaving directory `/var/tmp/portage/dev-python/gst-python-0.10.21/work/gst-python-0.10.21-2.7/common/m4'
make[3]: Entering directory `/var/tmp/portage/dev-python/gst-python-0.10.21/work/gst-python-0.10.21-2.7/common'
make[4]: Entering directory `/var/tmp/portage/dev-python/gst-python-0.10.21/work/gst-python-0.10.21-2.7/common'
make[4]: Nothing to be done for `install-exec-am'.
make[4]: Nothing to be done for `install-data-am'.
make[4]: Leaving directory `/var/tmp/portage/dev-python/gst-python-0.10.21/work/gst-python-0.10.21-2.7/common'
make[3]: Leaving directory `/var/tmp/portage/dev-python/gst-python-0.10.21/work/gst-python-0.10.21-2.7/common'
make[2]: Leaving directory `/var/tmp/portage/dev-python/gst-python-0.10.21/work/gst-python-0.10.21-2.7/common'
Making install in codegen
make[2]: Entering directory `/var/tmp/portage/dev-python/gst-python-0.10.21/work/gst-python-0.10.21-2.7/codegen'
make[3]: Entering directory `/var/tmp/portage/dev-python/gst-python-0.10.21/work/gst-python-0.10.21-2.7/codegen'
make[3]: Nothing to be done for `install-exec-am'.
make[3]: Nothing to be done for `install-data-am'.
make[3]: Leaving directory `/var/tmp/portage/dev-python/gst-python-0.10.21/work/gst-python-0.10.21-2.7/codegen'
make[2]: Leaving directory `/var/tmp/portage/dev-python/gst-python-0.10.21/work/gst-python-0.10.21-2.7/codegen'
Making install in gst
make[2]: Entering directory `/var/tmp/portage/dev-python/gst-python-0.10.21/work/gst-python-0.10.21-2.7/gst'
Making install in extend
make[3]: Entering directory `/var/tmp/portage/dev-python/gst-python-0.10.21/work/gst-python-0.10.21-2.7/gst/extend'
make[4]: Entering directory `/var/tmp/portage/dev-python/gst-python-0.10.21/work/gst-python-0.10.21-2.7/gst/extend'
make[4]: Nothing to be done for `install-exec-am'.
 /bin/mkdir -p '/var/tmp/portage/dev-python/gst-python-0.10.21/image//usr/lib64/python2.7/site-packages/gst-0.10/gst/extend'
 /usr/bin/install -c -m 644 __init__.py pygobject.py utils.py discoverer.py sources.py leveller.py jukebox.py '/var/tmp/portage/dev-python/gst-python-0.10.21/image//usr/lib64/python2.7/site-packages/gst-0.10/gst/extend'
../../py-compile: ../../py-compile: cannot execute binary file
make[4]: *** [install-pygstPYTHON] Error 126
make[4]: Leaving directory `/var/tmp/portage/dev-python/gst-python-0.10.21/work/gst-python-0.10.21-2.7/gst/extend'
make[3]: *** [install-am] Error 2
make[3]: Leaving directory `/var/tmp/portage/dev-python/gst-python-0.10.21/work/gst-python-0.10.21-2.7/gst/extend'
make[2]: *** [install-recursive] Error 1
make[2]: Leaving directory `/var/tmp/portage/dev-python/gst-python-0.10.21/work/gst-python-0.10.21-2.7/gst'
make[1]: *** [install-recursive] Error 1
make[1]: Leaving directory `/var/tmp/portage/dev-python/gst-python-0.10.21/work/gst-python-0.10.21-2.7'
make: *** [install] Error 2
emake failed
 * ERROR: dev-python/gst-python-0.10.21 failed (install phase):
 *   Installation failed with CPython 2.7 in python_default_function() function
 *
 * Call stack:
 *     ebuild.sh, line   85:  Called src_install
 *   environment, line 5447:  Called python_src_install
 *   environment, line 5384:  Called python_execute_function '-d' '-s' '--'
 *   environment, line 3806:  Called die
 * The specific snippet of code:
 *                       die "${failure_message}";
 *
 * If you need support, post the output of `emerge --info '=dev-python/gst-python-0.10.21'`,
 * the complete build log and the output of `emerge -pqv '=dev-python/gst-python-0.10.21'`.
 * The complete build log is located at '/var/tmp/portage/dev-python/gst-python-0.10.21/temp/build.log'.
 * The ebuild environment file is located at '/var/tmp/portage/dev-python/gst-python-0.10.21/temp/environment'.
 * Working directory: '/var/tmp/portage/dev-python/gst-python-0.10.21/work/gst-python-0.10.21-2.7'
 * S: '/var/tmp/portage/dev-python/gst-python-0.10.21/work/gst-python-0.10.21'


EDIT: As already suggested by the others, with the new version gst-python-0.10.22 everything is fine.


Last edited by steak-sandwich on Fri Aug 31, 2012 2:11 am; edited 1 time in total
Back to top
View user's profile Send private message
Hu
Watchman
Watchman


Joined: 06 Mar 2007
Posts: 9066

PostPosted: Fri Aug 31, 2012 1:22 am    Post subject: Reply with quote

steak-sandwich: what is the output of emerge --info?
Back to top
View user's profile Send private message
steak-sandwich
n00b
n00b


Joined: 27 Aug 2012
Posts: 21

PostPosted: Fri Aug 31, 2012 2:26 am    Post subject: Reply with quote

As I said I solved it by installing the newer version, but here is the output of "emerge --info '=dev-python/gst-python-0.10.21'":

Code:
Portage 2.1.11.9 (default/linux/amd64/10.0, gcc-4.5.4, glibc-2.15-r2, 3.4.9-gentoo x86_64)
=================================================================
                         System Settings
=================================================================
System uname: Linux-3.4.9-gentoo-x86_64-Intel-R-_Core-TM-_i5-2500K_CPU_@_3.30GHz-with-gentoo-2.1
Timestamp of tree: Mon, 27 Aug 2012 00:00:01 +0000
app-shells/bash:          4.2_p37
dev-lang/python:          2.7.3-r2, 3.2.3
dev-util/cmake:           2.8.8-r3
dev-util/pkgconfig:       0.27
sys-apps/baselayout:      2.1-r1
sys-apps/openrc:          0.9.8.4
sys-apps/sandbox:         2.5
sys-devel/autoconf:       2.13, 2.68
sys-devel/automake:       1.11.6
sys-devel/binutils:       2.22-r1
sys-devel/gcc:            4.5.4
sys-devel/gcc-config:     1.7.3
sys-devel/libtool:        2.4-r1
sys-devel/make:           3.82-r3
sys-kernel/linux-headers: 3.4-r2 (virtual/os-headers)
sys-libs/glibc:           2.15-r2
Repositories: gentoo
ACCEPT_KEYWORDS="amd64"
ACCEPT_LICENSE="* -@EULA"
CBUILD="x86_64-pc-linux-gnu"
CFLAGS="-O2 -pipe"
CHOST="x86_64-pc-linux-gnu"
CONFIG_PROTECT="/etc /usr/share/gnupg/qualified.txt"
CONFIG_PROTECT_MASK="/etc/ca-certificates.conf /etc/dconf /etc/env.d /etc/fonts/fonts.conf /etc/gconf /etc/gentoo-release /etc/revdep-rebuild /etc/sandbox.d /etc/terminfo"
CXXFLAGS="-O2 -pipe"
DISTDIR="/usr/portage/distfiles"
FCFLAGS="-O2 -pipe"
FEATURES="assume-digests binpkg-logs config-protect-if-modified distlocks ebuild-locks fixlafiles news parallel-fetch parse-eapi-ebuild-head protect-owned sandbox sfperms strict unknown-features-warn unmerge-logs unmerge-orphans userfetch"
FFLAGS="-O2 -pipe"
GENTOO_MIRRORS="ftp://de-mirror.org/gentoo/ http://de-mirror.org/gentoo/ ftp://ftp.wh2.tu-dresden.de/pub/mirrors/gentoo ftp://ftp.halifax.rwth-aachen.de/gentoo/ http://ftp.halifax.rwth-aachen.de/gentoo/ ftp://ftp-stud.hs-esslingen.de/pub/Mirrors/gentoo/ http://ftp-stud.hs-esslingen.de/pub/Mirrors/gentoo/ ftp://ftp.join.uni-muenster.de/pub/linux/distributions/gentoo ftp://ftp6.uni-muenster.de/pub/linux/distributions/gentoo ftp://ftp.ipv6.uni-muenster.de/pub/linux/distributions/gentoo"
LDFLAGS="-Wl,-O1 -Wl,--as-needed"
MAKEOPTS="-j5"
PKGDIR="/usr/portage/packages"
PORTAGE_CONFIGROOT="/"
PORTAGE_RSYNC_OPTS="--recursive --links --safe-links --perms --times --compress --force --whole-file --delete --stats --human-readable --timeout=180 --exclude=/distfiles --exclude=/local --exclude=/packages"
PORTAGE_TMPDIR="/var/tmp"
PORTDIR="/usr/portage"
PORTDIR_OVERLAY=""
SYNC="rsync://rsync9.de.gentoo.org/gentoo-portage"
USE="X acl alsa amd64 berkdb bzip2 cli cracklib crypt cups cxx dbus dri dvd dvdr fortran gdbm gnome gpm gtk iconv ipv6 mmx modules mudflap multilib ncurses nls nptl nvidia openmp pam pcre pppd readline session sse sse2 ssl tcpd unicode xorg zlib" ALSA_CARDS="ali5451 als4000 atiixp atiixp-modem bt87x ca0106 cmipci emu10k1x ens1370 ens1371 es1938 es1968 fm801 hda-intel intel8x0 intel8x0m maestro3 trident usb-audio via82xx via82xx-modem ymfpci" ALSA_PCM_PLUGINS="adpcm alaw asym copy dmix dshare dsnoop empty extplug file hooks iec958 ioplug ladspa lfloat linear meter mmap_emul mulaw multi null plug rate route share shm softvol" APACHE2_MODULES="actions alias auth_basic authn_alias authn_anon authn_dbm authn_default authn_file authz_dbm authz_default authz_groupfile authz_host authz_owner authz_user autoindex cache cgi cgid dav dav_fs dav_lock deflate dir disk_cache env expires ext_filter file_cache filter headers include info log_config logio mem_cache mime mime_magic negotiation rewrite setenvif speling status unique_id userdir usertrack vhost_alias" CALLIGRA_FEATURES="kexi words flow plan sheets stage tables krita karbon braindump" CAMERAS="ptp2" COLLECTD_PLUGINS="df interface irq load memory rrdtool swap syslog" ELIBC="glibc" GPSD_PROTOCOLS="ashtech aivdm earthmate evermore fv18 garmin garmintxt gpsclock itrax mtk3301 nmea ntrip navcom oceanserver oldstyle oncore rtcm104v2 rtcm104v3 sirf superstar2 timing tsip tripmate tnt ubx" INPUT_DEVICES="evdev" KERNEL="linux" LCD_DEVICES="bayrad cfontz cfontz633 glk hd44780 lb216 lcdm001 mtxorb ncurses text" LIBREOFFICE_EXTENSIONS="presenter-console presenter-minimizer" PHP_TARGETS="php5-3" PYTHON_TARGETS="python3_2 python2_7" RUBY_TARGETS="ruby18 ruby19" USERLAND="GNU" VIDEO_CARDS="nvidia" XTABLES_ADDONS="quota2 psd pknock lscan length2 ipv4options ipset ipp2p iface geoip fuzzy condition tee tarpit sysrq steal rawnat logmark ipmark dhcpmac delude chaos account"
Unset:  CPPFLAGS, CTARGET, EMERGE_DEFAULT_OPTS, INSTALL_MASK, LANG, LC_ALL, LINGUAS, PORTAGE_BUNZIP2_COMMAND, PORTAGE_COMPRESS, PORTAGE_COMPRESS_FLAGS, PORTAGE_RSYNC_EXTRA_OPTS, USE_PYTHON
Back to top
View user's profile Send private message
Display posts from previous:   
Reply to topic    Gentoo Forums Forum Index Installing Gentoo All times are GMT
Page 1 of 1

 
Jump to:  
You cannot post new topics in this forum
You cannot reply to topics in this forum
You cannot edit your posts in this forum
You cannot delete your posts in this forum
You cannot vote in polls in this forum