Gentoo Forums
Gentoo Forums
Gentoo Forums
Quick Search: in
kde-base/kig Update Probleme
View unanswered posts
View posts from last 24 hours
View posts from last 7 days

 
Reply to topic    Gentoo Forums Forum Index Deutsches Forum (German)
View previous topic :: View next topic  
Author Message
Gladdle
Apprentice
Apprentice


Joined: 27 Jul 2008
Posts: 177
Location: Bietigheim- Bissingen

PostPosted: Wed Aug 15, 2012 6:47 pm    Post subject: kde-base/kig Update Probleme Reply with quote

Hallo Leute, ich versuche obriges Packet Upzudaten. Ich bekomme nur diesen Fehler:
http://phpmygentoo.rainyday-productions.de/acer-aspire-9920g/kig-build.log

Ausgabe von emerge --search boost:
Code:
*  dev-libs/boost
      Latest version available: 1.49.0-r1
      Latest version installed: 1.49.0-r1
      Size of files: 47,363 kB
      Homepage:      http://www.boost.org/
      Description:   Boost Libraries for C++
      License:       Boost-1.0


Wie bekomme ich das Problem gelöst?
_________________
Meine Gentoo Linux Konfiguration: Notebook (ACER Aspire 9920G)
Back to top
View user's profile Send private message
Josef.95
Advocate
Advocate


Joined: 03 Sep 2007
Posts: 2288
Location: Germany

PostPosted: Thu Aug 16, 2012 10:31 am    Post subject: Reply with quote

Gladdle wrote:
Code:
[ 96%] Building CXX object CMakeFiles/kigpart.dir/scripting/python_scripter.o
/usr/bin/x86_64-pc-linux-gnu-g++  -DMAKE_KIGPART_LIB -D_BSD_SOURCE -D_XOPEN_SOURCE=500 -D_BSD_SOURCE -DQT_NO_STL -DQT_NO_CAST_TO_ASCII -D_REENTRANT -DKDE_DEPRECATED_WARNINGS -DKDE4_CMAKE_TOPLEVEL_DIR_LENGTH=40 -DQT_USE_FAST_CONCATENATION -DQT_USE_FAST_OPERATOR_PLUS  -DQT_NO_DEBUG -DNDEBUG -march=nocona -O2 -pipe  -Wnon-virtual-dtor -Wno-long-long -ansi -Wundef -Wcast-align -Wchar-subscripts -Wall -W -Wpointer-arith -Wformat-security -fno-exceptions -DQT_NO_EXCEPTIONS -fno-check-new -fno-common -Woverloaded-virtual -fno-threadsafe-statics -fvisibility=hidden -Werror=return-type -fvisibility-inlines-hidden -fPIC -I/var/tmp/portage/kde-base/kig-4.9.0/work/kig-4.9.0_build -I/var/tmp/portage/kde-base/kig-4.9.0/work/kig-4.9.0 -I/var/tmp/portage/kde-base/kig-4.9.0/work/kig-4.9.0/modes -I/usr/include/KDE -I/usr/include/qt4/QtXmlPatterns -I/usr/include/qt4/QtXml -I/usr/include/qt4/QtWebKit -I/usr/include/qt4/QtUiTools -I/usr/include/qt4/QtTest -I/usr/include/qt4/QtSvg -I/usr/include/qt4/QtSql -I/usr/include/qt4/QtScriptTools -I/usr/include/qt4/QtScript -I/usr/include/qt4/QtOpenGL -I/usr/include/qt4/QtNetwork -I/usr/include/qt4/QtMultimedia -I/usr/include/qt4/QtDesigner -I/usr/include/qt4/QtDeclarative -I/usr/include/qt4/QtDBus -I/usr/include/qt4/Qt3Support -I/usr/include/qt4/QtGui -I/usr/include/qt4/QtCore -I/usr/include/qt4/Qt -I/usr/share/qt4/mkspecs/default -I/usr/include/qt4 -I/usr/include/python2.7 -I/usr/include/boost-1_49    -D_GNU_SOURCE -D_LARGEFILE64_SOURCE -fexceptions -UQT_NO_EXCEPTIONS -o CMakeFiles/kigpart.dir/scripting/python_scripter.o -c /var/tmp/portage/kde-base/kig-4.9.0/work/kig-4.9.0/scripting/python_scripter.cc
In file included from /usr/include/python2.7/Python.h:8:0,
                 from /var/tmp/portage/kde-base/kig-4.9.0/work/kig-4.9.0/scripting/python_scripter.cc:22:
/usr/include/python2.7/pyconfig.h:1183:0: warning: "_XOPEN_SOURCE" redefined
<command-line>:0:0: note: this is the location of the previous definition
In file included from /usr/include/boost-1_49/boost/python/detail/prefix.hpp:13:0,
                 from /usr/include/boost-1_49/boost/python/args.hpp:8,
                 from /usr/include/boost-1_49/boost/python.hpp:11,
                 from /var/tmp/portage/kde-base/kig-4.9.0/work/kig-4.9.0/scripting/python_scripter.cc:29:
/usr/include/boost-1_49/boost/python/detail/wrap_python.hpp:193:7: warning: "_MSC_VER" is not defined
In file included from /usr/include/boost-1_49/boost/preprocessor/cat.hpp:17:0,
                 from /usr/include/boost-1_49/boost/mpl/aux_/integral_wrapper.hpp:22,
                 from /usr/include/boost-1_49/boost/mpl/int.hpp:20,
                 from /usr/include/boost-1_49/boost/type_traits/detail/template_arity_spec.hpp:10,
                 from /usr/include/boost-1_49/boost/type_traits/detail/bool_trait_def.hpp:14,
                 from /usr/include/boost-1_49/boost/type_traits/is_same.hpp:31,
                 from /usr/include/boost-1_49/boost/type_traits/same_traits.hpp:13,
                 from /usr/include/boost-1_49/boost/python/cast.hpp:10,
                 from /usr/include/boost-1_49/boost/python/handle.hpp:10,
                 from /usr/include/boost-1_49/boost/python/args_fwd.hpp:10,
                 from /usr/include/boost-1_49/boost/python/args.hpp:10,
                 from /usr/include/boost-1_49/boost/python.hpp:11,
                 from /var/tmp/portage/kde-base/kig-4.9.0/work/kig-4.9.0/scripting/python_scripter.cc:29:
/usr/include/boost-1_49/boost/preprocessor/config/config.hpp:86:77: warning: "__GXX_EXPERIMENTAL_CXX0X__" is not defined
/usr/bin/cmake -E cmake_progress_report /var/tmp/portage/kde-base/kig-4.9.0/work/kig-4.9.0_build/CMakeFiles 98
[ 97%] Building CXX object CMakeFiles/kigpart.dir/scripting/python_type.o
/usr/bin/x86_64-pc-linux-gnu-g++  -DMAKE_KIGPART_LIB -D_BSD_SOURCE -D_XOPEN_SOURCE=500 -D_BSD_SOURCE -DQT_NO_STL -DQT_NO_CAST_TO_ASCII -D_REENTRANT -DKDE_DEPRECATED_WARNINGS -DKDE4_CMAKE_TOPLEVEL_DIR_LENGTH=40 -DQT_USE_FAST_CONCATENATION -DQT_USE_FAST_OPERATOR_PLUS  -DQT_NO_DEBUG -DNDEBUG -march=nocona -O2 -pipe  -Wnon-virtual-dtor -Wno-long-long -ansi -Wundef -Wcast-align -Wchar-subscripts -Wall -W -Wpointer-arith -Wformat-security -fno-exceptions -DQT_NO_EXCEPTIONS -fno-check-new -fno-common -Woverloaded-virtual -fno-threadsafe-statics -fvisibility=hidden -Werror=return-type -fvisibility-inlines-hidden -fPIC -I/var/tmp/portage/kde-base/kig-4.9.0/work/kig-4.9.0_build -I/var/tmp/portage/kde-base/kig-4.9.0/work/kig-4.9.0 -I/var/tmp/portage/kde-base/kig-4.9.0/work/kig-4.9.0/modes -I/usr/include/KDE -I/usr/include/qt4/QtXmlPatterns -I/usr/include/qt4/QtXml -I/usr/include/qt4/QtWebKit -I/usr/include/qt4/QtUiTools -I/usr/include/qt4/QtTest -I/usr/include/qt4/QtSvg -I/usr/include/qt4/QtSql -I/usr/include/qt4/QtScriptTools -I/usr/include/qt4/QtScript -I/usr/include/qt4/QtOpenGL -I/usr/include/qt4/QtNetwork -I/usr/include/qt4/QtMultimedia -I/usr/include/qt4/QtDesigner -I/usr/include/qt4/QtDeclarative -I/usr/include/qt4/QtDBus -I/usr/include/qt4/Qt3Support -I/usr/include/qt4/QtGui -I/usr/include/qt4/QtCore -I/usr/include/qt4/Qt -I/usr/share/qt4/mkspecs/default -I/usr/include/qt4 -I/usr/include/python2.7 -I/usr/include/boost-1_49    -D_GNU_SOURCE -D_LARGEFILE64_SOURCE -o CMakeFiles/kigpart.dir/scripting/python_type.o -c /var/tmp/portage/kde-base/kig-4.9.0/work/kig-4.9.0/scripting/python_type.cc
In file included from /usr/include/boost-1_49/boost/mpl/aux_/has_apply.hpp:17:0,
                 from /usr/include/boost-1_49/boost/mpl/apply_wrap.hpp:23,
                 from /usr/include/boost-1_49/boost/mpl/aux_/numeric_op.hpp:22,
                 from /usr/include/boost-1_49/boost/mpl/aux_/arithmetic_op.hpp:26,
                 from /usr/include/boost-1_49/boost/mpl/plus.hpp:19,
                 from /usr/include/boost-1_49/boost/mpl/vector/aux_/iterator.hpp:19,
                 from /usr/include/boost-1_49/boost/mpl/vector/aux_/vector0.hpp:22,
                 from /usr/include/boost-1_49/boost/mpl/vector/aux_/clear.hpp:18,
                 from /usr/include/boost-1_49/boost/mpl/vector/vector0.hpp:24,
                 from /usr/include/boost-1_49/boost/mpl/vector/vector10.hpp:18,
                 from /usr/include/boost-1_49/boost/mpl/vector/vector20.hpp:18,
                 from /usr/include/boost-1_49/boost/python/detail/type_list.hpp:28,
                 from /usr/include/boost-1_49/boost/python/args.hpp:13,
                 from /usr/include/boost-1_49/boost/python.hpp:11,
                 from /var/tmp/portage/kde-base/kig-4.9.0/work/kig-4.9.0/scripting/python_scripter.cc:29:
/usr/include/boost-1_49/boost/mpl/has_xxx.hpp:344:9: warning: "BOOST_MPL_HAS_XXX_NO_EXPLICIT_TEST_FUNCTION" is not defined
/usr/include/boost-1_49/boost/mpl/has_xxx.hpp:357:9: warning: "BOOST_MPL_HAS_XXX_NO_WRAPPED_TYPES" is not defined
/usr/include/boost-1_49/boost/mpl/has_xxx.hpp:386:9: warning: "BOOST_MPL_HAS_XXX_NO_EXPLICIT_TEST_FUNCTION" is not defined
/usr/include/boost-1_49/boost/mpl/has_xxx.hpp:459:8: warning: "BOOST_MPL_HAS_XXX_NEEDS_TEMPLATE_SFINAE" is not defined
In file included from /usr/include/boost-1_49/boost/python/converter/arg_to_python.hpp:8:0,
                 from /usr/include/boost-1_49/boost/python/call.hpp:15,
                 from /usr/include/boost-1_49/boost/python/object_core.hpp:14,
                 from /usr/include/boost-1_49/boost/python/args.hpp:25,
                 from /usr/include/boost-1_49/boost/python.hpp:11,
                 from /var/tmp/portage/kde-base/kig-4.9.0/work/kig-4.9.0/scripting/python_scripter.cc:29:
/usr/include/boost-1_49/boost/python/ptr.hpp:14:6: warning: "_MSC_VER" is not defined
/usr/bin/cmake -E cmake_progress_report /var/tmp/portage/kde-base/kig-4.9.0/work/kig-4.9.0_build/CMakeFiles 99
[ 98%] Building CXX object CMakeFiles/kigpart.dir/scripting/script-common.o
/usr/bin/x86_64-pc-linux-gnu-g++  -DMAKE_KIGPART_LIB -D_BSD_SOURCE -D_XOPEN_SOURCE=500 -D_BSD_SOURCE -DQT_NO_STL -DQT_NO_CAST_TO_ASCII -D_REENTRANT -DKDE_DEPRECATED_WARNINGS -DKDE4_CMAKE_TOPLEVEL_DIR_LENGTH=40 -DQT_USE_FAST_CONCATENATION -DQT_USE_FAST_OPERATOR_PLUS  -DQT_NO_DEBUG -DNDEBUG -march=nocona -O2 -pipe  -Wnon-virtual-dtor -Wno-long-long -ansi -Wundef -Wcast-align -Wchar-subscripts -Wall -W -Wpointer-arith -Wformat-security -fno-exceptions -DQT_NO_EXCEPTIONS -fno-check-new -fno-common -Woverloaded-virtual -fno-threadsafe-statics -fvisibility=hidden -Werror=return-type -fvisibility-inlines-hidden -fPIC -I/var/tmp/portage/kde-base/kig-4.9.0/work/kig-4.9.0_build -I/var/tmp/portage/kde-base/kig-4.9.0/work/kig-4.9.0 -I/var/tmp/portage/kde-base/kig-4.9.0/work/kig-4.9.0/modes -I/usr/include/KDE -I/usr/include/qt4/QtXmlPatterns -I/usr/include/qt4/QtXml -I/usr/include/qt4/QtWebKit -I/usr/include/qt4/QtUiTools -I/usr/include/qt4/QtTest -I/usr/include/qt4/QtSvg -I/usr/include/qt4/QtSql -I/usr/include/qt4/QtScriptTools -I/usr/include/qt4/QtScript -I/usr/include/qt4/QtOpenGL -I/usr/include/qt4/QtNetwork -I/usr/include/qt4/QtMultimedia -I/usr/include/qt4/QtDesigner -I/usr/include/qt4/QtDeclarative -I/usr/include/qt4/QtDBus -I/usr/include/qt4/Qt3Support -I/usr/include/qt4/QtGui -I/usr/include/qt4/QtCore -I/usr/include/qt4/Qt -I/usr/share/qt4/mkspecs/default -I/usr/include/qt4 -I/usr/include/python2.7 -I/usr/include/boost-1_49    -D_GNU_SOURCE -D_LARGEFILE64_SOURCE -o CMakeFiles/kigpart.dir/scripting/script-common.o -c /var/tmp/portage/kde-base/kig-4.9.0/work/kig-4.9.0/scripting/script-common.cc
In file included from /usr/include/boost-1_49/boost/python/arg_from_python.hpp:9:0,
                 from /usr/include/boost-1_49/boost/python/detail/caller.hpp:20,
                 from /usr/include/boost-1_49/boost/python/object/function_handle.hpp:8,
                 from /usr/include/boost-1_49/boost/python/converter/arg_to_python.hpp:19,
                 from /usr/include/boost-1_49/boost/python/call.hpp:15,
                 from /usr/include/boost-1_49/boost/python/object_core.hpp:14,
                 from /usr/include/boost-1_49/boost/python/args.hpp:25,
                 from /usr/include/boost-1_49/boost/python.hpp:11,
                 from /var/tmp/portage/kde-base/kig-4.9.0/work/kig-4.9.0/scripting/python_scripter.cc:29:
/usr/include/boost-1_49/boost/python/converter/arg_from_python.hpp:118:6: warning: "BOOST_MSVC" is not defined
/usr/bin/cmake -E cmake_progress_report /var/tmp/portage/kde-base/kig-4.9.0/work/kig-4.9.0_build/CMakeFiles 100
[100%] Building CXX object CMakeFiles/kigpart.dir/scripting/script_mode.o
/usr/bin/x86_64-pc-linux-gnu-g++  -DMAKE_KIGPART_LIB -D_BSD_SOURCE -D_XOPEN_SOURCE=500 -D_BSD_SOURCE -DQT_NO_STL -DQT_NO_CAST_TO_ASCII -D_REENTRANT -DKDE_DEPRECATED_WARNINGS -DKDE4_CMAKE_TOPLEVEL_DIR_LENGTH=40 -DQT_USE_FAST_CONCATENATION -DQT_USE_FAST_OPERATOR_PLUS  -DQT_NO_DEBUG -DNDEBUG -march=nocona -O2 -pipe  -Wnon-virtual-dtor -Wno-long-long -ansi -Wundef -Wcast-align -Wchar-subscripts -Wall -W -Wpointer-arith -Wformat-security -fno-exceptions -DQT_NO_EXCEPTIONS -fno-check-new -fno-common -Woverloaded-virtual -fno-threadsafe-statics -fvisibility=hidden -Werror=return-type -fvisibility-inlines-hidden -fPIC -I/var/tmp/portage/kde-base/kig-4.9.0/work/kig-4.9.0_build -I/var/tmp/portage/kde-base/kig-4.9.0/work/kig-4.9.0 -I/var/tmp/portage/kde-base/kig-4.9.0/work/kig-4.9.0/modes -I/usr/include/KDE -I/usr/include/qt4/QtXmlPatterns -I/usr/include/qt4/QtXml -I/usr/include/qt4/QtWebKit -I/usr/include/qt4/QtUiTools -I/usr/include/qt4/QtTest -I/usr/include/qt4/QtSvg -I/usr/include/qt4/QtSql -I/usr/include/qt4/QtScriptTools -I/usr/include/qt4/QtScript -I/usr/include/qt4/QtOpenGL -I/usr/include/qt4/QtNetwork -I/usr/include/qt4/QtMultimedia -I/usr/include/qt4/QtDesigner -I/usr/include/qt4/QtDeclarative -I/usr/include/qt4/QtDBus -I/usr/include/qt4/Qt3Support -I/usr/include/qt4/QtGui -I/usr/include/qt4/QtCore -I/usr/include/qt4/Qt -I/usr/share/qt4/mkspecs/default -I/usr/include/qt4 -I/usr/include/python2.7 -I/usr/include/boost-1_49    -D_GNU_SOURCE -D_LARGEFILE64_SOURCE -o CMakeFiles/kigpart.dir/scripting/script_mode.o -c /var/tmp/portage/kde-base/kig-4.9.0/work/kig-4.9.0/scripting/script_mode.cc
In file included from /usr/include/boost-1_49/boost/python/args.hpp:25:0,
                 from /usr/include/boost-1_49/boost/python.hpp:11,
                 from /var/tmp/portage/kde-base/kig-4.9.0/work/kig-4.9.0/scripting/python_scripter.cc:29:
/usr/include/boost-1_49/boost/python/object_core.hpp:222:6: warning: "__MWERKS__" is not defined
In file included from /var/tmp/portage/kde-base/kig-4.9.0/work/kig-4.9.0/scripting/script_mode.cc:18:0:
/var/tmp/portage/kde-base/kig-4.9.0/work/kig-4.9.0/scripting/../modes/base_mode.h:42:8: warning: ‘virtual void BaseMode::midClicked(QMouseEvent*, KigWidget*)’ was hidden
/var/tmp/portage/kde-base/kig-4.9.0/work/kig-4.9.0/scripting/script_mode.h:61:8: warning:   by ‘virtual void ScriptModeBase::midClicked(const QPoint&, KigWidget&)’
/var/tmp/portage/kde-base/kig-4.9.0/work/kig-4.9.0/scripting/../modes/base_mode.h:44:8: warning: ‘virtual void BaseMode::rightClicked(QMouseEvent*, KigWidget*)’ was hidden
/var/tmp/portage/kde-base/kig-4.9.0/work/kig-4.9.0/scripting/script_mode.h:62:8: warning:   by ‘virtual void ScriptModeBase::rightClicked(const std::vector<ObjectHolder*>&, const QPoint&, KigWidget&)’
/var/tmp/portage/kde-base/kig-4.9.0/work/kig-4.9.0/scripting/../modes/base_mode.h:45:8: warning: ‘virtual void BaseMode::mouseMoved(QMouseEvent*, KigWidget*)’ was hidden
/var/tmp/portage/kde-base/kig-4.9.0/work/kig-4.9.0/scripting/script_mode.h:59:8: warning:   by ‘virtual void ScriptModeBase::mouseMoved(const std::vector<ObjectHolder*>&, const QPoint&, KigWidget&, bool)’
In file included from /usr/include/boost-1_49/boost/python/operators.hpp:18:0,
                 from /usr/include/boost-1_49/boost/python.hpp:50,
                 from /var/tmp/portage/kde-base/kig-4.9.0/work/kig-4.9.0/scripting/python_scripter.cc:29:
/usr/include/boost-1_49/boost/python/other.hpp:10:6: warning: "_MSC_VER" is not defined
Linking CXX shared module lib/kigpart.so
/usr/bin/cmake -E cmake_link_script CMakeFiles/kigpart.dir/link.txt --verbose=1
/usr/bin/x86_64-pc-linux-gnu-g++  -fPIC -march=nocona -O2 -pipe  -Wnon-virtual-dtor -Wno-long-long -ansi -Wundef -Wcast-align -Wchar-subscripts -Wall -W -Wpointer-arith -Wformat-security -fno-exceptions -DQT_NO_EXCEPTIONS -fno-check-new -fno-common -Woverloaded-virtual -fno-threadsafe-statics -fvisibility=hidden -Werror=return-type -fvisibility-inlines-hidden -Wl,--enable-new-dtags -Wl,--fatal-warnings -Wl,--no-undefined -lc  -Wl,-O1 -Wl,--as-needed -shared -Wl,-soname,kigpart.so -o lib/kigpart.so CMakeFiles/kigpart.dir/kigpart_automoc.o CMakeFiles/kigpart.dir/objects/angle_type.o CMakeFiles/kigpart.dir/objects/arc_type.o CMakeFiles/kigpart.dir/objects/base_type.o CMakeFiles/kigpart.dir/objects/bogus_imp.o CMakeFiles/kigpart.dir/objects/centerofcurvature_type.o CMakeFiles/kigpart.dir/objects/circle_imp.o CMakeFiles/kigpart.dir/objects/circle_type.o CMakeFiles/kigpart.dir/objects/common.o CMakeFiles/kigpart.dir/objects/conic_imp.o CMakeFiles/kigpart.dir/objects/conic_types.o CMakeFiles/kigpart.dir/objects/cubic_imp.o CMakeFiles/kigpart.dir/objects/cubic_type.o CMakeFiles/kigpart.dir/objects/curve_imp.o CMakeFiles/kigpart.dir/objects/intersection_types.o CMakeFiles/kigpart.dir/objects/inversion_type.o CMakeFiles/kigpart.dir/objects/line_imp.o CMakeFiles/kigpart.dir/objects/line_type.o CMakeFiles/kigpart.dir/objects/locus_imp.o CMakeFiles/kigpart.dir/objects/object_calcer.o CMakeFiles/kigpart.dir/objects/object_drawer.o CMakeFiles/kigpart.dir/objects/object_factory.o CMakeFiles/kigpart.dir/objects/object_holder.o CMakeFiles/kigpart.dir/objects/object_imp.o CMakeFiles/kigpart.dir/objects/object_imp_factory.o CMakeFiles/kigpart.dir/objects/object_type.o CMakeFiles/kigpart.dir/objects/object_type_factory.o CMakeFiles/kigpart.dir/objects/other_imp.o CMakeFiles/kigpart.dir/objects/other_type.o CMakeFiles/kigpart.dir/objects/point_imp.o CMakeFiles/kigpart.dir/objects/point_type.o CMakeFiles/kigpart.dir/objects/polygon_imp.o CMakeFiles/kigpart.dir/objects/polygon_type.o CMakeFiles/kigpart.dir/objects/bezier_imp.o CMakeFiles/kigpart.dir/objects/bezier_type.o CMakeFiles/kigpart.dir/objects/special_imptypes.o CMakeFiles/kigpart.dir/objects/tangent_type.o CMakeFiles/kigpart.dir/objects/tests_type.o CMakeFiles/kigpart.dir/objects/text_imp.o CMakeFiles/kigpart.dir/objects/text_type.o CMakeFiles/kigpart.dir/objects/transform_types.o CMakeFiles/kigpart.dir/objects/vector_type.o CMakeFiles/kigpart.dir/misc/argsparser.o CMakeFiles/kigpart.dir/misc/builtin_stuff.o CMakeFiles/kigpart.dir/misc/calcpaths.o CMakeFiles/kigpart.dir/misc/common.o CMakeFiles/kigpart.dir/misc/conic-common.o CMakeFiles/kigpart.dir/misc/coordinate.o CMakeFiles/kigpart.dir/misc/coordinate_system.o CMakeFiles/kigpart.dir/misc/cubic-common.o CMakeFiles/kigpart.dir/misc/equation.o CMakeFiles/kigpart.dir/misc/goniometry.o CMakeFiles/kigpart.dir/misc/guiaction.o CMakeFiles/kigpart.dir/misc/kigcoordinateprecisiondialog.o CMakeFiles/kigpart.dir/misc/kigfiledialog.o CMakeFiles/kigpart.dir/misc/kiginputdialog.o CMakeFiles/kigpart.dir/misc/kignumerics.o CMakeFiles/kigpart.dir/misc/kigpainter.o CMakeFiles/kigpart.dir/misc/kigtransform.o CMakeFiles/kigpart.dir/misc/lists.o CMakeFiles/kigpart.dir/misc/object_constructor.o CMakeFiles/kigpart.dir/misc/object_hierarchy.o CMakeFiles/kigpart.dir/misc/rect.o CMakeFiles/kigpart.dir/misc/screeninfo.o CMakeFiles/kigpart.dir/misc/special_constructors.o CMakeFiles/kigpart.dir/misc/unit.o CMakeFiles/kigpart.dir/modes/base_mode.o CMakeFiles/kigpart.dir/modes/construct_mode.o CMakeFiles/kigpart.dir/modes/dragrectmode.o CMakeFiles/kigpart.dir/modes/edittype.o CMakeFiles/kigpart.dir/modes/historydialog.o CMakeFiles/kigpart.dir/modes/label.o CMakeFiles/kigpart.dir/modes/linkslabel.o CMakeFiles/kigpart.dir/modes/macro.o CMakeFiles/kigpart.dir/modes/macrowizard.o CMakeFiles/kigpart.dir/modes/mode.o CMakeFiles/kigpart.dir/modes/moving.o CMakeFiles/kigpart.dir/modes/normal.o CMakeFiles/kigpart.dir/modes/popup.o CMakeFiles/kigpart.dir/modes/textlabelwizard.o CMakeFiles/kigpart.dir/modes/typesdialog.o CMakeFiles/kigpart.dir/filters/asyexporter.o CMakeFiles/kigpart.dir/filters/asyexporteroptions.o CMakeFiles/kigpart.dir/filters/asyexporterimpvisitor.o CMakeFiles/kigpart.dir/filters/cabri-filter.o CMakeFiles/kigpart.dir/filters/cabri-utils.o CMakeFiles/kigpart.dir/filters/drgeo-filter.o CMakeFiles/kigpart.dir/filters/exporter.o CMakeFiles/kigpart.dir/filters/filter.o CMakeFiles/kigpart.dir/filters/filters-common.o CMakeFiles/kigpart.dir/filters/imageexporteroptions.o CMakeFiles/kigpart.dir/filters/kgeo-filter.o CMakeFiles/kigpart.dir/filters/kseg-filter.o CMakeFiles/kigpart.dir/filters/latexexporter.o CMakeFiles/kigpart.dir/filters/latexexporteroptions.o CMakeFiles/kigpart.dir/filters/native-filter.o CMakeFiles/kigpart.dir/filters/pgfexporterimpvisitor.o CMakeFiles/kigpart.dir/filters/svgexporter.o CMakeFiles/kigpart.dir/filters/svgexporteroptions.o CMakeFiles/kigpart.dir/filters/xfigexporter.o CMakeFiles/kigpart.dir/kig/kig_commands.o CMakeFiles/kigpart.dir/kig/kig_document.o CMakeFiles/kigpart.dir/kig/kig_part.o CMakeFiles/kigpart.dir/kig/kig_view.o CMakeFiles/kigpart.dir/scripting/newscriptwizard.o CMakeFiles/kigpart.dir/scripting/python_scripter.o CMakeFiles/kigpart.dir/scripting/python_type.o CMakeFiles/kigpart.dir/scripting/script-common.o CMakeFiles/kigpart.dir/scripting/script_mode.o -L/usr/lib64/qt4 /usr/lib64/libkparts.so.4.9.0 /usr/lib64/libkutils.so.4.9.0 -lpython2.7 optimized -lboost_python-2.7-mt-1_49 /usr/lib64/libktexteditor.so.4.9.0 /usr/lib64/libkemoticons.so.4.9.0 /usr/lib64/libkidletime.so.4.9.0 /usr/lib64/libkcmutils.so.4.9.0 /usr/lib64/libkprintutils.so.4.9.0 /usr/lib64/libkparts.so.4.9.0 /usr/lib64/libkio.so.5.9.0 /usr/lib64/qt4/libQtNetwork.so /usr/lib64/qt4/libQtXml.so /usr/lib64/libnepomukutils.so.4.9.0 /usr/lib64/libnepomuk.so.4.9.0 /usr/lib64/libkdeui.so.5.9.0 /usr/lib64/qt4/libQtGui.so /usr/lib64/qt4/libQtSvg.so -lsoprano /usr/lib64/libkdecore.so.5.9.0 /usr/lib64/qt4/libQtCore.so -lpthread /usr/lib64/qt4/libQtDBus.so -Wl,-rpath,/usr/lib64/qt4:
x86_64-pc-linux-gnu-g++: optimized: No such file or directory
make[2]: *** [lib/kigpart.so] Error 1
make[2]: Leaving directory `/var/tmp/portage/kde-base/kig-4.9.0/work/kig-4.9.0_build'
make[1]: *** [CMakeFiles/kigpart.dir/all] Error 2
make[1]: Leaving directory `/var/tmp/portage/kde-base/kig-4.9.0/work/kig-4.9.0_build'
make: *** [all] Error 2
 * ERROR: kde-base/kig-4.9.0 failed (compile phase):
 *   emake failed
 *
 * If you need support, post the output of `emerge --info '=kde-base/kig-4.9.0'`,
 * the complete build log and the output of `emerge -pqv '=kde-base/kig-4.9.0'`.
 * The complete build log is located at '/var/tmp/portage/kde-base/kig-4.9.0/temp/build.log'.
 * The ebuild environment file is located at '/var/tmp/portage/kde-base/kig-4.9.0/temp/environment'.
 * Working directory: '/var/tmp/portage/kde-base/kig-4.9.0/work/kig-4.9.0_build'
 * S: '/var/tmp/portage/kde-base/kig-4.9.0/work/kig-4.9.0'

Hm, normal sollte sich kig-4.9.0 mit boost-1.49.0-r1 problemlos bauen lassen (hier tut es das auf amd64)
python-updater und revdep-rebuild hast du sauber durch?
Interessant wäre auch noch was für eine boost Version gesetzt ist - siehe eselect boost list

PS: Bei solchen Fehlern ist es idR auch hilfreich (wie im build.log empfohlen) die emerge --info mit bereitzustellen :)
Back to top
View user's profile Send private message
franzf
Advocate
Advocate


Joined: 29 Mar 2005
Posts: 3949
Location: Irgendwo im Nirgendwo

PostPosted: Thu Aug 16, 2012 12:32 pm    Post subject: Reply with quote

Interessant wäre ein
Code:
pkg-config --libs python-2.7

_________________
"der mac dennoch wesen geil"
Wolfram von Eschenbach, Parzival (Buch 1, Z. 7).
Ein frühes Statement gegen Windows.

My overlay
Back to top
View user's profile Send private message
Gladdle
Apprentice
Apprentice


Joined: 27 Jul 2008
Posts: 177
Location: Bietigheim- Bissingen

PostPosted: Fri Aug 17, 2012 5:48 pm    Post subject: Reply with quote

Josef.95 wrote:
python-updater und revdep-rebuild hast du sauber durch?

Jupp, Problemlos, habe Python 2.7 und 3.2 Probiert (zuerst eselect python und dann python-update), dasselbe Ergebniss.


Josef.95 wrote:
Interessant wäre auch noch was für eine boost Version gesetzt ist - siehe eselect boost list
Code:
eselect boost list
Available boost versions:
  [1]   boost-1.49/default *



Josef.95 wrote:
PS: Bei solchen Fehlern ist es idR auch hilfreich (wie im build.log empfohlen) die emerge --info mit bereitzustellen :)

Siehe meine Signatur ;)
http://phpmygentoo.rainyday-productions.de/acer-aspire-9920g/emerge--info.txt


franzf wrote:
Interessant wäre ein
Code:
pkg-config --libs python-2.7
Code:
# pkg-config --libs python-2.7
-lpython2.7 
# pkg-config --libs python-3.2
-lpython3.2

_________________
Meine Gentoo Linux Konfiguration: Notebook (ACER Aspire 9920G)
Back to top
View user's profile Send private message
Josef.95
Advocate
Advocate


Joined: 03 Sep 2007
Posts: 2288
Location: Germany

PostPosted: Fri Aug 17, 2012 6:59 pm    Post subject: Reply with quote

Gladdle wrote:
Josef.95 wrote:
PS: Bei solchen Fehlern ist es idR auch hilfreich (wie im build.log empfohlen) die emerge --info mit bereitzustellen :)

Siehe meine Signatur ;)
http://phpmygentoo.rainyday-productions.de/acer-aspire-9920g/emerge--info.txt
Es ist meist keine gute Idee solche Infos in der Signatur bereitzustellen, da sie i.d.R. nie aktuell sind.
Code:
Timestamp of tree: Tue, 14 Jun 2011 15:30:01 +0000
Passt doch wahrscheinlich nicht wirklich, oder? ;)
Poste am besten wie in der portage Message angegeben die aktuelle
Code:
* If you need support, post the output of `emerge --info '=kde-base/kig-4.9.0'
Back to top
View user's profile Send private message
Gladdle
Apprentice
Apprentice


Joined: 27 Jul 2008
Posts: 177
Location: Bietigheim- Bissingen

PostPosted: Fri Aug 17, 2012 7:19 pm    Post subject: Reply with quote

Ich werde nachher die Datei Updaten. In der zwischenzeit hier der Output:
Code:
Portage 2.1.11.10 (default/linux/amd64/10.0, gcc-4.5.4, glibc-2.15-r2, 3.3.1-gentoo x86_64)
=================================================================
                         System Settings
=================================================================
System uname: Linux-3.3.1-gentoo-x86_64-Intel-R-_Core-TM-2_Duo_CPU_T7700_@_2.40GHz-with-gentoo-2.1
Timestamp of tree: Fri, 17 Aug 2012 16:30:01 +0000
ccache version 3.1.8 [disabled]
app-shells/bash:          4.2_p37
dev-java/java-config:     2.1.12
dev-lang/python:          2.7.3-r2, 3.2.3-r1
dev-util/ccache:          3.1.8
dev-util/cmake:           2.8.8-r3
dev-util/pkgconfig:       0.27
sys-apps/baselayout:      2.1-r1
sys-apps/openrc:          0.10.5
sys-apps/sandbox:         2.6
sys-devel/autoconf:       2.13, 2.69
sys-devel/automake:       1.10.3, 1.11.6, 1.12.3
sys-devel/binutils:       2.22.90
sys-devel/gcc:            4.5.4, 4.6.3
sys-devel/gcc-config:     1.7.3
sys-devel/libtool:        2.4.2
sys-devel/make:           3.82-r3
sys-kernel/linux-headers: 3.5 (virtual/os-headers)
sys-libs/glibc:           2.15-r2
Repositories: gentoo sunrise games zugaina harsesiServer
ACCEPT_KEYWORDS="amd64 ~amd64"
ACCEPT_LICENSE="*"
CBUILD="x86_64-pc-linux-gnu"
CFLAGS="-march=nocona -O2 -pipe"
CHOST="x86_64-pc-linux-gnu"
CONFIG_PROTECT="/etc /usr/share/config /usr/share/gnupg/qualified.txt /usr/share/openvpn/easy-rsa /var/lib/hsqldb"
CONFIG_PROTECT_MASK="${EPREFIX}/etc/gconf /etc/ca-certificates.conf /etc/env.d /etc/fonts/fonts.conf /etc/gconf /etc/gentoo-release /etc/php/apache2-php5.4/ext-active/ /etc/php/cgi-php5.4/ext-active/ /etc/php/cli-php5.4/ext-active/ /etc/revdep-rebuild /etc/sandbox.d /etc/terminfo"
CXXFLAGS="-march=nocona -O2 -pipe"
DISTDIR="/usr/portage/distfiles"
EMERGE_DEFAULT_OPTS="--keep-going --quiet-build=y"
FCFLAGS="-O2 -pipe"
FEATURES="assume-digests binpkg-logs config-protect-if-modified distlocks ebuild-locks fixlafiles news parallel-fetch parse-eapi-ebuild-head protect-owned sandbox sfperms strict unknown-features-warn unmerge-logs unmerge-orphans userfetch"
FFLAGS="-O2 -pipe"
GENTOO_MIRRORS="http://distfiles.gentoo.org"
LANG="de_DE.UTF-8"
LC_ALL="de_DE.UTF-8"
LDFLAGS="-Wl,-O1 -Wl,--as-needed"
LINGUAS="de jp us"
MAKEOPTS="-j3"
PKGDIR="/usr/portage/packages"
PORTAGE_CONFIGROOT="/"
PORTAGE_RSYNC_OPTS="--recursive --links --safe-links --perms --times --compress --force --whole-file --delete --stats --human-readable --timeout=180 --exclude=/distfiles --exclude=/local --exclude=/packages"
PORTAGE_TMPDIR="/var/tmp"
PORTDIR="/usr/portage"
PORTDIR_OVERLAY="/var/lib/layman/sunrise /var/lib/layman/games /var/lib/layman/zugaina /usr/local/portage/overlay"
SYNC="rsync://rsync.gentoo.org/gentoo-portage"
USE="3dnow 64bit 7zip X a52 aac aalib accessibility acl acpi adns alsa amd64 apache2 apm arj arts atmo audiofile authfile automount avi berkdb big-tables bitmap-fonts branding bzip bzip2 bzlib canna cdda cddb cdio cdr cgi cjk clamav cli cracklib crypt css cxx dba dbus dedicated device-mapper dga dirac divx4linux dri dv dvd dvdnav dvdr dvdread dvi editor encode examples exif fat ffmpeg flac flash fluidsynth fontconfig fortran fpx freewnn ftp gd gdbm geoip ggi gif gphoto2 gpm gs gth gtk hddtemp httpd iconv icq id3tag imap imlib immqt-bc ipv6 ipw4965 jabber java javascript jfs jingle joystick jpeg jpeg* jpeg2k kate kde kdehiddenvisibility lame lash lcms ldap lesstif libass libgt++ libnotify libv4l2 libwww lirc logitech-mouse mad maildir matroska mbox mikmod mime ming mmx mng modules mozilla mp3 mp4 mpeg msn mudflap multilib musepack mysql mysqli ncurses networkmanager nls nocd nptl nsplugin nspluginwrapper ntfs nvidia oav odbc ogg oggvorbis openal opengl openmp oscar pam pam-mysql pcmcia pcre pdf php png pnp posix pppd pulseaudio pvr python qt qt3support qt4 qtcdr quicktime raw readline real* rss samba sasl scanner schroedinger screen sdl seamonkey secure-delete semantic-desktop server session sharedmem skins slang sndfile snmp sockets sound speex spell spl sqlite sse sse2 ssl stream svg syslog systray tcpd theora tidy tiff tokenizer truetype twolame type1 udev unicode usb v4l v4l2 vcd vcd* vcdinfo vcdx vhosts videos visualization vorbis wavpack wifi wireshark wlan wmf wxwindows x x264 x509 xcomposite xfce xfs xhtml xinerama xml xml2 xmlreader xmlrpc xmlwriter xpm xsl xv xvid yahoo zip zlib zvbi" ALSA_CARDS="hda-intel" ALSA_PCM_PLUGINS="adpcm alaw asym copy dmix dshare dsnoop empty extplug file hooks iec958 ioplug ladspa lfloat linear meter mmap_emul mulaw multi null plug rate route share shm softvol" APACHE2_MODULES="actions alias auth_basic auth_digest authn_anon authn_dbd authn_dbm authn_default authn_file authz_dbm authz_default authz_groupfile authz_host authz_owner authz_user autoindex cache dav dav_fs dav_lock dbd deflate dir disk_cache env expires ext_filter file_cache filter headers ident imagemap include info log_config logio mem_cache mime mime_magic negotiation proxy proxy_ajp proxy_balancer proxy_connect proxy_http rewrite setenvif so speling status unique_id userdir usertrack vhost_alias" CALLIGRA_FEATURES="kexi words flow plan sheets stage tables krita karbon braindump" CAMERAS="ptp2" COLLECTD_PLUGINS="df interface irq load memory rrdtool swap syslog" ELIBC="glibc" GPSD_PROTOCOLS="ashtech aivdm earthmate evermore fv18 garmin garmintxt gpsclock itrax mtk3301 nmea ntrip navcom oceanserver oldstyle oncore rtcm104v2 rtcm104v3 sirf superstar2 timing tsip tripmate tnt ubx" INPUT_DEVICES="evdev joystick keyboard mouse synaptics" KERNEL="linux" LCD_DEVICES="bayrad cfontz cfontz633 glk hd44780 lb216 lcdm001 mtxorb ncurses text" LIBREOFFICE_EXTENSIONS="presenter-console presenter-minimizer" LINGUAS="de jp us" NETBEANS_MODULES="apisupport cnd enterprise java mobility php profiler websvccommon" PHP_TARGETS="php5-3" PYTHON_TARGETS="python3_2 python2_7" RUBY_TARGETS="ruby18 ruby19" USERLAND="GNU" VIDEO_CARDS="vesa v4l v4l2 nvidia" XTABLES_ADDONS="quota2 psd pknock lscan length2 ipv4options ipset ipp2p iface geoip fuzzy condition tee tarpit sysrq steal rawnat logmark ipmark dhcpmac delude chaos account"
Unset:  CPPFLAGS, CTARGET, INSTALL_MASK, PORTAGE_BUNZIP2_COMMAND, PORTAGE_COMPRESS, PORTAGE_COMPRESS_FLAGS, PORTAGE_RSYNC_EXTRA_OPTS, USE_PYTHON

_________________
Meine Gentoo Linux Konfiguration: Notebook (ACER Aspire 9920G)
Back to top
View user's profile Send private message
franzf
Advocate
Advocate


Joined: 29 Mar 2005
Posts: 3949
Location: Irgendwo im Nirgendwo

PostPosted: Sat Aug 18, 2012 6:11 am    Post subject: Reply with quote

Gibt denn
Code:
pkg-config --libs python

sowas wie
Code:
-lpython2.7 optimized

aus?
Denn irgendwie muss sich da das "optimized" einschleichen, und FindBoostPython.cmake macht nichts anderes als eine Latte von python-Namen in "pkg-config --libs" zu werfen (indirekt über FindPkgConfig.cmake).

Außerdem dürfte es gar nicht mit scripting bauen, denn FindBoostPython.cmake testetauf libs, die gar nicht in Gentoo installieren, und es wird seitens Gentoo auch nichts gepatcht:
Code:
set(PYTHON_LIBS "boost_python-gcc-mt;boost_python-mt;boost_python-gcc-mt-1_33;boost_python-gcc-mt-1_33_1;boost_python;boost_python-gcc-mt-1_32;boost_python")

aber Gentoo installiert nur versionierte boost_python-libs:
/usr/lib64/boost-1_49/libboost_python-2.7.so -> ../libboost_python-2.7-1_49.so
usw.

Ich bin mir mittlerweile zu 99,9% sicher, dass hier wieder der Klassiker "ich installier das mal selber ohne portage" vorliegt.
Schau mal nach /usr/local/lib64/pkgconfig, ob da ominöse python[2.7].pc rumliegen, ebenso ob da irgend was von boost rumliegt. Wenn nicht hast du hier vllt. sogar nach /usr (statt nach /usr/local) installiert :/ Da wird Aufräumen schwer...
Schau dir auch mal in /usr/lib64/pkgconfig die ganzen python*.pc an, ob du da was Verdächtiges findest.
_________________
"der mac dennoch wesen geil"
Wolfram von Eschenbach, Parzival (Buch 1, Z. 7).
Ein frühes Statement gegen Windows.

My overlay
Back to top
View user's profile Send private message
Display posts from previous:   
Reply to topic    Gentoo Forums Forum Index Deutsches Forum (German) All times are GMT
Page 1 of 1

 
Jump to:  
You cannot post new topics in this forum
You cannot reply to topics in this forum
You cannot edit your posts in this forum
You cannot delete your posts in this forum
You cannot vote in polls in this forum