Gentoo Forums
Gentoo Forums
Gentoo Forums
Quick Search: in
kde-base/superkaramba-3.5.10 failed [bar_python.o] Error 1
View unanswered posts
View posts from last 24 hours

 
Reply to topic    Gentoo Forums Forum Index Unsupported Software
View previous topic :: View next topic  
Author Message
padoor
Advocate
Advocate


Joined: 30 Dec 2005
Posts: 3993
Location: india

PostPosted: Thu Jul 26, 2012 1:34 pm    Post subject: kde-base/superkaramba-3.5.10 failed [bar_python.o] Error 1 Reply with quote

Code:
usr/qt/3/include -I.     -DQT_THREAD_SUPPORT  -D_REENTRANT  -Wno-long-long -Wundef -ansi -D_XOPEN_SOURCE=500 -D_BSD_SOURCE -Wcast-align -Wchar-subscripts -Wall -W -Wpointer-arith -DNDEBUG -DNO_DEBUG -O2 -O2 -march=i686 -pipe -Wformat-security -Wmissing-format-attribute -Wno-non-virtual-dtor -fno-exceptions -fno-check-new -fno-common -DQT_CLEAN_NAMESPACE -DQT_NO_ASCII_CAST -DQT_NO_STL -DQT_NO_COMPAT -DQT_NO_TRANSLATION  -c -o bar_python.o bar_python.cpp
bar_python.cpp:27:20: fatal error: Python.h: No such file or directory
compilation terminated.
make[1]: *** [bar_python.o] Error 1
make[1]: Leaving directory `/var/tmp/portage/kde-base/superkaramba-3.5.10/work/superkaramba-3.5.10/superkaramba/src'
make: *** [install-recursive] Error 1
emake failed
 * ERROR: kde-base/superkaramba-3.5.10 failed (install phase):
 *   emake install failed.
 *


tux ramaswamy # eselect python list
Available Python interpreters:
[1] python2.7 *
[2] python3.2
tux ramaswamy #
what other python.o it would be looking for?
_________________
reach out a little bit more to catch it (DON'T BELIEVE the advocate part under my user name)
Back to top
View user's profile Send private message
Display posts from previous:   
Reply to topic    Gentoo Forums Forum Index Unsupported Software All times are GMT
Page 1 of 1

 
Jump to:  
You cannot post new topics in this forum
You cannot reply to topics in this forum
You cannot edit your posts in this forum
You cannot delete your posts in this forum
You cannot vote in polls in this forum