Gentoo Forums
Gentoo Forums
Gentoo Forums
Quick Search: in
Last emerge --sync was....
View unanswered posts
View posts from last 24 hours

 
Reply to topic    Gentoo Forums Forum Index Gentoo on Sparc
View previous topic :: View next topic  
Author Message
freke
Apprentice
Apprentice


Joined: 23 Jan 2003
Posts: 152

PostPosted: Fri Jun 22, 2012 3:32 pm    Post subject: Last emerge --sync was.... Reply with quote

Not every day I boot my Sun E450 obviously, never noticed this before though :)

Code:
 * Last emerge --sync was 155d 15h 52m 25s ago.


I'll let you know how it all turned out :)

Code:
These are the packages that would be merged, in order:

Calculating dependencies... done!
[ebuild     U  ] sys-kernel/linux-headers-3.1 [2.6.39] 4,706 kB
[ebuild     U  ] sys-libs/glibc-2.14.1-r3 [2.13-r4] USE="-debug -gd (-hardened) (-multilib) -profile (-selinux) -vanilla (-glibc-omitfp%)" 16,064 kB
[ebuild     U  ] sys-libs/zlib-1.2.5.1-r1 [1.2.5-r2] 536 kB
[ebuild     U  ] sys-devel/gnuconfig-20120116 [20110202] 51 kB
[ebuild     U  ] dev-libs/expat-2.1.0 [2.0.1-r5] USE="unicode%* -examples -static-libs" 550 kB
[ebuild     U  ] sys-devel/gcc-config-1.5-r2 [1.4.1-r1] 0 kB
[ebuild     U  ] sys-libs/timezone-data-2012c [2011n] USE="nls" 334 kB
[ebuild     U  ] sys-devel/autoconf-wrapper-12 [10-r1] 0 kB
[ebuild     U  ] sys-devel/automake-wrapper-6 [5] 0 kB
[ebuild     U  ] dev-libs/libffi-3.0.10 [3.0.9-r2] USE="-debug -static-libs -test" 736 kB
[ebuild     U  ] sys-process/lsof-4.85-r2 [4.83] USE="ipv6%* -examples% -rpc% (-selinux) -static" 746 kB
[ebuild     U  ] sys-apps/pciutils-3.1.9-r1 [3.1.7] USE="zlib -compress-db% -network-cron -static-libs%" 333 kB
[ebuild  N     ] virtual/modutils-0  0 kB
[ebuild     U  ] app-admin/metalog-2 [1] USE="unicode" 335 kB
[ebuild     U  ] net-misc/rsync-3.0.9 [3.0.8] USE="iconv ipv6 -acl -static -xattr" 775 kB
[ebuild     U  ] app-shells/bash-4.2_p20 [4.1_p9] USE="net nls (-afs) -bashlogger -examples -mem-scramble -plugins -vanilla" 6,888 kB
[ebuild     U  ] sys-auth/pambase-20101024-r2 [20101024] USE="cracklib sha512 -consolekit -debug -gnome-keyring -minimal -mktemp -pam_krb5 -pam_ssh -passwdqc (-selinux)" 0 kB
[ebuild   R    ] sys-apps/busybox-1.19.3-r1  USE="ipv6 pam -livecd% -make-symlinks -mdev -savedconfig (-selinux) -static" 0 kB
[ebuild  N     ] virtual/shadow-0  0 kB
[ebuild     U  ] sys-apps/baselayout-2.1-r1 [2.0.3] USE="-build" 40 kB
[ebuild     U  ] sys-apps/man-pages-3.40 [3.32] USE="nls" LINGUAS="-da -de -fr -it -ja -nl -pl -ro -ru -zh_CN (-cs%)" 1,684 kB
[ebuild     U  ] sys-apps/openrc-0.9.8.4 [0.9.4] USE="ncurses pam unicode -debug (-selinux) -static-libs%" 163 kB
[ebuild     U  ] dev-libs/openssl-1.0.0j [1.0.0f-r1] USE="zlib -bindist -gmp -kerberos -rfc3779 (-sse2) -static-libs -test" 3,953 kB
[ebuild     U  ] dev-libs/libtasn1-2.12 [2.9-r1] USE="-doc -static-libs" 1,906 kB
[ebuild  N     ] dev-perl/YAML-Syck-1.200.0  161 kB
[ebuild     U  ] dev-perl/Net-Daemon-0.480.0 [0.43] 29 kB
[ebuild  N     ] dev-perl/XML-Parser-2.410.0  233 kB
[ebuild  N     ] virtual/perl-Digest-SHA-5.47  0 kB
[ebuild  N     ] perl-core/Test-Harness-3.230.0  288 kB
[ebuild     U  ] virtual/perl-File-Temp-0.220.0-r2 [0.220.0-r1] 0 kB
[ebuild     U  ] perl-core/Time-Local-1.200.0 [1.19.01] 19 kB
[ebuild     U  ] virtual/perl-Text-Balanced-2.20.0-r2 [2.20.0-r1] 0 kB
[ebuild     U  ] virtual/perl-Getopt-Long-2.380.0-r2 [2.380.0-r1] 0 kB
[ebuild     U  ] virtual/perl-Scalar-List-Utils-1.230.0-r2 [1.230.0-r1] 0 kB
[ebuild     U  ] dev-perl/HTML-Parser-3.690.0 [3.670.0] USE="-test" 88 kB
[ebuild     U  ] virtual/perl-JSON-PP-2.272.0-r1 [2.272.0] 0 kB
[ebuild     U  ] virtual/perl-Time-Local-1.200.0-r2 [1.19.01] 0 kB
[ebuild     U  ] virtual/perl-Sys-Syslog-0.290.0-r1 [0.290.0] 0 kB
[ebuild     U  ] virtual/perl-Test-Harness-3.230.0-r3 [3.17] 0 kB
[ebuild     U  ] virtual/perl-Perl-OSType-1.2.0-r1 [1.2.0] 0 kB
[ebuild     U  ] dev-perl/Digest-SHA1-2.130.0 [2.12] 39 kB
[ebuild     U  ] virtual/perl-Digest-MD5-2.510.0-r2 [2.510.0-r1] 0 kB
[ebuild     U  ] dev-perl/DBI-1.618.0 [1.615] USE="-test" 570 kB
[ebuild     U  ] dev-perl/Digest-HMAC-1.30.0 [1.01-r1] 8 kB
[ebuild     U  ] dev-perl/DateManip-6.310.0 [5.56] USE="-test" 1,566 kB
[ebuild     U  ] dev-libs/libxml2-2.8.0_rc1 [2.7.8-r4] USE="ipv6 readline -debug -doc -examples -icu -lzma% -python -static-libs -test" 4,795 kB
[ebuild  N     ] dev-libs/nettle-2.4  USE="gmp ssl" 1,051 kB
[ebuild     U  ] net-analyzer/net-snmp-5.4.2.1-r5 [5.4.2.1-r4] USE="bzip2 ipv6 ssl tcpd zlib -X -diskio -doc -elf -extensible (-lm_sensors) -mfd-rewrites -minimal -perl -python -rpm (-selinux) -sendmail -smux" 0 kB
[ebuild   R    ] sys-devel/gettext-0.18.1.1-r1  USE="cxx nls openmp -acl -doc -emacs -git*" 0 kB
[ebuild     U  ] net-misc/ntp-4.2.6_p5-r1 [4.2.6_p3] USE="ipv6 snmp ssl -caps -debug -openntpd (-parse-clocks) -samba% (-selinux) -vim-syntax -zeroconf" 4,151 kB
[ebuild   R    ] sys-devel/binutils-2.21.1-r1  USE="cxx%* nls zlib -multislot -multitarget -static-libs -test -vanilla" 0 kB
[ebuild     U  ] sys-apps/coreutils-8.14 [8.7] USE="nls unicode -acl -caps -gmp (-selinux) -static -vanilla -xattr" 4,846 kB
[ebuild     U  ] sys-apps/findutils-4.4.2-r1 [4.4.2] USE="nls (-selinux) -static" 0 kB
[ebuild     U  ] sys-apps/grep-2.9 [2.5.4-r1] USE="nls pcre" 1,017 kB
[ebuild     U  ] sys-apps/man-1.6g [1.6f-r4] USE="lzma* nls" 251 kB
[ebuild     U  ] app-arch/tar-1.26 [1.23-r2] USE="nls -static" 2,285 kB
[ebuild  N     ] dev-util/intltool-0.50.2  186 kB
[ebuild     U  ] app-misc/realpath-1.16 [1.15-r1] USE="nls" 33 kB
[ebuild     U  ] app-portage/eix-0.23.10 [0.23.3-r1] USE="nls -debug -doc -optimization -security -sqlite -strong-optimization -tools -zsh-completion" 429 kB
[ebuild     U  ] sys-devel/gcc-4.5.3-r2 [4.5.3-r1] USE="cxx fortran mudflap nls nptl openmp (-altivec) -bootstrap -build -doc (-fixed-point) -gcj -graphite -gtk (-hardened) (-libssp) -lto (-multilib) -multislot -nocxx -nopie -nossp -objc -objc++ -objc-gc -test -vanilla (-libffi%)" 38 kB
[ebuild     U  ] app-admin/eselect-1.2.18 [1.2.15] USE="-doc" 167 kB
[ebuild  N     ] sys-libs/db-4.7.25_p4  USE="cxx -doc -examples (-java) -tcl -test" 12,835 kB
[ebuild     U  ] sys-apps/help2man-1.40.8 [1.38.2] USE="nls" 178 kB
[ebuild  NS    ] sys-kernel/gentoo-sources-3.2.1-r2 [3.1.6] USE="-build -deblob -symlink" 76,361 kB
[ebuild   R    ] sys-libs/gdbm-1.8.3-r4  USE="berkdb*" 0 kB
[ebuild  N     ] virtual/pkgconfig-0  0 kB
[ebuild     U  ] net-libs/gnutls-2.12.18 [2.10.5] USE="cxx nettle%* nls zlib -bindist -doc -examples -guile -lzo (-pkcs11) -static-libs% -test" 7,040 kB
[ebuild     U  ] sys-libs/e2fsprogs-libs-1.42 [1.41.14] USE="nls -static-libs%" 501 kB
[ebuild     U  ] net-misc/openssh-5.9_p1-r4 [5.8_p1-r1] USE="hpn pam tcpd -X -X509 -kerberos -ldap (-libedit) (-selinux) -skey -static" 1,106 kB
[ebuild     U  ] net-misc/wget-1.13.4-r1 [1.12-r3] USE="gnutls%* ipv6 nls ssl -debug -idn -ntlm -static" 1,420 kB
[ebuild     U  ] dev-lang/python-2.7.3-r1 [2.7.2-r3] USE="gdbm ipv6 ncurses readline ssl threads (wide-unicode) xml -berkdb -build -doc -examples -sqlite -tk -wininst" 11,532 kB
[ebuild     U  ] app-admin/python-updater-0.10 [0.9] 10 kB
[ebuild     U  ] app-portage/gentoolkit-0.3.0.5 [0.3.0.4-r5] 3,115 kB
[ebuild     U  ] dev-libs/glib-2.30.2 [2.28.8] USE="static-libs -debug -doc (-fam) (-selinux) (-systemtap) -test -utils% -xattr (-introspection%)" 5,683 kB
[ebuild  N     ] x11-misc/shared-mime-info-1.0  486 kB
[ebuild     U  ] sys-apps/util-linux-2.20.1-r1 [2.19.1-r1] USE="cramfs crypt ncurses nls unicode -ddate% -loop-aes -old-linux -perl (-selinux) -slang -static-libs% (-uclibc)" 4,507 kB
[ebuild     U  ] sys-apps/sysvinit-2.88-r3 [2.88-r2] USE="(-ibm) (-selinux) -static" 0 kB
[blocks b      ] <sys-apps/sysvinit-2.88-r3 ("<sys-apps/sysvinit-2.88-r3" is blocking sys-apps/util-linux-2.20.1-r1)
[ebuild     U  ] sys-fs/e2fsprogs-1.42 [1.41.14] USE="nls -static-libs%" 5,577 kB

Total: 78 packages (62 upgrades, 11 new, 1 in new slot, 4 reinstalls), Size of downloads: 192,374 kB
Conflict: 1 block

The following USE changes are necessary to proceed:
#required by dev-lang/python-2.7.3-r1[gdbm,-build], required by app-portage/gentoolkit-0.3.0.5, required by @selected, required by @world (argument)
=sys-libs/gdbm-1.8.3-r4 berkdb

Use --autounmask-write to write changes to config files (honoring CONFIG_PROTECT).


Doesn't seem too bad really :)

Fixed (edited package.use and unmerged the block) and currently re-emerging the rest.....
Back to top
View user's profile Send private message
freke
Apprentice
Apprentice


Joined: 23 Jan 2003
Posts: 152

PostPosted: Fri Jun 22, 2012 5:21 pm    Post subject: Reply with quote

Code:
make[2]: *** [/var/tmp/portage/sys-libs/glibc-2.14.1-r3/work/build-sparc32-sparc-unknown-linux-gnu-nptl/sunrpc/xnlm_prot.stmp] Segmentation fault
make[2]: *** Waiting for unfinished jobs....
make[2]: *** [/var/tmp/portage/sys-libs/glibc-2.14.1-r3/work/build-sparc32-sparc-unknown-linux-gnu-nptl/sunrpc/xbootparam_prot.stmp] Segmentation fault
make[2]: *** [/var/tmp/portage/sys-libs/glibc-2.14.1-r3/work/build-sparc32-sparc-unknown-linux-gnu-nptl/sunrpc/rpcsvc/bootparam_prot.stmp] Segmentation fault
make[2]: *** [/var/tmp/portage/sys-libs/glibc-2.14.1-r3/work/build-sparc32-sparc-unknown-linux-gnu-nptl/sunrpc/rpcsvc/nlm_prot.stmp] Segmentation fault
make[2]: *** [/var/tmp/portage/sys-libs/glibc-2.14.1-r3/work/build-sparc32-sparc-unknown-linux-gnu-nptl/sunrpc/xrstat.stmp] Segmentation fault
make[2]: Leaving directory `/var/tmp/portage/sys-libs/glibc-2.14.1-r3/work/glibc-2.14.1/sunrpc'
make[1]: *** [sunrpc/others] Error 2
make[1]: Leaving directory `/var/tmp/portage/sys-libs/glibc-2.14.1-r3/work/glibc-2.14.1'
make: *** [all] Error 2
emake failed
 * ERROR: sys-libs/glibc-2.14.1-r3 failed (compile phase):
 *   make for sparc32 failed
 *
 * Call stack:
 *           ebuild.sh, line   85:  Called src_compile
 *         environment, line 3522:  Called eblit-run 'src_compile'
 *         environment, line  875:  Called eblit-glibc-src_compile
 *   src_compile.eblit, line  219:  Called toolchain-glibc_src_compile
 *   src_compile.eblit, line  130:  Called die
 * The specific snippet of code:
 *              emake || die "make for ${ABI} failed"
 *
 * If you need support, post the output of 'emerge --info =sys-libs/glibc-2.14.1-r3',
 * the complete build log and the output of 'emerge -pqv =sys-libs/glibc-2.14.1-r3'.
 * The complete build log is located at '/var/tmp/portage/sys-libs/glibc-2.14.1-r3/temp/build.log'.
 * The ebuild environment file is located at '/var/tmp/portage/sys-libs/glibc-2.14.1-r3/temp/environment'.
 * S: '/var/tmp/portage/sys-libs/glibc-2.14.1-r3/work/glibc-2.14.1'

>>> Failed to emerge sys-libs/glibc-2.14.1-r3, Log file:

>>>  '/var/tmp/portage/sys-libs/glibc-2.14.1-r3/temp/build.log'

 * GNU info directory index is up-to-date.
 * After world updates, it is important to remove obsolete packages with
 * emerge --depclean. Refer to `man emerge` for more information.

real    76m6.654s
user    151m29.460s
sys     29m36.840s


:(
Back to top
View user's profile Send private message
freke
Apprentice
Apprentice


Joined: 23 Jan 2003
Posts: 152

PostPosted: Sun Jun 24, 2012 7:40 am    Post subject: Reply with quote

Turns out I'm not the only one unable to emerge the stable glibc 2.14.1-r3:( - created package.keywords and added sys-libs/glibc which in return gave me 2.15-r2 instead.

Code:
time emerge -uvaDN world --with-bdeps=y


A few minutes and 78 packages later...

Code:
real    806m0.276s
user    1468m26.490s
sys     177m52.580s


After a emerge -va --depclean and a revdep-rebuild the system is now compiling a new kernel.

Must say updating was rather smooth after 150-ish days - I just don't like that I'm not strictly stable now :/
Back to top
View user's profile Send private message
Display posts from previous:   
Reply to topic    Gentoo Forums Forum Index Gentoo on Sparc All times are GMT
Page 1 of 1

 
Jump to:  
You cannot post new topics in this forum
You cannot reply to topics in this forum
You cannot edit your posts in this forum
You cannot delete your posts in this forum
You cannot vote in polls in this forum