Gentoo Forums
Gentoo Forums
Gentoo Forums
Quick Search: in
net-libs/libproxy-0.4.2 failed [solved]
View unanswered posts
View posts from last 24 hours

 
Reply to topic    Gentoo Forums Forum Index Portage & Programming
View previous topic :: View next topic  
Author Message
Kosmas
Apprentice
Apprentice


Joined: 14 Sep 2006
Posts: 266
Location: Greece

PostPosted: Sat May 22, 2010 3:44 pm    Post subject: net-libs/libproxy-0.4.2 failed [solved] Reply with quote

I know I have dome something wrong but I can not figure out what!
I have an ~amd64.


I get the following trying to update libproxy:

Code:
[ 72%] Building CXX object libproxy/CMakeFiles/libproxy.dir/modules/ignore_hostname.o             
[ 75%] [ 77%] Building CXX object libproxy/CMakeFiles/libproxy.dir/modules/ignore_ip.o           
Building CXX object libproxy/CMakeFiles/libproxy.dir/modules/wpad_dns_alias.o                     
Linking CXX shared library ../lib/libproxy.so                                                     
[ 77%] Built target libproxy                                                                     
Scanning dependencies of target config_gnome
Scanning dependencies of target network_networkmanager                                           
Scanning dependencies of target config_kde4                                                       
[ 80%] [ 83%] Building CXX object libproxy/CMakeFiles/config_gnome.dir/modules/config_gnome.o     
Building CXX object libproxy/CMakeFiles/network_networkmanager.dir/modules/network_networkmanager.o                                                                                                 
[ 86%] Building CXX object libproxy/CMakeFiles/config_kde4.dir/modules/config_kde4.o             
Linking CXX shared module ../lib/network_networkmanager.so                                       
Linking CXX shared module ../lib/config_gnome.so                                                 
[ 86%] Built target network_networkmanager                                                       
Scanning dependencies of target pacrunner_mozjs
Linking CXX shared module ../lib/config_kde4.so                                                   
[ 86%] Built target config_gnome                                                                 
[ 88%] Building CXX object libproxy/CMakeFiles/pacrunner_mozjs.dir/modules/pacrunner_mozjs.o
Scanning dependencies of target pacrunner_webkit                                                 
[ 91%] Building CXX object libproxy/CMakeFiles/pacrunner_webkit.dir/modules/pacrunner_webkit.o   
[ 91%] Linking CXX shared module ../lib/pacrunner_webkit.so                                       
Built target config_kde4                                                                         
[ 94%] Generating /var/tmp/portage/net-libs/libproxy-0.4.2/work/libproxy-0.4.2/bindings/perl/src/Libproxy.c                                                                                         
In file included from /usr/lib64/xulrunner/include/js/jspubtd.h:45,                               
                 from /usr/lib64/xulrunner/include/js/jsapi.h:47,
                 from /var/tmp/portage/net-libs/libproxy-0.4.2/work/libproxy-0.4.2/libproxy/modules/pacrunner_mozjs.cpp:34:
/usr/lib64/xulrunner/include/js/jstypes.h:248:6: error: #error "Must define one of XP_BEOS, XP_OS2, XP_WIN or XP_UNIX"
/usr/lib64/xulrunner/include/js/jstypes.h:260:5: warning: "JS_BYTES_PER_BYTE" is not defined
/usr/lib64/xulrunner/include/js/jstypes.h:264:2: error: #error No suitable type for JSInt8/JSUint8
/usr/lib64/xulrunner/include/js/jstypes.h:273:5: warning: "JS_BYTES_PER_SHORT" is not defined
/usr/lib64/xulrunner/include/js/jstypes.h:277:2: error: #error No suitable type for JSInt16/JSUint16
/usr/lib64/xulrunner/include/js/jstypes.h:286:5: warning: "JS_BYTES_PER_INT" is not defined
/usr/lib64/xulrunner/include/js/jstypes.h:291:7: warning: "JS_BYTES_PER_LONG" is not defined
/usr/lib64/xulrunner/include/js/jstypes.h:297:2: error: #error No suitable type for JSInt32/JSUint32
/usr/lib64/xulrunner/include/js/jstypes.h:344:5: warning: "JS_BYTES_PER_INT" is not defined
/usr/lib64/xulrunner/include/js/jstypes.h:348:2: error: #error 'sizeof(int)' not sufficient for platform use
/usr/lib64/xulrunner/include/js/jstypes.h:379:5: warning: "JS_BYTES_PER_WORD" is not defined
/usr/lib64/xulrunner/include/js/jstypes.h:408:5: warning: "JS_BYTES_PER_WORD" is not defined
[ 94%] Built target pacrunner_webkit
Scanning dependencies of target proxy
[ 97%] Building C object utils/CMakeFiles/proxy.dir/proxy.c.o                                     
In file included from /usr/lib64/xulrunner/include/js/jspubtd.h:45,                               
                 from /usr/lib64/xulrunner/include/js/jsapi.h:47,
                 from /var/tmp/portage/net-libs/libproxy-0.4.2/work/libproxy-0.4.2/libproxy/modules/pacrunner_mozjs.cpp:34:
/usr/lib64/xulrunner/include/js/jstypes.h:329: error: 'JSUint32' does not name a type
/usr/lib64/xulrunner/include/js/jstypes.h:393: error: 'JSIntn' does not name a type
/usr/lib64/xulrunner/include/js/jstypes.h:403: error: 'JSUint8' does not name a type
In file included from /usr/lib64/xulrunner/include/js/jstypes.h:416,
                 from /usr/lib64/xulrunner/include/js/jspubtd.h:45,
                 from /usr/lib64/xulrunner/include/js/jsapi.h:47,
                 from /var/tmp/portage/net-libs/libproxy-0.4.2/work/libproxy-0.4.2/libproxy/modules/pacrunner_mozjs.cpp:34:
/usr/lib64/xulrunner/include/js/jsotypes.h:73: error: 'JSUintn' does not name a type
/usr/lib64/xulrunner/include/js/jsotypes.h:76: error: 'JSUintn' does not name a type
/usr/lib64/xulrunner/include/js/jsotypes.h:79: error: 'JSUint32' does not name a type
/usr/lib64/xulrunner/include/js/jsotypes.h:83: error: 'JSUint16' does not name a type
/usr/lib64/xulrunner/include/js/jsotypes.h:84: error: 'JSUint8' does not name a type
/usr/lib64/xulrunner/include/js/jsotypes.h:87: error: 'JSIntn' does not name a type
/usr/lib64/xulrunner/include/js/jsotypes.h:106: error: 'JSInt32' does not name a type
/usr/lib64/xulrunner/include/js/jsotypes.h:110: error: 'JSInt16' does not name a type
/usr/lib64/xulrunner/include/js/jsotypes.h:111: error: 'JSInt8' does not name a type
In file included from /usr/lib64/xulrunner/include/js/jspubtd.h:46,
                 from /usr/lib64/xulrunner/include/js/jsapi.h:47,
                 from /var/tmp/portage/net-libs/libproxy-0.4.2/work/libproxy-0.4.2/libproxy/modules/pacrunner_mozjs.cpp:34:
/usr/lib64/xulrunner/include/js/jscompat.h:51: error: 'JSIntn' does not name a type
/usr/lib64/xulrunner/include/js/jscompat.h:52: error: 'JSUintn' does not name a type
In file included from /usr/lib64/xulrunner/include/js/jsapi.h:47,
                 from /var/tmp/portage/net-libs/libproxy-0.4.2/work/libproxy-0.4.2/libproxy/modules/pacrunner_mozjs.cpp:34:
/usr/lib64/xulrunner/include/js/jspubtd.h:51: error: 'uint16' does not name a type
/usr/lib64/xulrunner/include/js/jspubtd.h:52: error: 'int32' does not name a type
/usr/lib64/xulrunner/include/js/jspubtd.h:53: error: 'uint32' does not name a type
/usr/lib64/xulrunner/include/js/jspubtd.h:57: error: 'int32' does not name a type
In file included from /usr/lib64/xulrunner/include/js/jsapi.h:47,
                 from /var/tmp/portage/net-libs/libproxy-0.4.2/work/libproxy-0.4.2/libproxy/modules/pacrunner_mozjs.cpp:34:
/usr/lib64/xulrunner/include/js/jspubtd.h:159: error: ISO C++ forbids declaration of 'JSBool' with no type
/usr/lib64/xulrunner/include/js/jspubtd.h:159: error: typedef 'JSBool' is initialized (use decltype instead)
/usr/lib64/xulrunner/include/js/jspubtd.h:159: error: 'JSPropertyOp' was not declared in this scope
/usr/lib64/xulrunner/include/js/jspubtd.h:190: error: ISO C++ forbids declaration of 'JSBool' with no type
/usr/lib64/xulrunner/include/js/jspubtd.h:190: error: typedef 'JSBool' is initialized (use decltype instead)
/usr/lib64/xulrunner/include/js/jspubtd.h:190: error: 'JSNewEnumerateOp' was not declared in this scope
/usr/lib64/xulrunner/include/js/jspubtd.h:199: error: ISO C++ forbids declaration of 'JSBool' with no type
/usr/lib64/xulrunner/include/js/jspubtd.h:199: error: typedef 'JSBool' is initialized (use decltype instead)
/usr/lib64/xulrunner/include/js/jspubtd.h:199: error: 'JSEnumerateOp' was not declared in this scope
/usr/lib64/xulrunner/include/js/jspubtd.h:214: error: ISO C++ forbids declaration of 'JSBool' with no type
/usr/lib64/xulrunner/include/js/jspubtd.h:214: error: typedef 'JSBool' is initialized (use decltype instead)
/usr/lib64/xulrunner/include/js/jspubtd.h:214: error: 'JSResolveOp' was not declared in this scope
/usr/lib64/xulrunner/include/js/jspubtd.h:246: error: ISO C++ forbids declaration of 'JSBool' with no type
/usr/lib64/xulrunner/include/js/jspubtd.h:246: error: typedef 'JSBool' is initialized (use decltype instead)
/usr/lib64/xulrunner/include/js/jspubtd.h:246: error: 'JSNewResolveOp' was not declared in this scope
/usr/lib64/xulrunner/include/js/jspubtd.h:254: error: ISO C++ forbids declaration of 'JSBool' with no type
/usr/lib64/xulrunner/include/js/jspubtd.h:254: error: typedef 'JSBool' is initialized (use decltype instead)
/usr/lib64/xulrunner/include/js/jspubtd.h:254: error: 'JSConvertOp' was not declared in this scope
/usr/lib64/xulrunner/include/js/jspubtd.h:312: error: ISO C++ forbids declaration of 'JSBool' with no type
/usr/lib64/xulrunner/include/js/jspubtd.h:312: error: typedef 'JSBool' is initialized (use decltype instead)
/usr/lib64/xulrunner/include/js/jspubtd.h:312: error: 'JSCheckAccessOp' was not declared in this scope
/usr/lib64/xulrunner/include/js/jspubtd.h:320: error: ISO C++ forbids declaration of 'JSBool' with no type
/usr/lib64/xulrunner/include/js/jspubtd.h:320: error: typedef 'JSBool' is initialized (use decltype instead)
/usr/lib64/xulrunner/include/js/jspubtd.h:320: error: 'JSXDRObjectOp' was not declared in this scope
/usr/lib64/xulrunner/include/js/jspubtd.h:328: error: ISO C++ forbids declaration of 'JSBool' with no type
/usr/lib64/xulrunner/include/js/jspubtd.h:328: error: typedef 'JSBool' is initialized (use decltype instead)
/usr/lib64/xulrunner/include/js/jspubtd.h:328: error: 'JSHasInstanceOp' was not declared in this scope
/usr/lib64/xulrunner/include/js/jspubtd.h:350: error: ISO C++ forbids declaration of 'uint32' with no type
/usr/lib64/xulrunner/include/js/jspubtd.h:350: error: typedef 'uint32' is initialized (use decltype instead)
/usr/lib64/xulrunner/include/js/jspubtd.h:350: error: 'JSMarkOp' was not declared in this scope
/usr/lib64/xulrunner/include/js/jspubtd.h:365: error: ISO C++ forbids declaration of 'uint32' with no type
/usr/lib64/xulrunner/include/js/jspubtd.h:365: error: typedef 'uint32' is initialized (use decltype instead)
/usr/lib64/xulrunner/include/js/jspubtd.h:365: error: 'JSReserveSlotsOp' was not declared in this scope
/usr/lib64/xulrunner/include/js/jspubtd.h:383: error: 'jsrefcount' has not been declared
/usr/lib64/xulrunner/include/js/jspubtd.h:412: error: ISO C++ forbids declaration of 'JSBool' with no type
/usr/lib64/xulrunner/include/js/jspubtd.h:412: error: typedef 'JSBool' is initialized (use decltype instead)
/usr/lib64/xulrunner/include/js/jspubtd.h:412: error: 'JSLookupPropOp' was not declared in this scope
/usr/lib64/xulrunner/include/js/jspubtd.h:428: error: ISO C++ forbids declaration of 'JSBool' with no type
/usr/lib64/xulrunner/include/js/jspubtd.h:428: error: typedef 'JSBool' is initialized (use decltype instead)
/usr/lib64/xulrunner/include/js/jspubtd.h:428: error: 'JSDefinePropOp' was not declared in this scope
/usr/lib64/xulrunner/include/js/jspubtd.h:442: error: ISO C++ forbids declaration of 'JSBool' with no type
/usr/lib64/xulrunner/include/js/jspubtd.h:442: error: typedef 'JSBool' is initialized (use decltype instead)
/usr/lib64/xulrunner/include/js/jspubtd.h:442: error: 'JSPropertyIdOp' was not declared in this scope
/usr/lib64/xulrunner/include/js/jspubtd.h:452: error: ISO C++ forbids declaration of 'JSBool' with no type
/usr/lib64/xulrunner/include/js/jspubtd.h:452: error: typedef 'JSBool' is initialized (use decltype instead)
/usr/lib64/xulrunner/include/js/jspubtd.h:452: error: 'JSAttributesOp' was not declared in this scope
/usr/lib64/xulrunner/include/js/jspubtd.h:461: error: ISO C++ forbids declaration of 'JSBool' with no type
/usr/lib64/xulrunner/include/js/jspubtd.h:461: error: typedef 'JSBool' is initialized (use decltype instead)
/usr/lib64/xulrunner/include/js/jspubtd.h:461: error: 'JSCheckAccessIdOp' was not declared in this scope
/usr/lib64/xulrunner/include/js/jspubtd.h:489: error: ISO C++ forbids declaration of 'JSBool' with no type
/usr/lib64/xulrunner/include/js/jspubtd.h:489: error: typedef 'JSBool' is initialized (use decltype instead)
/usr/lib64/xulrunner/include/js/jspubtd.h:489: error: 'JSSetObjectSlotOp' was not declared in this scope
/usr/lib64/xulrunner/include/js/jspubtd.h:507: error: 'uint32' has not been declared
/usr/lib64/xulrunner/include/js/jspubtd.h:510: error: ISO C++ forbids declaration of 'JSBool' with no type
/usr/lib64/xulrunner/include/js/jspubtd.h:510: error: typedef 'JSBool' is initialized (use decltype instead)
/usr/lib64/xulrunner/include/js/jspubtd.h:510: error: 'JSSetRequiredSlotOp' was not declared in this scope
/usr/lib64/xulrunner/include/js/jspubtd.h:518: error: ISO C++ forbids declaration of 'JSBool' with no type
/usr/lib64/xulrunner/include/js/jspubtd.h:518: error: typedef 'JSBool' is initialized (use decltype instead)
/usr/lib64/xulrunner/include/js/jspubtd.h:518: error: 'JSSetMethodOp' was not declared in this scope
/usr/lib64/xulrunner/include/js/jspubtd.h:522: error: ISO C++ forbids declaration of 'JSBool' with no type
/usr/lib64/xulrunner/include/js/jspubtd.h:522: error: typedef 'JSBool' is initialized (use decltype instead)
/usr/lib64/xulrunner/include/js/jspubtd.h:522: error: 'JSEnumerateValuesOp' was not declared in this scope
/usr/lib64/xulrunner/include/js/jspubtd.h:527: error: ISO C++ forbids declaration of 'JSBool' with no type
/usr/lib64/xulrunner/include/js/jspubtd.h:527: error: typedef 'JSBool' is initialized (use decltype instead)
/usr/lib64/xulrunner/include/js/jspubtd.h:527: error: 'JSEqualityOp' was not declared in this scope
/usr/lib64/xulrunner/include/js/jspubtd.h:531: error: ISO C++ forbids declaration of 'JSBool' with no type
/usr/lib64/xulrunner/include/js/jspubtd.h:531: error: typedef 'JSBool' is initialized (use decltype instead)
/usr/lib64/xulrunner/include/js/jspubtd.h:531: error: 'JSConcatenateOp' was not declared in this scope
/usr/lib64/xulrunner/include/js/jspubtd.h:537: error: ISO C++ forbids declaration of 'JSBool' with no type
/usr/lib64/xulrunner/include/js/jspubtd.h:537: error: typedef 'JSBool' is initialized (use decltype instead)
/usr/lib64/xulrunner/include/js/jspubtd.h:537: error: 'JSNative' was not declared in this scope
/usr/lib64/xulrunner/include/js/jspubtd.h:561: error: ISO C++ forbids declaration of 'JSBool' with no type
/usr/lib64/xulrunner/include/js/jspubtd.h:561: error: typedef 'JSBool' is initialized (use decltype instead)
/usr/lib64/xulrunner/include/js/jspubtd.h:561: error: 'JSContextCallback' was not declared in this scope
/usr/lib64/xulrunner/include/js/jspubtd.h:571: error: ISO C++ forbids declaration of 'JSBool' with no type
/usr/lib64/xulrunner/include/js/jspubtd.h:571: error: typedef 'JSBool' is initialized (use decltype instead)
/usr/lib64/xulrunner/include/js/jspubtd.h:571: error: 'JSGCCallback' was not declared in this scope
/usr/lib64/xulrunner/include/js/jspubtd.h:574: error: ISO C++ forbids declaration of 'JSBool' with no type
/usr/lib64/xulrunner/include/js/jspubtd.h:574: error: typedef 'JSBool' is initialized (use decltype instead)
/usr/lib64/xulrunner/include/js/jspubtd.h:574: error: 'JSBranchCallback' was not declared in this scope
/usr/lib64/xulrunner/include/js/jspubtd.h:603: error: 'uint16' does not name a type
/usr/lib64/xulrunner/include/js/jspubtd.h:606: error: 'int16' does not name a type
/usr/lib64/xulrunner/include/js/jspubtd.h:611: error: ISO C++ forbids declaration of 'uintN' with no type
/usr/lib64/xulrunner/include/js/jspubtd.h:611: error: expected ',' or '...' before 'errorNumber'
/usr/lib64/xulrunner/include/js/jspubtd.h:623: error: ISO C++ forbids declaration of 'JSBool' with no type
/usr/lib64/xulrunner/include/js/jspubtd.h:623: error: typedef 'JSBool' is initialized (use decltype instead)
/usr/lib64/xulrunner/include/js/jspubtd.h:623: error: 'JSLocaleToUpperCase' was not declared in this scope
/usr/lib64/xulrunner/include/js/jspubtd.h:627: error: ISO C++ forbids declaration of 'JSBool' with no type
/usr/lib64/xulrunner/include/js/jspubtd.h:627: error: typedef 'JSBool' is initialized (use decltype instead)
/usr/lib64/xulrunner/include/js/jspubtd.h:627: error: 'JSLocaleToLowerCase' was not declared in this scope
/usr/lib64/xulrunner/include/js/jspubtd.h:631: error: ISO C++ forbids declaration of 'JSBool' with no type
/usr/lib64/xulrunner/include/js/jspubtd.h:631: error: typedef 'JSBool' is initialized (use decltype instead)
/usr/lib64/xulrunner/include/js/jspubtd.h:631: error: 'JSLocaleCompare' was not declared in this scope
/usr/lib64/xulrunner/include/js/jspubtd.h:636: error: ISO C++ forbids declaration of 'JSBool' with no type
/usr/lib64/xulrunner/include/js/jspubtd.h:636: error: typedef 'JSBool' is initialized (use decltype instead)
/usr/lib64/xulrunner/include/js/jspubtd.h:636: error: 'JSLocaleToUnicode' was not declared in this scope
/usr/lib64/xulrunner/include/js/jspubtd.h:651: error: ISO C++ forbids declaration of 'JSBool' with no type
/usr/lib64/xulrunner/include/js/jspubtd.h:651: error: typedef 'JSBool' is initialized (use decltype instead)
/usr/lib64/xulrunner/include/js/jspubtd.h:651: error: 'JSPrincipalsTranscoder' was not declared in this scope
In file included from /var/tmp/portage/net-libs/libproxy-0.4.2/work/libproxy-0.4.2/libproxy/modules/pacrunner_mozjs.cpp:34:
/usr/lib64/xulrunner/include/js/jsapi.h:265: error: 'JSBool' does not name a type
/usr/lib64/xulrunner/include/js/jsapi.h:346: error: 'JSBool' does not name a type
/usr/lib64/xulrunner/include/js/jsapi.h:349: error: 'JSBool' does not name a type
/usr/lib64/xulrunner/include/js/jsapi.h:361: error: 'JSBool' does not name a type
/usr/lib64/xulrunner/include/js/jsapi.h:368: error: 'JSBool' does not name a type
/usr/lib64/xulrunner/include/js/jsapi.h:375: error: 'JSBool' does not name a type
/usr/lib64/xulrunner/include/js/jsapi.h:383: error: 'JSBool' does not name a type
/usr/lib64/xulrunner/include/js/jsapi.h:389: error: 'JSBool' does not name a type
/usr/lib64/xulrunner/include/js/jsapi.h:392: error: 'JSBool' does not name a type
/usr/lib64/xulrunner/include/js/jsapi.h:412: warning: 'JS_Init' initialized and declared 'extern'
/usr/lib64/xulrunner/include/js/jsapi.h:412: error: 'uint32' was not declared in this scope
/usr/lib64/xulrunner/include/js/jsapi.h:485: error: 'JSContextCallback' does not name a type
/usr/lib64/xulrunner/include/js/jsapi.h:567: error: 'uint32' does not name a type
/usr/lib64/xulrunner/include/js/jsapi.h:570: error: 'uint32' does not name a type
/usr/lib64/xulrunner/include/js/jsapi.h:573: error: 'uint32' does not name a type
/usr/lib64/xulrunner/include/js/jsapi.h:592: error: 'JSBool' does not name a type
/usr/lib64/xulrunner/include/js/jsapi.h:608: error: 'JSBool' does not name a type
/usr/lib64/xulrunner/include/js/jsapi.h:612: error: 'JSBool' does not name a type
/usr/lib64/xulrunner/include/js/jsapi.h:624: error: 'JSBool' does not name a type
/usr/lib64/xulrunner/include/js/jsapi.h:646: error: 'JSBool' does not name a type
/usr/lib64/xulrunner/include/js/jsapi.h:649: error: 'JSBool' does not name a type
/usr/lib64/xulrunner/include/js/jsapi.h:668: error: 'JSBool' does not name a type
/usr/lib64/xulrunner/include/js/jsapi.h:677: error: 'JSBool' does not name a type
/usr/lib64/xulrunner/include/js/jsapi.h:680: error: 'JSBool' does not name a type
/usr/lib64/xulrunner/include/js/jsapi.h:683: error: 'JSBool' does not name a type
/usr/lib64/xulrunner/include/js/jsapi.h:686: error: 'JSBool' does not name a type
/usr/lib64/xulrunner/include/js/jsapi.h:756: error: 'JSBool' does not name a type
/usr/lib64/xulrunner/include/js/jsapi.h: In constructor 'JSAutoLocalRootScope::JSAutoLocalRootScope(JSContext*)':
/usr/lib64/xulrunner/include/js/jsapi.h:774: error: 'JS_EnterLocalRootScope' was not declared in this scope
/usr/lib64/xulrunner/include/js/jsapi.h: At global scope:
/usr/lib64/xulrunner/include/js/jsapi.h:827: error: ISO C++ forbids declaration of 'intN' with no type
/usr/lib64/xulrunner/include/js/jsapi.h:827: error: typedef 'intN' is initialized (use decltype instead)
/usr/lib64/xulrunner/include/js/jsapi.h:827: error: 'JSGCRootMapFun' was not declared in this scope
/usr/lib64/xulrunner/include/js/jsapi.h:829: error: 'uint32' does not name a type
/usr/lib64/xulrunner/include/js/jsapi.h:832: error: 'JSBool' does not name a type
/usr/lib64/xulrunner/include/js/jsapi.h:835: error: 'JSBool' does not name a type
/usr/lib64/xulrunner/include/js/jsapi.h:838: error: 'JSBool' does not name a type
/usr/lib64/xulrunner/include/js/jsapi.h:841: error: 'JSBool' does not name a type
/usr/lib64/xulrunner/include/js/jsapi.h:866: error: 'JSGCCallback' does not name a type
/usr/lib64/xulrunner/include/js/jsapi.h:869: error: 'JSGCCallback' does not name a type
/usr/lib64/xulrunner/include/js/jsapi.h:872: error: 'JSBool' does not name a type
/usr/lib64/xulrunner/include/js/jsapi.h:881: error: 'uint32' has not been declared
/usr/lib64/xulrunner/include/js/jsapi.h:895: error: 'intN' does not name a type
/usr/lib64/xulrunner/include/js/jsapi.h:911: error: 'intN' does not name a type
/usr/lib64/xulrunner/include/js/jsapi.h:920: error: 'jschar' has not been declared
/usr/lib64/xulrunner/include/js/jsapi.h:920: error: 'intN' has not been declared
/usr/lib64/xulrunner/include/js/jsapi.h:926: error: 'intN' does not name a type
/usr/lib64/xulrunner/include/js/jsapi.h:946: error: 'uint32' does not name a type
/usr/lib64/xulrunner/include/js/jsapi.h:949: error: 'JSPropertyOp' does not name a type
/usr/lib64/xulrunner/include/js/jsapi.h:950: error: 'JSPropertyOp' does not name a type
/usr/lib64/xulrunner/include/js/jsapi.h:951: error: 'JSPropertyOp' does not name a type
/usr/lib64/xulrunner/include/js/jsapi.h:952: error: 'JSPropertyOp' does not name a type
/usr/lib64/xulrunner/include/js/jsapi.h:953: error: 'JSEnumerateOp' does not name a type
/usr/lib64/xulrunner/include/js/jsapi.h:954: error: 'JSResolveOp' does not name a type
/usr/lib64/xulrunner/include/js/jsapi.h:955: error: 'JSConvertOp' does not name a type
/usr/lib64/xulrunner/include/js/jsapi.h:960: error: 'JSCheckAccessOp' does not name a type
/usr/lib64/xulrunner/include/js/jsapi.h:961: error: 'JSNative' does not name a type
/usr/lib64/xulrunner/include/js/jsapi.h:962: error: 'JSNative' does not name a type
/usr/lib64/xulrunner/include/js/jsapi.h:963: error: 'JSXDRObjectOp' does not name a type
/usr/lib64/xulrunner/include/js/jsapi.h:964: error: 'JSHasInstanceOp' does not name a type
/usr/lib64/xulrunner/include/js/jsapi.h:965: error: 'JSMarkOp' does not name a type
/usr/lib64/xulrunner/include/js/jsapi.h:966: error: 'JSReserveSlotsOp' does not name a type
/usr/lib64/xulrunner/include/js/jsapi.h:971: error: 'JSEqualityOp' does not name a type
/usr/lib64/xulrunner/include/js/jsapi.h:1050: error: 'JSLookupPropOp' does not name a type
/usr/lib64/xulrunner/include/js/jsapi.h:1051: error: 'JSDefinePropOp' does not name a type
/usr/lib64/xulrunner/include/js/jsapi.h:1052: error: 'JSPropertyIdOp' does not name a type
/usr/lib64/xulrunner/include/js/jsapi.h:1053: error: 'JSPropertyIdOp' does not name a type
/usr/lib64/xulrunner/include/js/jsapi.h:1054: error: 'JSAttributesOp' does not name a type
/usr/lib64/xulrunner/include/js/jsapi.h:1055: error: 'JSAttributesOp' does not name a type
/usr/lib64/xulrunner/include/js/jsapi.h:1056: error: 'JSPropertyIdOp' does not name a type
/usr/lib64/xulrunner/include/js/jsapi.h:1057: error: 'JSConvertOp' does not name a type
/usr/lib64/xulrunner/include/js/jsapi.h:1058: error: 'JSNewEnumerateOp' does not name a type
/usr/lib64/xulrunner/include/js/jsapi.h:1059: error: 'JSCheckAccessIdOp' does not name a type
/usr/lib64/xulrunner/include/js/jsapi.h:1064: error: 'JSNative' does not name a type
/usr/lib64/xulrunner/include/js/jsapi.h:1065: error: 'JSNative' does not name a type
/usr/lib64/xulrunner/include/js/jsapi.h:1066: error: 'JSXDRObjectOp' does not name a type
/usr/lib64/xulrunner/include/js/jsapi.h:1067: error: 'JSHasInstanceOp' does not name a type
/usr/lib64/xulrunner/include/js/jsapi.h:1068: error: 'JSSetObjectSlotOp' does not name a type
/usr/lib64/xulrunner/include/js/jsapi.h:1069: error: 'JSSetObjectSlotOp' does not name a type
/usr/lib64/xulrunner/include/js/jsapi.h:1070: error: 'JSMarkOp' does not name a type
/usr/lib64/xulrunner/include/js/jsapi.h:1073: error: 'JSSetRequiredSlotOp' does not name a type
/usr/lib64/xulrunner/include/js/jsapi.h:1079: error: 'JSSetMethodOp' does not name a type
/usr/lib64/xulrunner/include/js/jsapi.h:1080: error: 'JSEnumerateValuesOp' does not name a type
/usr/lib64/xulrunner/include/js/jsapi.h:1081: error: 'JSEqualityOp' does not name a type
/usr/lib64/xulrunner/include/js/jsapi.h:1082: error: 'JSConcatenateOp' does not name a type
/usr/lib64/xulrunner/include/js/jsapi.h:1100: error: 'jsint' does not name a type
/usr/lib64/xulrunner/include/js/jsapi.h:1107: error: 'JSBool' does not name a type
/usr/lib64/xulrunner/include/js/jsapi.h:1110: error: 'JSBool' does not name a type
/usr/lib64/xulrunner/include/js/jsapi.h:1129: error: 'JSBool' does not name a type
/usr/lib64/xulrunner/include/js/jsapi.h:1132: error: 'JSBool' does not name a type
/usr/lib64/xulrunner/include/js/jsapi.h:1135: error: 'JSBool' does not name a type
/usr/lib64/xulrunner/include/js/jsapi.h:1138: error: 'JSBool' does not name a type
/usr/lib64/xulrunner/include/js/jsapi.h:1147: error: 'uint8' does not name a type
/usr/lib64/xulrunner/include/js/jsapi.h:1148: error: 'uint8' does not name a type
/usr/lib64/xulrunner/include/js/jsapi.h:1158: error: 'int8' does not name a type
/usr/lib64/xulrunner/include/js/jsapi.h:1159: error: 'uint8' does not name a type
/usr/lib64/xulrunner/include/js/jsapi.h:1160: error: 'JSPropertyOp' does not name a type
/usr/lib64/xulrunner/include/js/jsapi.h:1161: error: 'JSPropertyOp' does not name a type
/usr/lib64/xulrunner/include/js/jsapi.h:1166: error: 'JSNative' does not name a type
/usr/lib64/xulrunner/include/js/jsapi.h:1172: error: 'uint16' does not name a type
/usr/lib64/xulrunner/include/js/jsapi.h:1173: error: 'uint16' does not name a type
/usr/lib64/xulrunner/include/js/jsapi.h:1174: error: 'uint32' does not name a type
/usr/lib64/xulrunner/include/js/jsapi.h:1183: error: 'JSNative' has not been declared
/usr/lib64/xulrunner/include/js/jsapi.h:1183: error: 'uintN' has not been declared
/usr/lib64/xulrunner/include/js/jsapi.h:1199: error: 'JSBool' does not name a type
/usr/lib64/xulrunner/include/js/jsapi.h:1202: error: 'JSBool' does not name a type
/usr/lib64/xulrunner/include/js/jsapi.h:1208: error: 'JSBool' does not name a type
/usr/lib64/xulrunner/include/js/jsapi.h:1218: error: 'JSBool' does not name a type
/usr/lib64/xulrunner/include/js/jsapi.h:1224: error: 'JSBool' does not name a type
/usr/lib64/xulrunner/include/js/jsapi.h:1235: error: 'JSBool' does not name a type
/usr/lib64/xulrunner/include/js/jsapi.h:1241: error: 'JSBool' does not name a type
/usr/lib64/xulrunner/include/js/jsapi.h:1250: error: 'uintN' has not been declared
/usr/lib64/xulrunner/include/js/jsapi.h:1254: error: 'uintN' has not been declared
/usr/lib64/xulrunner/include/js/jsapi.h:1256: error: 'JSBool' does not name a type
/usr/lib64/xulrunner/include/js/jsapi.h:1259: error: 'JSBool' does not name a type
/usr/lib64/xulrunner/include/js/jsapi.h:1262: error: 'JSBool' does not name a type
/usr/lib64/xulrunner/include/js/jsapi.h:1272: error: 'JSBool' does not name a type
/usr/lib64/xulrunner/include/js/jsapi.h:1281: error: 'JSBool' does not name a type
/usr/lib64/xulrunner/include/js/jsapi.h:1294: error: 'JSBool' does not name a type
/usr/lib64/xulrunner/include/js/jsapi.h:1298: error: 'JSBool' does not name a type
/usr/lib64/xulrunner/include/js/jsapi.h:1304: error: 'JSBool' does not name a type
/usr/lib64/xulrunner/include/js/jsapi.h:1308: error: 'JSBool' does not name a type
/usr/lib64/xulrunner/include/js/jsapi.h:1311: error: 'JSBool' does not name a type
/usr/lib64/xulrunner/include/js/jsapi.h:1314: error: 'JSBool' does not name a type
/usr/lib64/xulrunner/include/js/jsapi.h:1318: error: 'JSBool' does not name a type
/usr/lib64/xulrunner/include/js/jsapi.h:1321: error: 'JSBool' does not name a type
/usr/lib64/xulrunner/include/js/jsapi.h:1325: error: 'JSBool' does not name a type
/usr/lib64/xulrunner/include/js/jsapi.h:1329: error: 'JSBool' does not name a type
/usr/lib64/xulrunner/include/js/jsapi.h:1332: error: 'JSBool' does not name a type
/usr/lib64/xulrunner/include/js/jsapi.h:1335: error: 'JSBool' does not name a type
/usr/lib64/xulrunner/include/js/jsapi.h:1339: error: 'JSBool' does not name a type
/usr/lib64/xulrunner/include/js/jsapi.h:1351: error: 'JSBool' does not name a type
/usr/lib64/xulrunner/include/js/jsapi.h:1361: error: 'JSBool' does not name a type
/usr/lib64/xulrunner/include/js/jsapi.h:1374: error: 'JSBool' does not name a type
/usr/lib64/xulrunner/include/js/jsapi.h:1380: error: 'JSBool' does not name a type
/usr/lib64/xulrunner/include/js/jsapi.h:1387: error: 'JSBool' does not name a type
/usr/lib64/xulrunner/include/js/jsapi.h:1392: error: 'JSBool' does not name a type
/usr/lib64/xulrunner/include/js/jsapi.h:1397: error: 'JSBool' does not name a type
/usr/lib64/xulrunner/include/js/jsapi.h:1402: error: 'JSBool' does not name a type
/usr/lib64/xulrunner/include/js/jsapi.h:1407: error: 'JSBool' does not name a type
/usr/lib64/xulrunner/include/js/jsapi.h:1413: error: 'jsint' has not been declared
/usr/lib64/xulrunner/include/js/jsapi.h:1415: error: 'JSBool' does not name a type
/usr/lib64/xulrunner/include/js/jsapi.h:1418: error: 'JSBool' does not name a type
/usr/lib64/xulrunner/include/js/jsapi.h:1421: error: 'JSBool' does not name a type
/usr/lib64/xulrunner/include/js/jsapi.h:1424: error: 'JSBool' does not name a type
/usr/lib64/xulrunner/include/js/jsapi.h:1427: error: 'JSBool' does not name a type
/usr/lib64/xulrunner/include/js/jsapi.h:1431: error: 'JSBool' does not name a type
/usr/lib64/xulrunner/include/js/jsapi.h:1434: error: 'JSBool' does not name a type
/usr/lib64/xulrunner/include/js/jsapi.h:1437: error: 'JSBool' does not name a type
/usr/lib64/xulrunner/include/js/jsapi.h:1440: error: 'JSBool' does not name a type
/usr/lib64/xulrunner/include/js/jsapi.h:1443: error: 'JSBool' does not name a type
/usr/lib64/xulrunner/include/js/jsapi.h:1446: error: 'JSBool' does not name a type
/usr/lib64/xulrunner/include/js/jsapi.h:1449: error: 'JSBool' does not name a type
/usr/lib64/xulrunner/include/js/jsapi.h:1471: error: 'JSBool' does not name a type
/usr/lib64/xulrunner/include/js/jsapi.h:1474: error: 'JSBool' does not name a type
/usr/lib64/xulrunner/include/js/jsapi.h:1478: error: 'JSCheckAccessOp' does not name a type
/usr/lib64/xulrunner/include/js/jsapi.h:1481: error: 'JSBool' does not name a type
/usr/lib64/xulrunner/include/js/jsapi.h:1484: error: 'JSBool' does not name a type
/usr/lib64/xulrunner/include/js/jsapi.h:1497: error: expected identifier before '*' token
/usr/lib64/xulrunner/include/js/jsapi.h:1497: error: ISO C++ forbids declaration of 'JSBool' with no type
/usr/lib64/xulrunner/include/js/jsapi.h:1497: error: 'JSBool' declared as function returning a function
/usr/lib64/xulrunner/include/js/jsapi.h:1500: error: 'jsrefcount' does not name a type
/usr/lib64/xulrunner/include/js/jsapi.h:1503: error: expected identifier before '*' token
/usr/lib64/xulrunner/include/js/jsapi.h:1503: error: ISO C++ forbids declaration of 'JSBool' with no type
/usr/lib64/xulrunner/include/js/jsapi.h:1503: error: 'JSBool' declared as function returning a function
/usr/lib64/xulrunner/include/js/jsapi.h:1524: error: 'JSPrincipalsTranscoder' does not name a type
/usr/lib64/xulrunner/include/js/jsapi.h:1536: error: 'JSNative' has not been declared
/usr/lib64/xulrunner/include/js/jsapi.h:1536: error: 'uintN' has not been declared
/usr/lib64/xulrunner/include/js/jsapi.h:1536: error: 'uintN' has not been declared
/usr/lib64/xulrunner/include/js/jsapi.h:1565: error: 'uintN' does not name a type
/usr/lib64/xulrunner/include/js/jsapi.h:1571: error: 'uint16' does not name a type
/usr/lib64/xulrunner/include/js/jsapi.h:1580: error: 'JSBool' does not name a type
/usr/lib64/xulrunner/include/js/jsapi.h:1583: error: 'JSBool' does not name a type
/usr/lib64/xulrunner/include/js/jsapi.h:1587: error: 'JSNative' has not been declared
/usr/lib64/xulrunner/include/js/jsapi.h:1588: error: 'uintN' has not been declared
/usr/lib64/xulrunner/include/js/jsapi.h:1588: error: 'uintN' has not been declared
/usr/lib64/xulrunner/include/js/jsapi.h:1592: error: ISO C++ forbids declaration of 'jschar' with no type
/usr/lib64/xulrunner/include/js/jsapi.h:1592: error: expected ',' or '...' before '*' token
/usr/lib64/xulrunner/include/js/jsapi.h:1605: error: 'JSBool' does not name a type
/usr/lib64/xulrunner/include/js/jsapi.h:1619: error: 'uintN' has not been declared
/usr/lib64/xulrunner/include/js/jsapi.h:1625: error: 'uintN' has not been declared
/usr/lib64/xulrunner/include/js/jsapi.h:1629: error: ISO C++ forbids declaration of 'jschar' with no type
/usr/lib64/xulrunner/include/js/jsapi.h:1629: error: expected ',' or '...' before '*' token
/usr/lib64/xulrunner/include/js/jsapi.h:1635: error: ISO C++ forbids declaration of 'jschar' with no type
/usr/lib64/xulrunner/include/js/jsapi.h:1635: error: expected ',' or '...' before '*' token
/usr/lib64/xulrunner/include/js/jsapi.h:1681: error: 'uintN' has not been declared
/usr/lib64/xulrunner/include/js/jsapi.h:1683: error: 'uintN' has not been declared
/usr/lib64/xulrunner/include/js/jsapi.h:1688: error: 'uintN' has not been declared
/usr/lib64/xulrunner/include/js/jsapi.h:1690: error: 'uintN' has not been declared
/usr/lib64/xulrunner/include/js/jsapi.h:1694: error: 'uintN' has not been declared
/usr/lib64/xulrunner/include/js/jsapi.h:1695: error: ISO C++ forbids declaration of 'jschar' with no type
/usr/lib64/xulrunner/include/js/jsapi.h:1695: error: expected ',' or '...' before '*' token
/usr/lib64/xulrunner/include/js/jsapi.h:1701: error: 'uintN' has not been declared
/usr/lib64/xulrunner/include/js/jsapi.h:1702: error: ISO C++ forbids declaration of 'jschar' with no type
/usr/lib64/xulrunner/include/js/jsapi.h:1702: error: expected ',' or '...' before '*' token
/usr/lib64/xulrunner/include/js/jsapi.h:1707: error: 'uintN' has not been declared
/usr/lib64/xulrunner/include/js/jsapi.h:1716: error: 'uintN' has not been declared
/usr/lib64/xulrunner/include/js/jsapi.h:1719: error: 'uintN' has not been declared
/usr/lib64/xulrunner/include/js/jsapi.h:1756: error: 'JSBool' does not name a type
/usr/lib64/xulrunner/include/js/jsapi.h:1765: error: 'JSBool' does not name a type
/usr/lib64/xulrunner/include/js/jsapi.h:1769: error: 'JSBool' does not name a type
/usr/lib64/xulrunner/include/js/jsapi.h:1775: error: 'JSBool' does not name a type
/usr/lib64/xulrunner/include/js/jsapi.h:1782: error: 'JSBool' does not name a type
/usr/lib64/xulrunner/include/js/jsapi.h:1788: error: 'JSBool' does not name a type
/usr/lib64/xulrunner/include/js/jsapi.h:1795: error: 'JSBool' does not name a type
/usr/lib64/xulrunner/include/js/jsapi.h:1799: error: 'JSBool' does not name a type
/usr/lib64/xulrunner/include/js/jsapi.h:1803: error: 'JSBool' does not name a type
/usr/lib64/xulrunner/include/js/jsapi.h:1807: error: 'JSBranchCallback' does not name a type
/usr/lib64/xulrunner/include/js/jsapi.h:1810: error: 'JSBool' does not name a type
/usr/lib64/xulrunner/include/js/jsapi.h:1813: error: 'JSBool' does not name a type
/usr/lib64/xulrunner/include/js/jsapi.h:1821: error: 'JSBool' does not name a type
/usr/lib64/xulrunner/include/js/jsapi.h:1878: error: 'jschar' has not been declared
/usr/lib64/xulrunner/include/js/jsapi.h:1881: error: ISO C++ forbids declaration of 'jschar' with no type
/usr/lib64/xulrunner/include/js/jsapi.h:1881: error: expected ',' or '...' before '*' token
/usr/lib64/xulrunner/include/js/jsapi.h:1884: error: ISO C++ forbids declaration of 'jschar' with no type
/usr/lib64/xulrunner/include/js/jsapi.h:1884: error: expected ',' or '...' before '*' token
/usr/lib64/xulrunner/include/js/jsapi.h:1887: error: ISO C++ forbids declaration of 'jschar' with no type
/usr/lib64/xulrunner/include/js/jsapi.h:1887: error: expected ',' or '...' before '*' token
/usr/lib64/xulrunner/include/js/jsapi.h:1890: error: ISO C++ forbids declaration of 'jschar' with no type
/usr/lib64/xulrunner/include/js/jsapi.h:1890: error: expected ',' or '...' before '*' token
/usr/lib64/xulrunner/include/js/jsapi.h:1895: error: expected initializer before '*' token
/usr/lib64/xulrunner/include/js/jsapi.h:1901: error: 'intN' does not name a type
/usr/lib64/xulrunner/include/js/jsapi.h:1924: error: 'jschar' has not been declared
/usr/lib64/xulrunner/include/js/jsapi.h:1949: error: expected initializer before '*' token
/usr/lib64/xulrunner/include/js/jsapi.h:1956: error: 'JSBool' does not name a type
/usr/lib64/xulrunner/include/js/jsapi.h:1964: error: 'JSBool' does not name a type
/usr/lib64/xulrunner/include/js/jsapi.h:1989: error: 'JSBool' does not name a type
/usr/lib64/xulrunner/include/js/jsapi.h:1993: error: 'JSBool' does not name a type
/usr/lib64/xulrunner/include/js/jsapi.h:2003: error: 'JSLocaleToUpperCase' does not name a type
/usr/lib64/xulrunner/include/js/jsapi.h:2004: error: 'JSLocaleToLowerCase' does not name a type
/usr/lib64/xulrunner/include/js/jsapi.h:2005: error: 'JSLocaleCompare' does not name a type
/usr/lib64/xulrunner/include/js/jsapi.h:2006: error: 'JSLocaleToUnicode' does not name a type
/usr/lib64/xulrunner/include/js/jsapi.h:2044: error: ISO C++ forbids declaration of 'uintN' with no type
/usr/lib64/xulrunner/include/js/jsapi.h:2044: error: expected ',' or '...' before 'errorNumber'
/usr/lib64/xulrunner/include/js/jsapi.h:2051: error: ISO C++ forbids declaration of 'uintN' with no type
/usr/lib64/xulrunner/include/js/jsapi.h:2051: error: expected ',' or '...' before 'errorNumber'
/usr/lib64/xulrunner/include/js/jsapi.h:2059: error: 'JSBool' does not name a type
/usr/lib64/xulrunner/include/js/jsapi.h:2062: error: 'JSBool' does not name a type
/usr/lib64/xulrunner/include/js/jsapi.h:2067: error: 'JSBool' does not name a type
/usr/lib64/xulrunner/include/js/jsapi.h:2080: error: 'uintN' does not name a type
/usr/lib64/xulrunner/include/js/jsapi.h:2083: error: ISO C++ forbids declaration of 'jschar' with no type
/usr/lib64/xulrunner/include/js/jsapi.h:2083: error: expected ';' before '*' token
/usr/lib64/xulrunner/include/js/jsapi.h:2084: error: ISO C++ forbids declaration of 'jschar' with no type
/usr/lib64/xulrunner/include/js/jsapi.h:2084: error: expected ';' before '*' token
/usr/lib64/xulrunner/include/js/jsapi.h:2085: error: 'uintN' does not name a type
/usr/lib64/xulrunner/include/js/jsapi.h:2086: error: 'uintN' does not name a type
/usr/lib64/xulrunner/include/js/jsapi.h:2087: error: ISO C++ forbids declaration of 'jschar' with no type
/usr/lib64/xulrunner/include/js/jsapi.h:2087: error: expected ';' before '*' token
/usr/lib64/xulrunner/include/js/jsapi.h:2088: error: ISO C++ forbids declaration of 'jschar' with no type
/usr/lib64/xulrunner/include/js/jsapi.h:2088: error: expected ';' before '*' token
/usr/lib64/xulrunner/include/js/jsapi.h:2123: error: 'uintN' has not been declared
/usr/lib64/xulrunner/include/js/jsapi.h:2126: error: 'jschar' has not been declared
/usr/lib64/xulrunner/include/js/jsapi.h:2126: error: 'uintN' has not been declared
/usr/lib64/xulrunner/include/js/jsapi.h:2129: error: 'JSBool' has not been declared
/usr/lib64/xulrunner/include/js/jsapi.h:2141: error: 'JSBool' does not name a type
/usr/lib64/xulrunner/include/js/jsapi.h:2144: error: 'JSBool' does not name a type
/usr/lib64/xulrunner/include/js/jsapi.h:2153: error: 'JSBool' does not name a type
/usr/lib64/xulrunner/include/js/jsapi.h:2190: error: 'JSBool' does not name a type
/var/tmp/portage/net-libs/libproxy-0.4.2/work/libproxy-0.4.2/libproxy/modules/pacrunner_mozjs.cpp:45: error: 'JSBool' does not name a type
/var/tmp/portage/net-libs/libproxy-0.4.2/work/libproxy-0.4.2/libproxy/modules/pacrunner_mozjs.cpp:78: error: 'JSBool' does not name a type
/var/tmp/portage/net-libs/libproxy-0.4.2/work/libproxy-0.4.2/libproxy/modules/pacrunner_mozjs.cpp:93: error: 'JSUint32' was not declared in this scope
/var/tmp/portage/net-libs/libproxy-0.4.2/work/libproxy-0.4.2/libproxy/modules/pacrunner_mozjs.cpp:93: error: expected ')' before numeric constant
/var/tmp/portage/net-libs/libproxy-0.4.2/work/libproxy-0.4.2/libproxy/modules/pacrunner_mozjs.cpp:97: error: expected ')' before '}' token
/var/tmp/portage/net-libs/libproxy-0.4.2/work/libproxy-0.4.2/libproxy/modules/pacrunner_mozjs.cpp:97: error: expected ')' before '}' token
/var/tmp/portage/net-libs/libproxy-0.4.2/work/libproxy-0.4.2/libproxy/modules/pacrunner_mozjs.cpp:97: error: expected ')' before '}' token
/var/tmp/portage/net-libs/libproxy-0.4.2/work/libproxy-0.4.2/libproxy/modules/pacrunner_mozjs.cpp:97: error: expected ')' before '}' token
/var/tmp/portage/net-libs/libproxy-0.4.2/work/libproxy-0.4.2/libproxy/modules/pacrunner_mozjs.cpp:97: error: too many initializers for 'JSClass'
/var/tmp/portage/net-libs/libproxy-0.4.2/work/libproxy-0.4.2/libproxy/modules/pacrunner_mozjs.cpp: In constructor 'mozjs_pacrunner::mozjs_pacrunner(std::string, const libproxy::url&)':
/var/tmp/portage/net-libs/libproxy-0.4.2/work/libproxy-0.4.2/libproxy/modules/pacrunner_mozjs.cpp:109: error: 'JS_Init' cannot be used as a function
/var/tmp/portage/net-libs/libproxy-0.4.2/work/libproxy-0.4.2/libproxy/modules/pacrunner_mozjs.cpp:115: error: 'JS_InitStandardClasses' was not declared in this scope
/var/tmp/portage/net-libs/libproxy-0.4.2/work/libproxy-0.4.2/libproxy/modules/pacrunner_mozjs.cpp:118: error: 'dnsResolve' was not declared in this scope
/var/tmp/portage/net-libs/libproxy-0.4.2/work/libproxy-0.4.2/libproxy/modules/pacrunner_mozjs.cpp:119: error: 'myIpAddress' was not declared in this scope
/var/tmp/portage/net-libs/libproxy-0.4.2/work/libproxy-0.4.2/libproxy/modules/pacrunner_mozjs.cpp:121: error: 'JS_EvaluateScript' was not declared in this scope
/var/tmp/portage/net-libs/libproxy-0.4.2/work/libproxy-0.4.2/libproxy/modules/pacrunner_mozjs.cpp: In member function 'virtual std::string mozjs_pacrunner::run(const libproxy::url&)':
/var/tmp/portage/net-libs/libproxy-0.4.2/work/libproxy-0.4.2/libproxy/modules/pacrunner_mozjs.cpp:156: error: 'JSBool' was not declared in this scope
/var/tmp/portage/net-libs/libproxy-0.4.2/work/libproxy-0.4.2/libproxy/modules/pacrunner_mozjs.cpp:156: error: expected ';' before 'result'
/var/tmp/portage/net-libs/libproxy-0.4.2/work/libproxy-0.4.2/libproxy/modules/pacrunner_mozjs.cpp:157: error: 'result' was not declared in this scope
/var/tmp/portage/net-libs/libproxy-0.4.2/work/libproxy-0.4.2/libproxy/modules/pacrunner_mozjs.cpp:149: warning: unused variable 'args'
make[2]: *** [libproxy/CMakeFiles/pacrunner_mozjs.dir/modules/pacrunner_mozjs.o] Error 1
make[1]: *** [libproxy/CMakeFiles/pacrunner_mozjs.dir/all] Error 2
make[1]: *** Waiting for unfinished jobs....
Linking C executable proxy
[ 97%] Built target proxy                                                                         
Scanning dependencies of target PLlibproxy
[100%] Building C object bindings/perl/src/CMakeFiles/PLlibproxy.dir/Libproxy.c.o                 
Linking C shared library ../../../perl/blib/arch/auto/Net/Libproxy.so                             
[100%] Built target PLlibproxy                                                                   
make: *** [all] Error 2
 * ERROR: net-libs/libproxy-0.4.2 failed:
 *   Make failed!
 *
 * Call stack:
 *     ebuild.sh, line   54:  Called src_compile
 *   environment, line 4933:  Called cmake-utils_src_compile
 *   environment, line 1217:  Called _execute_optionaly 'src_compile'
 *   environment, line  370:  Called enable_cmake-utils_src_compile
 *   environment, line 1576:  Called cmake-utils_src_make
 *   environment, line 1236:  Called die
 * The specific snippet of code:
 *           emake "$@" || die "Make failed!";
 *
 * If you need support, post the output of 'emerge --info =net-libs/libproxy-0.4.2',
 * the complete build log and the output of 'emerge -pqv =net-libs/libproxy-0.4.2'.
 * The complete build log is located at '/var/tmp/portage/net-libs/libproxy-0.4.2/temp/build.log'.
 * The ebuild environment file is located at '/var/tmp/portage/net-libs/libproxy-0.4.2/temp/environment'.
 * S: '/var/tmp/portage/net-libs/libproxy-0.4.2/work/libproxy-0.4.2'

>>> Failed to emerge net-libs/libproxy-0.4.2, Log file:

>>>  '/var/tmp/portage/net-libs/libproxy-0.4.2/temp/build.log'

 * Messages for package net-libs/libproxy-0.4.2:

 * ERROR: net-libs/libproxy-0.4.2 failed:
 *   Make failed!
 *
 * Call stack:
 *     ebuild.sh, line   54:  Called src_compile
 *   environment, line 4933:  Called cmake-utils_src_compile
 *   environment, line 1217:  Called _execute_optionaly 'src_compile'
 *   environment, line  370:  Called enable_cmake-utils_src_compile
 *   environment, line 1576:  Called cmake-utils_src_make
 *   environment, line 1236:  Called die
 * The specific snippet of code:
 *           emake "$@" || die "Make failed!";
 *
 * If you need support, post the output of 'emerge --info =net-libs/libproxy-0.4.2',
 * the complete build log and the output of 'emerge -pqv =net-libs/libproxy-0.4.2'.
 * The complete build log is located at '/var/tmp/portage/net-libs/libproxy-0.4.2/temp/build.log'.
 * The ebuild environment file is located at '/var/tmp/portage/net-libs/libproxy-0.4.2/temp/environment'.
 * S: '/var/tmp/portage/net-libs/libproxy-0.4.2/work/libproxy-0.4.2'


My emerge --info is:

Code:
Portage 2.1.8.3 (default/linux/amd64/10.0/desktop, gcc-4.4.3, glibc-2.11.1-r0, 2.6.34-gentoo x86_64)
=================================================================
System uname: Linux-2.6.34-gentoo-x86_64-Intel-R-_Core-TM-2_CPU_6600_@_2.40GHz-with-gentoo-2.0.1
Timestamp of tree: Sat, 22 May 2010 04:45:01 +0000
ccache version 2.4 [enabled]
app-shells/bash:     4.1_p7
dev-java/java-config: 2.1.11
dev-lang/python:     2.6.5-r2, 3.1.2-r3
dev-python/pycrypto: 2.1.0
dev-util/ccache:     2.4-r8
dev-util/cmake:      2.8.1-r1
sys-apps/baselayout: 2.0.1
sys-apps/openrc:     0.6.1-r1
sys-apps/sandbox:    2.2
sys-devel/autoconf:  2.13, 2.65
sys-devel/automake:  1.6.3-r1, 1.8.5-r4, 1.9.6-r3, 1.10.3, 1.11.1
sys-devel/binutils:  2.20.1-r1
sys-devel/gcc:       4.4.2, 4.4.3-r2
sys-devel/gcc-config: 1.4.1
sys-devel/libtool:   2.2.6b
virtual/os-headers:  2.6.33
ACCEPT_KEYWORDS="amd64 ~amd64"
ACCEPT_LICENSE="* -@EULA PUEL RTCW-ETEULA dlj-1.1 skype-eula"
CBUILD="x86_64-pc-linux-gnu"
CFLAGS="-O2 -pipe -fomit-frame-pointer -march=native -finline-functions -fprefetch-loop-arrays -fmodulo-sched -fivopts -ftree-vectorize -fstrength-reduce -ftracer"
CHOST="x86_64-pc-linux-gnu"
CONFIG_PROTECT="/etc /usr/share/X11/xkb /usr/share/config /var/lib/hsqldb"
CONFIG_PROTECT_MASK="/etc/ca-certificates.conf /etc/env.d /etc/env.d/java/ /etc/fonts/fonts.conf /etc/gconf /etc/gentoo-release /etc/php/apache2-php5/ext-active/ /etc/php/cgi-php5/ext-active/ /etc/php/cli-php5/ext-active/ /etc/revdep-rebuild /etc/sandbox.d /etc/splash /etc/terminfo /etc/texmf/language.dat.d /etc/texmf/language.def.d /etc/texmf/updmap.d /etc/texmf/web2c"
CXXFLAGS="-O2 -pipe -fomit-frame-pointer -march=native -finline-functions -fprefetch-loop-arrays -fmodulo-sched -fivopts -ftree-vectorize -fstrength-reduce -ftracer"
DISTDIR="/mnt/sdd1/Software/Linux/gentoo"
FEATURES="assume-digests ccache distlocks fixpackages news parallel-fetch protect-owned sandbox sfperms strict unmerge-logs unmerge-orphans user-fetch userfetch"
GENTOO_MIRRORS="http://files.gentoo.gr ftp://files.gentoo.gr http://ftp.ntua.gr/pub/linux/gentoo/ ftp://ftp.ntua.gr/pub/linux/gentoo/ http://ftp.cc.uoc.gr/mirrors/linux/gentoo/ ftp://ftp.cc.uoc.gr/mirrors/linux/gentoo/"
LANG="el_GR.UTF-8"
LC_ALL="C"
LDFLAGS="-Wl,-O1"
LINGUAS="el_GR el en en_GB en_US"
MAKEOPTS="-j3"
PKGDIR="/usr/portage/packages"
PORTAGE_CONFIGROOT="/"
PORTAGE_RSYNC_OPTS="--recursive --links --safe-links --perms --times --compress --force --whole-file --delete --stats --timeout=180 --exclude=/distfiles --exclude=/local --exclude=/packages"
PORTAGE_TMPDIR="/var/tmp"
PORTDIR="/usr/portage"
SYNC="rsync://rsync.gr.gentoo.org/gentoo-portage"
USE="X a52 aac aalib acl acpi ads alsa amd64 apache2 aspell ass async atmo autoipd automount avahi bash-completion berkdb bidi bluetooth branding bzip2 cairo caps cdda cddax cddb cddbcdio cdio cdparanoia cdr chm cjk clamav cleartype cli consolekit cracklib crypt css cups cupsddk curl cxx daemon dbus dc1394 desktopglobe device-mapper dga dhclient dhcpcd dirac directfb disk-partition djvu dmx dns dri dts dvb dvd dvdcss dvdr dvi ebook eds emboss emovix enca encode evo exif expat extensions extras fam fax fbcon fbcondecor ffmpeg firefox firefox3 fits flac floppy fontconfig fontforge fortran fortune ftp fts3 fuse fusion gcj gdbm gdu geoip ggi gif glib glibc-omitfp glitz gmm gnome gnutls google-gadgets gphoto2 gpm graphite graphviz gs gstreamer gtk guile h323 hal hash hddtemp hdri http httpd iconv icu id3tag ieee1394 imagemagick indi ipd ipv6 irda jack java java6 jbig joystick jpeg jpeg2k kate kdcraw kde kde4 kdrive kontact lame lcms ldap ldb libass libcaca libffi libnotify libproxy libssh2 libsysfs libtiger libv4l2 lightning live lm_sensors lua lzma lzo mad mail matroska md5sum mdnsresponder-compat mikmod mjpeg mmx mmxext mng modplug modules motif mozilla mp3 mp4 mpeg mpi mplayer msn mtp mudflap multilib multislot musicbrainz mysql nautilus ncurses network networking networkmanager new-hpcups nls nntp npp nptl nptlonly nsplugin nss ntlm oav objc objc++ objc-gc odk ogg onm openexr opengl openmp optimisememory pam pango parport pcre pda pdf perl phonon php pic pipechan plasma plugins png pnm policykit ppds pppd ps pvr python qt3 qt3support qt4 radio rar raster raw rdp readline reflection replytolist rheora rss rtc rtsp ruby samba sasl scanner schroedinger sdl secure-delete semantic-desktop session shm sip skins smbclient smi smp sndfile snmp solver sox spell spl sql sqlite sqlite3 sse sse2 ssh ssl startup-notification stream svg swat symlink sysfs system-sqlite t1lib taglib tcl tcpd telnet theora threads thumbnail tidy tiff tk toolame tools trace transparency truetype twolame type3 udev unicode upnp usb utils v4l v4l2 vboxwebsrv vcd vcdinfo vcdx video vlm vnc vorbis wav wavpack webkit windeco wma-fixed wmf wpd wpg wv2 wxwindows x264 xanim xattr xcb xcomposite xft xine xinerama xinetd xml xmlreader xmp xorg xosd xpm xrandr xscreensaver xulrunner xv xvid xvmc zip zlib zvbi" ALSA_CARDS="ali5451 als4000 atiixp atiixp-modem bt87x ca0106 cmipci emu10k1x ens1370 ens1371 es1938 es1968 fm801 hda-intel intel8x0 intel8x0m maestro3 trident usb-audio via82xx via82xx-modem ymfpci" ALSA_PCM_PLUGINS="adpcm alaw asym copy dmix dshare dsnoop empty extplug file hooks iec958 ioplug ladspa lfloat linear meter mmap_emul mulaw multi null plug rate route share shm softvol" APACHE2_MODULES="actions alias auth_basic authn_alias authn_anon authn_dbm authn_default authn_file authz_dbm authz_default authz_groupfile authz_host authz_owner authz_user autoindex cache dav dav_fs dav_lock deflate dir disk_cache env expires ext_filter file_cache filter headers include info log_config logio mem_cache mime mime_magic negotiation rewrite setenvif speling status unique_id userdir usertrack vhost_alias" CAMERAS="canon samsung lg_gsm" ELIBC="glibc" INPUT_DEVICES="evdev keyboard mouse joystick" KERNEL="linux" LCD_DEVICES="bayrad cfontz cfontz633 glk hd44780 lb216 lcdm001 mtxorb ncurses text" LINGUAS="el_GR el en en_GB en_US" RUBY_TARGETS="ruby18" USERLAND="GNU" VIDEO_CARDS="ati radeon radeonhd r128 v4l vesa fbdev" XTABLES_ADDONS="quota2 psd pknock lscan length2 ipv4options ipset ipp2p iface geoip fuzzy condition tee tarpit sysrq steal rawnat logmark ipmark dhcpmac delude chaos account"
Unset:  CPPFLAGS, CTARGET, EMERGE_DEFAULT_OPTS, FFLAGS, INSTALL_MASK, PORTAGE_COMPRESS, PORTAGE_COMPRESS_FLAGS, PORTAGE_RSYNC_EXTRA_OPTS, PORTDIR_OVERLAY


Any Help would be highly appreciated.

Thanks.


Last edited by Kosmas on Sat May 22, 2010 4:43 pm; edited 2 times in total
Back to top
View user's profile Send private message
furanku
l33t
l33t


Joined: 08 May 2003
Posts: 874
Location: Hamburg, Germany

PostPosted: Sat May 22, 2010 4:29 pm    Post subject: Reply with quote

See this bug report.
Back to top
View user's profile Send private message
Kosmas
Apprentice
Apprentice


Joined: 14 Sep 2006
Posts: 266
Location: Greece

PostPosted: Sat May 22, 2010 4:41 pm    Post subject: Reply with quote

You guys here are unbelievable!
I can't thank you enough!


Thanks so much!

Problem Solved by unmerging old xulrunner 1.8.
Back to top
View user's profile Send private message
m27315
Apprentice
Apprentice


Joined: 10 Dec 2004
Posts: 236
Location: 2 workstations down

PostPosted: Mon May 24, 2010 7:04 pm    Post subject: same error, but different xulrunner version Reply with quote

I am getting a similar error (see below), but I am using xulrunner-1.9.0.14. What am I doing wrong?

Thanks!

Code:
[ 80%] Building CXX object libproxy/CMakeFiles/libproxy.dir/modules/pacrunner_mozjs.o
[ 82%] In file included from /usr/include/xulrunner-1.9/unstable/jspubtd.h:45,
                 from /usr/include/xulrunner-1.9/unstable/jsapi.h:48,
                 from /var/tmp/portage/net-libs/libproxy-0.4.2/work/libproxy-0.4.2/libproxy/modules/pacrunner_mozjs.cpp:34:
/usr/include/xulrunner-1.9/unstable/jstypes.h:251:3: error: #error "Must define one of XP_BEOS, XP_OS2, XP_WIN or XP_UNIX"
/usr/include/xulrunner-1.9/unstable/jstypes.h:263:5: warning: "JS_BYTES_PER_BYTE" is not defined
/usr/include/xulrunner-1.9/unstable/jstypes.h:267:3: error: #error No suitable type for JSInt8/JSUint8
/usr/include/xulrunner-1.9/unstable/jstypes.h:276:5: warning: "JS_BYTES_PER_SHORT" is not defined
/usr/include/xulrunner-1.9/unstable/jstypes.h:280:3: error: #error No suitable type for JSInt16/JSUint16
/usr/include/xulrunner-1.9/unstable/jstypes.h:289:5: warning: "JS_BYTES_PER_INT" is not defined
/usr/include/xulrunner-1.9/unstable/jstypes.h:294:7: warning: "JS_BYTES_PER_LONG" is not defined
/usr/include/xulrunner-1.9/unstable/jstypes.h:300:3: error: #error No suitable type for JSInt32/JSUint32
/usr/include/xulrunner-1.9/unstable/jstypes.h:351:5: warning: "JS_BYTES_PER_INT" is not defined
/usr/include/xulrunner-1.9/unstable/jstypes.h:355:3: error: #error 'sizeof(int)' not sufficient for platform use
/usr/include/xulrunner-1.9/unstable/jstypes.h:386:5: warning: "JS_BYTES_PER_WORD" is not defined
/usr/include/xulrunner-1.9/unstable/jstypes.h:415:5: warning: "JS_BYTES_PER_WORD" is not defined
Building CXX object libproxy/CMakeFiles/libproxy.dir/modules/wpad_dns_alias.o
In file included from /usr/include/xulrunner-1.9/unstable/jspubtd.h:45,
                 from /usr/include/xulrunner-1.9/unstable/jsapi.h:48,
                 from /var/tmp/portage/net-libs/libproxy-0.4.2/work/libproxy-0.4.2/libproxy/modules/pacrunner_mozjs.cpp:34:
/usr/include/xulrunner-1.9/unstable/jstypes.h:335: error: 'JSUint32' does not name a type
/usr/include/xulrunner-1.9/unstable/jstypes.h:400: error: 'JSIntn' does not name a type
/usr/include/xulrunner-1.9/unstable/jstypes.h:410: error: 'JSUint8' does not name a type
In file included from /usr/include/xulrunner-1.9/unstable/jstypes.h:423,
                 from /usr/include/xulrunner-1.9/unstable/jspubtd.h:45,
                 from /usr/include/xulrunner-1.9/unstable/jsapi.h:48,
                 from /var/tmp/portage/net-libs/libproxy-0.4.2/work/libproxy-0.4.2/libproxy/modules/pacrunner_mozjs.cpp:34:
/usr/include/xulrunner-1.9/unstable/jsotypes.h:73: error: 'JSUintn' does not name a type
/usr/include/xulrunner-1.9/unstable/jsotypes.h:76: error: 'JSUintn' does not name a type
/usr/include/xulrunner-1.9/unstable/jsotypes.h:79: error: 'JSUint32' does not name a type
/usr/include/xulrunner-1.9/unstable/jsotypes.h:83: error: 'JSUint16' does not name a type
/usr/include/xulrunner-1.9/unstable/jsotypes.h:84: error: 'JSUint8' does not name a type
/usr/include/xulrunner-1.9/unstable/jsotypes.h:87: error: 'JSIntn' does not name a type
/usr/include/xulrunner-1.9/unstable/jsotypes.h:106: error: 'JSInt32' does not name a type
/usr/include/xulrunner-1.9/unstable/jsotypes.h:110: error: 'JSInt16' does not name a type
/usr/include/xulrunner-1.9/unstable/jsotypes.h:111: error: 'JSInt8' does not name a type
In file included from /usr/include/xulrunner-1.9/unstable/jspubtd.h:46,
                 from /usr/include/xulrunner-1.9/unstable/jsapi.h:48,
                 from /var/tmp/portage/net-libs/libproxy-0.4.2/work/libproxy-0.4.2/libproxy/modules/pacrunner_mozjs.cpp:34:
/usr/include/xulrunner-1.9/unstable/jscompat.h:51: error: 'JSIntn' does not name a type
/usr/include/xulrunner-1.9/unstable/jscompat.h:52: error: 'JSUintn' does not name a type
In file included from /usr/include/xulrunner-1.9/unstable/jsapi.h:48,
                 from /var/tmp/portage/net-libs/libproxy-0.4.2/work/libproxy-0.4.2/libproxy/modules/pacrunner_mozjs.cpp:34:
/usr/include/xulrunner-1.9/unstable/jspubtd.h:51: error: 'uint16' does not name a type
/usr/include/xulrunner-1.9/unstable/jspubtd.h:52: error: 'int32' does not name a type
/usr/include/xulrunner-1.9/unstable/jspubtd.h:53: error: 'uint32' does not name a type
/usr/include/xulrunner-1.9/unstable/jspubtd.h:57: error: 'int32' does not name a type
In file included from /usr/include/xulrunner-1.9/unstable/jsapi.h:48,
                 from /var/tmp/portage/net-libs/libproxy-0.4.2/work/libproxy-0.4.2/libproxy/modules/pacrunner_mozjs.cpp:34:
/usr/include/xulrunner-1.9/unstable/jspubtd.h:162: error: ISO C++ forbids declaration of 'JSBool' with no type
/usr/include/xulrunner-1.9/unstable/jspubtd.h:162: error: typedef 'JSBool' is initialized (use __typeof__ instead)
/usr/include/xulrunner-1.9/unstable/jspubtd.h:162: error: 'JSPropertyOp' was not declared in this scope
/usr/include/xulrunner-1.9/unstable/jspubtd.h:193: error: ISO C++ forbids declaration of 'JSBool' with no type
/usr/include/xulrunner-1.9/unstable/jspubtd.h:193: error: typedef 'JSBool' is initialized (use __typeof__ instead)
/usr/include/xulrunner-1.9/unstable/jspubtd.h:193: error: 'JSNewEnumerateOp' was not declared in this scope
/usr/include/xulrunner-1.9/unstable/jspubtd.h:202: error: ISO C++ forbids declaration of 'JSBool' with no type
/usr/include/xulrunner-1.9/unstable/jspubtd.h:202: error: typedef 'JSBool' is initialized (use __typeof__ instead)
/usr/include/xulrunner-1.9/unstable/jspubtd.h:202: error: 'JSEnumerateOp' was not declared in this scope
/usr/include/xulrunner-1.9/unstable/jspubtd.h:217: error: ISO C++ forbids declaration of 'JSBool' with no type
/usr/include/xulrunner-1.9/unstable/jspubtd.h:217: error: typedef 'JSBool' is initialized (use __typeof__ instead)
/usr/include/xulrunner-1.9/unstable/jspubtd.h:217: error: 'JSResolveOp' was not declared in this scope
/usr/include/xulrunner-1.9/unstable/jspubtd.h:249: error: ISO C++ forbids declaration of 'JSBool' with no type
/usr/include/xulrunner-1.9/unstable/jspubtd.h:249: error: typedef 'JSBool' is initialized (use __typeof__ instead)
/usr/include/xulrunner-1.9/unstable/jspubtd.h:249: error: 'JSNewResolveOp' was not declared in this scope
/usr/include/xulrunner-1.9/unstable/jspubtd.h:257: error: ISO C++ forbids declaration of 'JSBool' with no type
/usr/include/xulrunner-1.9/unstable/jspubtd.h:257: error: typedef 'JSBool' is initialized (use __typeof__ instead)
/usr/include/xulrunner-1.9/unstable/jspubtd.h:257: error: 'JSConvertOp' was not declared in this scope
/usr/include/xulrunner-1.9/unstable/jspubtd.h:315: error: ISO C++ forbids declaration of 'JSBool' with no type
/usr/include/xulrunner-1.9/unstable/jspubtd.h:315: error: typedef 'JSBool' is initialized (use __typeof__ instead)
/usr/include/xulrunner-1.9/unstable/jspubtd.h:315: error: 'JSCheckAccessOp' was not declared in this scope
/usr/include/xulrunner-1.9/unstable/jspubtd.h:323: error: ISO C++ forbids declaration of 'JSBool' with no type
/usr/include/xulrunner-1.9/unstable/jspubtd.h:323: error: typedef 'JSBool' is initialized (use __typeof__ instead)
/usr/include/xulrunner-1.9/unstable/jspubtd.h:323: error: 'JSXDRObjectOp' was not declared in this scope
/usr/include/xulrunner-1.9/unstable/jspubtd.h:331: error: ISO C++ forbids declaration of 'JSBool' with no type
/usr/include/xulrunner-1.9/unstable/jspubtd.h:331: error: typedef 'JSBool' is initialized (use __typeof__ instead)
/usr/include/xulrunner-1.9/unstable/jspubtd.h:331: error: 'JSHasInstanceOp' was not declared in this scope
/usr/include/xulrunner-1.9/unstable/jspubtd.h:340: error: ISO C++ forbids declaration of 'uint32' with no type
/usr/include/xulrunner-1.9/unstable/jspubtd.h:340: error: typedef 'uint32' is initialized (use __typeof__ instead)
/usr/include/xulrunner-1.9/unstable/jspubtd.h:340: error: 'JSMarkOp' was not declared in this scope
/usr/include/xulrunner-1.9/unstable/jspubtd.h:392: error: 'uint32' has not been declared
/usr/include/xulrunner-1.9/unstable/jspubtd.h:417: error: ISO C++ forbids declaration of 'uint32' with no type
/usr/include/xulrunner-1.9/unstable/jspubtd.h:417: error: typedef 'uint32' is initialized (use __typeof__ instead)
/usr/include/xulrunner-1.9/unstable/jspubtd.h:417: error: 'JSReserveSlotsOp' was not declared in this scope
/usr/include/xulrunner-1.9/unstable/jspubtd.h:435: error: 'jsrefcount' has not been declared
/usr/include/xulrunner-1.9/unstable/jspubtd.h:464: error: ISO C++ forbids declaration of 'JSBool' with no type
/usr/include/xulrunner-1.9/unstable/jspubtd.h:464: error: typedef 'JSBool' is initialized (use __typeof__ instead)
/usr/include/xulrunner-1.9/unstable/jspubtd.h:464: error: 'JSLookupPropOp' was not declared in this scope
/usr/include/xulrunner-1.9/unstable/jspubtd.h:480: error: ISO C++ forbids declaration of 'JSBool' with no type
/usr/include/xulrunner-1.9/unstable/jspubtd.h:480: error: typedef 'JSBool' is initialized (use __typeof__ instead)
/usr/include/xulrunner-1.9/unstable/jspubtd.h:480: error: 'JSDefinePropOp' was not declared in this scope
/usr/include/xulrunner-1.9/unstable/jspubtd.h:494: error: ISO C++ forbids declaration of 'JSBool' with no type
/usr/include/xulrunner-1.9/unstable/jspubtd.h:494: error: typedef 'JSBool' is initialized (use __typeof__ instead)
/usr/include/xulrunner-1.9/unstable/jspubtd.h:494: error: 'JSPropertyIdOp' was not declared in this scope
/usr/include/xulrunner-1.9/unstable/jspubtd.h:504: error: ISO C++ forbids declaration of 'JSBool' with no type
/usr/include/xulrunner-1.9/unstable/jspubtd.h:504: error: typedef 'JSBool' is initialized (use __typeof__ instead)
/usr/include/xulrunner-1.9/unstable/jspubtd.h:504: error: 'JSAttributesOp' was not declared in this scope
/usr/include/xulrunner-1.9/unstable/jspubtd.h:513: error: ISO C++ forbids declaration of 'JSBool' with no type
/usr/include/xulrunner-1.9/unstable/jspubtd.h:513: error: typedef 'JSBool' is initialized (use __typeof__ instead)
/usr/include/xulrunner-1.9/unstable/jspubtd.h:513: error: 'JSCheckAccessIdOp' was not declared in this scope
/usr/include/xulrunner-1.9/unstable/jspubtd.h:531: error: 'JSBool' has not been declared
/usr/include/xulrunner-1.9/unstable/jspubtd.h:549: error: ISO C++ forbids declaration of 'JSBool' with no type
/usr/include/xulrunner-1.9/unstable/jspubtd.h:549: error: typedef 'JSBool' is initialized (use __typeof__ instead)
/usr/include/xulrunner-1.9/unstable/jspubtd.h:549: error: 'JSSetObjectSlotOp' was not declared in this scope
/usr/include/xulrunner-1.9/unstable/jspubtd.h:567: error: 'uint32' has not been declared
/usr/include/xulrunner-1.9/unstable/jspubtd.h:570: error: ISO C++ forbids declaration of 'JSBool' with no type
/usr/include/xulrunner-1.9/unstable/jspubtd.h:570: error: typedef 'JSBool' is initialized (use __typeof__ instead)
/usr/include/xulrunner-1.9/unstable/jspubtd.h:570: error: 'JSSetRequiredSlotOp' was not declared in this scope
/usr/include/xulrunner-1.9/unstable/jspubtd.h:578: error: ISO C++ forbids declaration of 'JSBool' with no type
/usr/include/xulrunner-1.9/unstable/jspubtd.h:578: error: typedef 'JSBool' is initialized (use __typeof__ instead)
/usr/include/xulrunner-1.9/unstable/jspubtd.h:578: error: 'JSSetMethodOp' was not declared in this scope
/usr/include/xulrunner-1.9/unstable/jspubtd.h:582: error: ISO C++ forbids declaration of 'JSBool' with no type
/usr/include/xulrunner-1.9/unstable/jspubtd.h:582: error: typedef 'JSBool' is initialized (use __typeof__ instead)
/usr/include/xulrunner-1.9/unstable/jspubtd.h:582: error: 'JSEnumerateValuesOp' was not declared in this scope
/usr/include/xulrunner-1.9/unstable/jspubtd.h:587: error: ISO C++ forbids declaration of 'JSBool' with no type
/usr/include/xulrunner-1.9/unstable/jspubtd.h:587: error: typedef 'JSBool' is initialized (use __typeof__ instead)
/usr/include/xulrunner-1.9/unstable/jspubtd.h:587: error: 'JSEqualityOp' was not declared in this scope
/usr/include/xulrunner-1.9/unstable/jspubtd.h:591: error: ISO C++ forbids declaration of 'JSBool' with no type
/usr/include/xulrunner-1.9/unstable/jspubtd.h:591: error: typedef 'JSBool' is initialized (use __typeof__ instead)
/usr/include/xulrunner-1.9/unstable/jspubtd.h:591: error: 'JSConcatenateOp' was not declared in this scope
/usr/include/xulrunner-1.9/unstable/jspubtd.h:597: error: ISO C++ forbids declaration of 'JSBool' with no type
/usr/include/xulrunner-1.9/unstable/jspubtd.h:597: error: typedef 'JSBool' is initialized (use __typeof__ instead)
/usr/include/xulrunner-1.9/unstable/jspubtd.h:597: error: 'JSNative' was not declared in this scope
/usr/include/xulrunner-1.9/unstable/jspubtd.h:602: error: ISO C++ forbids declaration of 'JSBool' with no type
/usr/include/xulrunner-1.9/unstable/jspubtd.h:602: error: typedef 'JSBool' is initialized (use __typeof__ instead)
/usr/include/xulrunner-1.9/unstable/jspubtd.h:602: error: 'JSFastNative' was not declared in this scope
/usr/include/xulrunner-1.9/unstable/jspubtd.h:625: error: ISO C++ forbids declaration of 'JSBool' with no type
/usr/include/xulrunner-1.9/unstable/jspubtd.h:625: error: typedef 'JSBool' is initialized (use __typeof__ instead)
/usr/include/xulrunner-1.9/unstable/jspubtd.h:625: error: 'JSContextCallback' was not declared in this scope
/usr/include/xulrunner-1.9/unstable/jspubtd.h:635: error: ISO C++ forbids declaration of 'JSBool' with no type
/usr/include/xulrunner-1.9/unstable/jspubtd.h:635: error: typedef 'JSBool' is initialized (use __typeof__ instead)
/usr/include/xulrunner-1.9/unstable/jspubtd.h:635: error: 'JSGCCallback' was not declared in this scope
/usr/include/xulrunner-1.9/unstable/jspubtd.h:645: error: ISO C++ forbids declaration of 'JSBool' with no type
/usr/include/xulrunner-1.9/unstable/jspubtd.h:645: error: typedef 'JSBool' is initialized (use __typeof__ instead)
/usr/include/xulrunner-1.9/unstable/jspubtd.h:645: error: 'JSOperationCallback' was not declared in this scope
/usr/include/xulrunner-1.9/unstable/jspubtd.h:651: error: ISO C++ forbids declaration of 'JSBool' with no type
/usr/include/xulrunner-1.9/unstable/jspubtd.h:651: error: typedef 'JSBool' is initialized (use __typeof__ instead)
/usr/include/xulrunner-1.9/unstable/jspubtd.h:651: error: 'JSBranchCallback' was not declared in this scope
/usr/include/xulrunner-1.9/unstable/jspubtd.h:680: error: 'uint16' does not name a type
/usr/include/xulrunner-1.9/unstable/jspubtd.h:683: error: 'int16' does not name a type
/usr/include/xulrunner-1.9/unstable/jspubtd.h:688: error: expected ',' or '...' before 'errorNumber'
/usr/include/xulrunner-1.9/unstable/jspubtd.h:688: error: ISO C++ forbids declaration of 'uintN' with no type
/usr/include/xulrunner-1.9/unstable/jspubtd.h:700: error: ISO C++ forbids declaration of 'JSBool' with no type
/usr/include/xulrunner-1.9/unstable/jspubtd.h:700: error: typedef 'JSBool' is initialized (use __typeof__ instead)
/usr/include/xulrunner-1.9/unstable/jspubtd.h:700: error: 'JSLocaleToUpperCase' was not declared in this scope
/usr/include/xulrunner-1.9/unstable/jspubtd.h:704: error: ISO C++ forbids declaration of 'JSBool' with no type
/usr/include/xulrunner-1.9/unstable/jspubtd.h:704: error: typedef 'JSBool' is initialized (use __typeof__ instead)
/usr/include/xulrunner-1.9/unstable/jspubtd.h:704: error: 'JSLocaleToLowerCase' was not declared in this scope
/usr/include/xulrunner-1.9/unstable/jspubtd.h:708: error: ISO C++ forbids declaration of 'JSBool' with no type
/usr/include/xulrunner-1.9/unstable/jspubtd.h:708: error: typedef 'JSBool' is initialized (use __typeof__ instead)
/usr/include/xulrunner-1.9/unstable/jspubtd.h:708: error: 'JSLocaleCompare' was not declared in this scope
/usr/include/xulrunner-1.9/unstable/jspubtd.h:713: error: ISO C++ forbids declaration of 'JSBool' with no type
/usr/include/xulrunner-1.9/unstable/jspubtd.h:713: error: typedef 'JSBool' is initialized (use __typeof__ instead)
/usr/include/xulrunner-1.9/unstable/jspubtd.h:713: error: 'JSLocaleToUnicode' was not declared in this scope
/usr/include/xulrunner-1.9/unstable/jspubtd.h:728: error: ISO C++ forbids declaration of 'JSBool' with no type
/usr/include/xulrunner-1.9/unstable/jspubtd.h:728: error: typedef 'JSBool' is initialized (use __typeof__ instead)
/usr/include/xulrunner-1.9/unstable/jspubtd.h:728: error: 'JSPrincipalsTranscoder' was not declared in this scope
In file included from /var/tmp/portage/net-libs/libproxy-0.4.2/work/libproxy-0.4.2/libproxy/modules/pacrunner_mozjs.cpp:34:
/usr/include/xulrunner-1.9/unstable/jsapi.h:273: error: 'JSBool' does not name a type
/usr/include/xulrunner-1.9/unstable/jsapi.h:354: error: 'JSBool' does not name a type
/usr/include/xulrunner-1.9/unstable/jsapi.h:357: error: 'JSBool' does not name a type
/usr/include/xulrunner-1.9/unstable/jsapi.h:369: error: 'JSBool' does not name a type
/usr/include/xulrunner-1.9/unstable/jsapi.h:376: error: 'JSBool' does not name a type
/usr/include/xulrunner-1.9/unstable/jsapi.h:383: error: 'JSBool' does not name a type
/usr/include/xulrunner-1.9/unstable/jsapi.h:391: error: 'JSBool' does not name a type
/usr/include/xulrunner-1.9/unstable/jsapi.h:397: error: 'JSBool' does not name a type
/usr/include/xulrunner-1.9/unstable/jsapi.h:400: error: 'JSBool' does not name a type
/usr/include/xulrunner-1.9/unstable/jsapi.h:424: warning: 'JS_Init' initialized and declared 'extern'
/usr/include/xulrunner-1.9/unstable/jsapi.h:424: error: 'uint32' was not declared in this scope
/usr/include/xulrunner-1.9/unstable/jsapi.h:448: error: 'jsrefcount' does not name a type
/usr/include/xulrunner-1.9/unstable/jsapi.h:452: error: 'jsrefcount' has not been declared
/usr/include/xulrunner-1.9/unstable/jsapi.h:475: error: 'jsrefcount' does not name a type
/usr/include/xulrunner-1.9/unstable/jsapi.h: In constructor 'JSAutoRequest::JSAutoRequest(JSContext*)':
/usr/include/xulrunner-1.9/unstable/jsapi.h:459: error: class 'JSAutoRequest' does not have any field named 'mSaveDepth'
/usr/include/xulrunner-1.9/unstable/jsapi.h: In member function 'void JSAutoRequest::suspend()':
/usr/include/xulrunner-1.9/unstable/jsapi.h:467: error: 'mSaveDepth' was not declared in this scope
/usr/include/xulrunner-1.9/unstable/jsapi.h:467: error: 'JS_SuspendRequest' was not declared in this scope
/usr/include/xulrunner-1.9/unstable/jsapi.h: In member function 'void JSAutoRequest::resume()':
/usr/include/xulrunner-1.9/unstable/jsapi.h:470: error: 'mSaveDepth' was not declared in this scope
/usr/include/xulrunner-1.9/unstable/jsapi.h: At global scope:
/usr/include/xulrunner-1.9/unstable/jsapi.h:493: error: 'JSContextCallback' does not name a type
/usr/include/xulrunner-1.9/unstable/jsapi.h:587: error: 'uint32' does not name a type
/usr/include/xulrunner-1.9/unstable/jsapi.h:590: error: 'uint32' does not name a type
/usr/include/xulrunner-1.9/unstable/jsapi.h:593: error: 'uint32' does not name a type
/usr/include/xulrunner-1.9/unstable/jsapi.h:612: error: 'JSBool' does not name a type
/usr/include/xulrunner-1.9/unstable/jsapi.h:628: error: 'JSBool' does not name a type
/usr/include/xulrunner-1.9/unstable/jsapi.h:632: error: 'JSBool' does not name a type
/usr/include/xulrunner-1.9/unstable/jsapi.h:644: error: 'JSBool' does not name a type
/usr/include/xulrunner-1.9/unstable/jsapi.h:705: error: 'JSBool' does not name a type
/usr/include/xulrunner-1.9/unstable/jsapi.h:708: error: 'JSBool' does not name a type
/usr/include/xulrunner-1.9/unstable/jsapi.h:727: error: 'JSBool' does not name a type
/usr/include/xulrunner-1.9/unstable/jsapi.h:736: error: 'JSBool' does not name a type
/usr/include/xulrunner-1.9/unstable/jsapi.h:739: error: 'JSBool' does not name a type
/usr/include/xulrunner-1.9/unstable/jsapi.h:742: error: 'JSBool' does not name a type
/usr/include/xulrunner-1.9/unstable/jsapi.h:745: error: 'JSBool' does not name a type
/usr/include/xulrunner-1.9/unstable/jsapi.h:815: error: 'JSBool' does not name a type
/usr/include/xulrunner-1.9/unstable/jsapi.h: In constructor 'JSAutoLocalRootScope::JSAutoLocalRootScope(JSContext*)':
/usr/include/xulrunner-1.9/unstable/jsapi.h:833: error: 'JS_EnterLocalRootScope' was not declared in this scope
/usr/include/xulrunner-1.9/unstable/jsapi.h: At global scope:
/usr/include/xulrunner-1.9/unstable/jsapi.h:886: error: ISO C++ forbids declaration of 'intN' with no type
/usr/include/xulrunner-1.9/unstable/jsapi.h:886: error: typedef 'intN' is initialized (use __typeof__ instead)
/usr/include/xulrunner-1.9/unstable/jsapi.h:886: error: 'JSGCRootMapFun' was not declared in this scope
/usr/include/xulrunner-1.9/unstable/jsapi.h:888: error: 'uint32' does not name a type
/usr/include/xulrunner-1.9/unstable/jsapi.h:891: error: 'JSBool' does not name a type
/usr/include/xulrunner-1.9/unstable/jsapi.h:894: error: 'JSBool' does not name a type
/usr/include/xulrunner-1.9/unstable/jsapi.h:897: error: 'JSBool' does not name a type
/usr/include/xulrunner-1.9/unstable/jsapi.h:900: error: 'JSBool' does not name a type
/usr/include/xulrunner-1.9/unstable/jsapi.h:945: error: 'JSUint32' was not declared in this scope
/usr/include/xulrunner-1.9/unstable/jsapi.h:945: error: expected `)' before numeric constant
/usr/include/xulrunner-1.9/unstable/jsapi.h:945: error: expected `)' before ';' token
/usr/include/xulrunner-1.9/unstable/jsapi.h:945: error: expected `)' before ';' token
/usr/include/xulrunner-1.9/unstable/jsapi.h:945: error: expected `)' before ';' token
/usr/include/xulrunner-1.9/unstable/jsapi.h:945: error: expected `)' before ';' token
/usr/include/xulrunner-1.9/unstable/jsapi.h:945: error: expected `]' before ';' token
/usr/include/xulrunner-1.9/unstable/jsapi.h:945: error: expected `)' before ';' token
/usr/include/xulrunner-1.9/unstable/jsapi.h:946: error: 'JSUint32' was not declared in this scope
/usr/include/xulrunner-1.9/unstable/jsapi.h:946: error: expected `)' before numeric constant
/usr/include/xulrunner-1.9/unstable/jsapi.h:946: error: expected `)' before ';' token
/usr/include/xulrunner-1.9/unstable/jsapi.h:946: error: expected `)' before ';' token
/usr/include/xulrunner-1.9/unstable/jsapi.h:946: error: expected `)' before ';' token
/usr/include/xulrunner-1.9/unstable/jsapi.h:946: error: expected `)' before ';' token
/usr/include/xulrunner-1.9/unstable/jsapi.h:946: error: expected `]' before ';' token
/usr/include/xulrunner-1.9/unstable/jsapi.h:946: error: expected `)' before ';' token
/usr/include/xulrunner-1.9/unstable/jsapi.h:947: error: 'JSUint32' was not declared in this scope
/usr/include/xulrunner-1.9/unstable/jsapi.h:947: error: expected `)' before numeric constant
/usr/include/xulrunner-1.9/unstable/jsapi.h:947: error: expected `)' before ';' token
/usr/include/xulrunner-1.9/unstable/jsapi.h:947: error: expected `)' before ';' token
/usr/include/xulrunner-1.9/unstable/jsapi.h:947: error: expected `)' before ';' token
/usr/include/xulrunner-1.9/unstable/jsapi.h:947: error: expected `)' before ';' token
/usr/include/xulrunner-1.9/unstable/jsapi.h:947: error: expected `]' before ';' token
/usr/include/xulrunner-1.9/unstable/jsapi.h:947: error: expected `)' before ';' token
/usr/include/xulrunner-1.9/unstable/jsapi.h:966: error: 'uint32' has not been declared
/usr/include/xulrunner-1.9/unstable/jsapi.h:1064: error: 'uint32' has not been declared
/usr/include/xulrunner-1.9/unstable/jsapi.h:1105: error: 'JSGCCallback' does not name a type
/usr/include/xulrunner-1.9/unstable/jsapi.h:1108: error: 'JSGCCallback' does not name a type
/usr/include/xulrunner-1.9/unstable/jsapi.h:1111: error: 'JSBool' does not name a type
/usr/include/xulrunner-1.9/unstable/jsapi.h:1114: error: 'JSBool' does not name a type
/usr/include/xulrunner-1.9/unstable/jsapi.h:1129: error: 'uint32' has not been declared
/usr/include/xulrunner-1.9/unstable/jsapi.h:1143: error: 'intN' does not name a type
/usr/include/xulrunner-1.9/unstable/jsapi.h:1159: error: 'intN' does not name a type
/usr/include/xulrunner-1.9/unstable/jsapi.h:1168: error: 'jschar' has not been declared
/usr/include/xulrunner-1.9/unstable/jsapi.h:1168: error: 'intN' has not been declared
/usr/include/xulrunner-1.9/unstable/jsapi.h:1174: error: 'intN' does not name a type
/usr/include/xulrunner-1.9/unstable/jsapi.h:1209: error: 'uint32' does not name a type
/usr/include/xulrunner-1.9/unstable/jsapi.h:1212: error: 'JSPropertyOp' does not name a type
/usr/include/xulrunner-1.9/unstable/jsapi.h:1213: error: 'JSPropertyOp' does not name a type
/usr/include/xulrunner-1.9/unstable/jsapi.h:1214: error: 'JSPropertyOp' does not name a type
/usr/include/xulrunner-1.9/unstable/jsapi.h:1215: error: 'JSPropertyOp' does not name a type
/usr/include/xulrunner-1.9/unstable/jsapi.h:1216: error: 'JSEnumerateOp' does not name a type
/usr/include/xulrunner-1.9/unstable/jsapi.h:1217: error: 'JSResolveOp' does not name a type
/usr/include/xulrunner-1.9/unstable/jsapi.h:1218: error: 'JSConvertOp' does not name a type
/usr/include/xulrunner-1.9/unstable/jsapi.h:1223: error: 'JSCheckAccessOp' does not name a type
/usr/include/xulrunner-1.9/unstable/jsapi.h:1224: error: 'JSNative' does not name a type
/usr/include/xulrunner-1.9/unstable/jsapi.h:1225: error: 'JSNative' does not name a type
/usr/include/xulrunner-1.9/unstable/jsapi.h:1226: error: 'JSXDRObjectOp' does not name a type
/usr/include/xulrunner-1.9/unstable/jsapi.h:1227: error: 'JSHasInstanceOp' does not name a type
/usr/include/xulrunner-1.9/unstable/jsapi.h:1228: error: 'JSMarkOp' does not name a type
/usr/include/xulrunner-1.9/unstable/jsapi.h:1229: error: 'JSReserveSlotsOp' does not name a type
/usr/include/xulrunner-1.9/unstable/jsapi.h:1234: error: 'JSEqualityOp' does not name a type
/usr/include/xulrunner-1.9/unstable/jsapi.h:1319: error: 'JSLookupPropOp' does not name a type
/usr/include/xulrunner-1.9/unstable/jsapi.h:1320: error: 'JSDefinePropOp' does not name a type
/usr/include/xulrunner-1.9/unstable/jsapi.h:1321: error: 'JSPropertyIdOp' does not name a type
/usr/include/xulrunner-1.9/unstable/jsapi.h:1322: error: 'JSPropertyIdOp' does not name a type
/usr/include/xulrunner-1.9/unstable/jsapi.h:1323: error: 'JSAttributesOp' does not name a type
/usr/include/xulrunner-1.9/unstable/jsapi.h:1324: error: 'JSAttributesOp' does not name a type
/usr/include/xulrunner-1.9/unstable/jsapi.h:1325: error: 'JSPropertyIdOp' does not name a type
/usr/include/xulrunner-1.9/unstable/jsapi.h:1326: error: 'JSConvertOp' does not name a type
/usr/include/xulrunner-1.9/unstable/jsapi.h:1327: error: 'JSNewEnumerateOp' does not name a type
/usr/include/xulrunner-1.9/unstable/jsapi.h:1328: error: 'JSCheckAccessIdOp' does not name a type
/usr/include/xulrunner-1.9/unstable/jsapi.h:1333: error: 'JSNative' does not name a type
/usr/include/xulrunner-1.9/unstable/jsapi.h:1334: error: 'JSNative' does not name a type
/usr/include/xulrunner-1.9/unstable/jsapi.h:1335: error: 'JSXDRObjectOp' does not name a type
/usr/include/xulrunner-1.9/unstable/jsapi.h:1336: error: 'JSHasInstanceOp' does not name a type
/usr/include/xulrunner-1.9/unstable/jsapi.h:1337: error: 'JSSetObjectSlotOp' does not name a type
/usr/include/xulrunner-1.9/unstable/jsapi.h:1338: error: 'JSSetObjectSlotOp' does not name a type
/usr/include/xulrunner-1.9/unstable/jsapi.h:1342: error: 'JSSetRequiredSlotOp' does not name a type
/usr/include/xulrunner-1.9/unstable/jsapi.h:1348: error: 'JSSetMethodOp' does not name a type
/usr/include/xulrunner-1.9/unstable/jsapi.h:1349: error: 'JSEnumerateValuesOp' does not name a type
/usr/include/xulrunner-1.9/unstable/jsapi.h:1350: error: 'JSEqualityOp' does not name a type
/usr/include/xulrunner-1.9/unstable/jsapi.h:1351: error: 'JSConcatenateOp' does not name a type
/usr/include/xulrunner-1.9/unstable/jsapi.h:1369: error: 'jsint' does not name a type
/usr/include/xulrunner-1.9/unstable/jsapi.h:1376: error: 'JSBool' does not name a type
/usr/include/xulrunner-1.9/unstable/jsapi.h:1379: error: 'JSBool' does not name a type
/usr/include/xulrunner-1.9/unstable/jsapi.h:1398: error: 'JSBool' does not name a type
/usr/include/xulrunner-1.9/unstable/jsapi.h:1401: error: 'JSBool' does not name a type
/usr/include/xulrunner-1.9/unstable/jsapi.h:1404: error: 'JSBool' does not name a type
/usr/include/xulrunner-1.9/unstable/jsapi.h:1407: error: 'JSBool' does not name a type
/usr/include/xulrunner-1.9/unstable/jsapi.h:1416: error: 'uint8' does not name a type
/usr/include/xulrunner-1.9/unstable/jsapi.h:1417: error: 'uint8' does not name a type
/usr/include/xulrunner-1.9/unstable/jsapi.h:1427: error: 'int8' does not name a type
/usr/include/xulrunner-1.9/unstable/jsapi.h:1428: error: 'uint8' does not name a type
/usr/include/xulrunner-1.9/unstable/jsapi.h:1429: error: 'JSPropertyOp' does not name a type
/usr/include/xulrunner-1.9/unstable/jsapi.h:1430: error: 'JSPropertyOp' does not name a type
/usr/include/xulrunner-1.9/unstable/jsapi.h:1435: error: 'JSNative' does not name a type
/usr/include/xulrunner-1.9/unstable/jsapi.h:1441: error: 'uint16' does not name a type
/usr/include/xulrunner-1.9/unstable/jsapi.h:1442: error: 'uint16' does not name a type
/usr/include/xulrunner-1.9/unstable/jsapi.h:1450: error: 'uint32' does not name a type
/usr/include/xulrunner-1.9/unstable/jsapi.h:1481: error: 'JSNative' has not been declared
/usr/include/xulrunner-1.9/unstable/jsapi.h:1481: error: 'uintN' has not been declared
/usr/include/xulrunner-1.9/unstable/jsapi.h:1497: error: 'JSBool' does not name a type
/usr/include/xulrunner-1.9/unstable/jsapi.h:1500: error: 'JSBool' does not name a type
/usr/include/xulrunner-1.9/unstable/jsapi.h:1506: error: 'JSBool' does not name a type
/usr/include/xulrunner-1.9/unstable/jsapi.h:1516: error: 'JSBool' does not name a type
/usr/include/xulrunner-1.9/unstable/jsapi.h:1522: error: 'JSBool' does not name a type
/usr/include/xulrunner-1.9/unstable/jsapi.h:1533: error: 'JSBool' does not name a type
/usr/include/xulrunner-1.9/unstable/jsapi.h:1547: error: 'JSBool' does not name a type
/usr/include/xulrunner-1.9/unstable/jsapi.h:1556: error: 'uintN' has not been declared
/usr/include/xulrunner-1.9/unstable/jsapi.h:1560: error: 'uintN' has not been declared
/usr/include/xulrunner-1.9/unstable/jsapi.h:1562: error: 'JSBool' does not name a type
/usr/include/xulrunner-1.9/unstable/jsapi.h:1565: error: 'JSBool' does not name a type
/usr/include/xulrunner-1.9/unstable/jsapi.h:1568: error: 'JSBool' does not name a type
/usr/include/xulrunner-1.9/unstable/jsapi.h:1578: error: 'JSBool' does not name a type
/usr/include/xulrunner-1.9/unstable/jsapi.h:1587: error: 'JSBool' does not name a type
/usr/include/xulrunner-1.9/unstable/jsapi.h:1600: error: 'JSBool' does not name a type
/usr/include/xulrunner-1.9/unstable/jsapi.h:1604: error: 'JSBool' does not name a type
/usr/include/xulrunner-1.9/unstable/jsapi.h:1610: error: 'JSBool' does not name a type
/usr/include/xulrunner-1.9/unstable/jsapi.h:1614: error: 'JSBool' does not name a type
/usr/include/xulrunner-1.9/unstable/jsapi.h:1618: error: 'JSBool' does not name a type
/usr/include/xulrunner-1.9/unstable/jsapi.h:1621: error: 'JSBool' does not name a type
/usr/include/xulrunner-1.9/unstable/jsapi.h:1624: error: 'JSBool' does not name a type
/usr/include/xulrunner-1.9/unstable/jsapi.h:1628: error: 'JSBool' does not name a type
/usr/include/xulrunner-1.9/unstable/jsapi.h:1631: error: 'JSBool' does not name a type
/usr/include/xulrunner-1.9/unstable/jsapi.h:1635: error: 'JSBool' does not name a type
/usr/include/xulrunner-1.9/unstable/jsapi.h:1639: error: 'JSBool' does not name a type
/usr/include/xulrunner-1.9/unstable/jsapi.h:1642: error: 'JSBool' does not name a type
/usr/include/xulrunner-1.9/unstable/jsapi.h:1645: error: 'JSBool' does not name a type
/usr/include/xulrunner-1.9/unstable/jsapi.h:1649: error: 'JSBool' does not name a type
/usr/include/xulrunner-1.9/unstable/jsapi.h:1661: error: 'JSBool' does not name a type
/usr/include/xulrunner-1.9/unstable/jsapi.h:1671: error: 'JSBool' does not name a type
/usr/include/xulrunner-1.9/unstable/jsapi.h:1684: error: 'JSBool' does not name a type
/usr/include/xulrunner-1.9/unstable/jsapi.h:1690: error: 'JSBool' does not name a type
/usr/include/xulrunner-1.9/unstable/jsapi.h:1697: error: 'JSBool' does not name a type
/usr/include/xulrunner-1.9/unstable/jsapi.h:1701: error: 'JSBool' does not name a type
/usr/include/xulrunner-1.9/unstable/jsapi.h:1706: error: 'JSBool' does not name a type
/usr/include/xulrunner-1.9/unstable/jsapi.h:1711: error: 'JSBool' does not name a type
/usr/include/xulrunner-1.9/unstable/jsapi.h:1716: error: 'JSBool' does not name a type
/usr/include/xulrunner-1.9/unstable/jsapi.h:1721: error: 'JSBool' does not name a type
/usr/include/xulrunner-1.9/unstable/jsapi.h:1727: error: 'jsint' has not been declared
/usr/include/xulrunner-1.9/unstable/jsapi.h:1729: error: 'JSBool' does not name a type
/usr/include/xulrunner-1.9/unstable/jsapi.h:1732: error: 'JSBool' does not name a type
/usr/include/xulrunner-1.9/unstable/jsapi.h:1735: error: 'JSBool' does not name a type
/usr/include/xulrunner-1.9/unstable/jsapi.h:1738: error: 'JSBool' does not name a type
/usr/include/xulrunner-1.9/unstable/jsapi.h:1741: error: 'JSBool' does not name a type
/usr/include/xulrunner-1.9/unstable/jsapi.h:1745: error: 'JSBool' does not name a type
/usr/include/xulrunner-1.9/unstable/jsapi.h:1748: error: 'JSBool' does not name a type
/usr/include/xulrunner-1.9/unstable/jsapi.h:1752: error: 'JSBool' does not name a type
/usr/include/xulrunner-1.9/unstable/jsapi.h:1755: error: 'JSBool' does not name a type
/usr/include/xulrunner-1.9/unstable/jsapi.h:1758: error: 'JSBool' does not name a type
/usr/include/xulrunner-1.9/unstable/jsapi.h:1761: error: 'JSBool' does not name a type
/usr/include/xulrunner-1.9/unstable/jsapi.h:1764: error: 'JSBool' does not name a type
/usr/include/xulrunner-1.9/unstable/jsapi.h:1767: error: 'JSBool' does not name a type
/usr/include/xulrunner-1.9/unstable/jsapi.h:1789: error: 'JSBool' does not name a type
/usr/include/xulrunner-1.9/unstable/jsapi.h:1792: error: 'JSBool' does not name a type
/usr/include/xulrunner-1.9/unstable/jsapi.h:1796: error: 'JSCheckAccessOp' does not name a type
/usr/include/xulrunner-1.9/unstable/jsapi.h:1799: error: 'JSBool' does not name a type
/usr/include/xulrunner-1.9/unstable/jsapi.h:1802: error: 'JSBool' does not name a type
/usr/include/xulrunner-1.9/unstable/jsapi.h:1815: error: expected identifier before '*' token
/usr/include/xulrunner-1.9/unstable/jsapi.h:1815: error: ISO C++ forbids declaration of 'JSBool' with no type
/usr/include/xulrunner-1.9/unstable/jsapi.h:1815: error: 'JSBool' declared as function returning a function
/usr/include/xulrunner-1.9/unstable/jsapi.h:1818: error: 'jsrefcount' does not name a type
/usr/include/xulrunner-1.9/unstable/jsapi.h:1821: error: expected identifier before '*' token
/usr/include/xulrunner-1.9/unstable/jsapi.h:1821: error: ISO C++ forbids declaration of 'JSBool' with no type
/usr/include/xulrunner-1.9/unstable/jsapi.h:1821: error: 'JSBool' declared as function returning a function
/usr/include/xulrunner-1.9/unstable/jsapi.h:1821: error: 'int JSPrincipals::JSBool(int*)' cannot be overloaded
/usr/include/xulrunner-1.9/unstable/jsapi.h:1815: error: with 'int JSPrincipals::JSBool(int*)'
/usr/include/xulrunner-1.9/unstable/jsapi.h:1842: error: 'JSPrincipalsTranscoder' does not name a type
/usr/include/xulrunner-1.9/unstable/jsapi.h:1854: error: 'JSNative' has not been declared
/usr/include/xulrunner-1.9/unstable/jsapi.h:1854: error: 'uintN' has not been declared
/usr/include/xulrunner-1.9/unstable/jsapi.h:1854: error: 'uintN' has not been declared
/usr/include/xulrunner-1.9/unstable/jsapi.h:1883: error: 'uintN' does not name a type
/usr/include/xulrunner-1.9/unstable/jsapi.h:1889: error: 'uint16' does not name a type
/usr/include/xulrunner-1.9/unstable/jsapi.h:1898: error: 'JSBool' does not name a type
/usr/include/xulrunner-1.9/unstable/jsapi.h:1901: error: 'JSBool' does not name a type
/usr/include/xulrunner-1.9/unstable/jsapi.h:1905: error: 'JSNative' has not been declared
/usr/include/xulrunner-1.9/unstable/jsapi.h:1906: error: 'uintN' has not been declared
/usr/include/xulrunner-1.9/unstable/jsapi.h:1906: error: 'uintN' has not been declared
/usr/include/xulrunner-1.9/unstable/jsapi.h:1910: error: expected ',' or '...' before '*' token
/usr/include/xulrunner-1.9/unstable/jsapi.h:1911: error: ISO C++ forbids declaration of 'jschar' with no type
/usr/include/xulrunner-1.9/unstable/jsapi.h:1923: error: 'JSBool' does not name a type
/usr/include/xulrunner-1.9/unstable/jsapi.h:1937: error: 'uintN' has not been declared
/usr/include/xulrunner-1.9/unstable/jsapi.h:1943: error: 'uintN' has not been declared
/usr/include/xulrunner-1.9/unstable/jsapi.h:1947: error: expected ',' or '...' before '*' token
/usr/include/xulrunner-1.9/unstable/jsapi.h:1948: error: ISO C++ forbids declaration of 'jschar' with no type
/usr/include/xulrunner-1.9/unstable/jsapi.h:1953: error: expected ',' or '...' before '*' token
/usr/include/xulrunner-1.9/unstable/jsapi.h:1954: error: ISO C++ forbids declaration of 'jschar' with no type
/usr/include/xulrunner-1.9/unstable/jsapi.h:1999: error: 'uintN' has not been declared
/usr/include/xulrunner-1.9/unstable/jsapi.h:2001: error: 'uintN' has not been declared
/usr/include/xulrunner-1.9/unstable/jsapi.h:2006: error: 'uintN' has not been declared
/usr/include/xulrunner-1.9/unstable/jsapi.h:2008: error: 'uintN' has not been declared
/usr/include/xulrunner-1.9/unstable/jsapi.h:2012: error: 'uintN' has not been declared
/usr/include/xulrunner-1.9/unstable/jsapi.h:2013: error: expected ',' or '...' before '*' token
/usr/include/xulrunner-1.9/unstable/jsapi.h:2014: error: ISO C++ forbids declaration of 'jschar' with no type
/usr/include/xulrunner-1.9/unstable/jsapi.h:2019: error: 'uintN' has not been declared
/usr/include/xulrunner-1.9/unstable/jsapi.h:2020: error: expected ',' or '...' before '*' token
/usr/include/xulrunner-1.9/unstable/jsapi.h:2021: error: ISO C++ forbids declaration of 'jschar' with no type
/usr/include/xulrunner-1.9/unstable/jsapi.h:2025: error: 'uintN' has not been declared
/usr/include/xulrunner-1.9/unstable/jsapi.h:2034: error: 'uintN' has not been declared
/usr/include/xulrunner-1.9/unstable/jsapi.h:2037: error: 'uintN' has not been declared
/usr/include/xulrunner-1.9/unstable/jsapi.h:2074: error: 'JSBool' does not name a type
/usr/include/xulrunner-1.9/unstable/jsapi.h:2083: error: 'JSBool' does not name a type
/usr/include/xulrunner-1.9/unstable/jsapi.h:2087: error: 'JSBool' does not name a type
/usr/include/xulrunner-1.9/unstable/jsapi.h:2093: error: 'JSBool' does not name a type
/usr/include/xulrunner-1.9/unstable/jsapi.h:2100: error: 'JSBool' does not name a type
/usr/include/xulrunner-1.9/unstable/jsapi.h:2106: error: 'JSBool' does not name a type
/usr/include/xulrunner-1.9/unstable/jsapi.h:2113: error: 'JSBool' does not name a type
/usr/include/xulrunner-1.9/unstable/jsapi.h:2117: error: 'JSBool' does not name a type
/usr/include/xulrunner-1.9/unstable/jsapi.h:2121: error: 'JSBool' does not name a type
/usr/include/xulrunner-1.9/unstable/jsapi.h:2146: error: 'JSOperationCallback' has not been declared
/usr/include/xulrunner-1.9/unstable/jsapi.h:2147: error: 'uint32' has not been declared
/usr/include/xulrunner-1.9/unstable/jsapi.h:2152: error: 'JSOperationCallback' does not name a type
/usr/include/xulrunner-1.9/unstable/jsapi.h:2160: error: 'uint32' does not name a type
/usr/include/xulrunner-1.9/unstable/jsapi.h:2169: error: 'uint32' has not been declared
/usr/include/xulrunner-1.9/unstable/jsapi.h:2180: error: 'JSBranchCallback' does not name a type
/usr/include/xulrunner-1.9/unstable/jsapi.h:2183: error: 'JSBool' does not name a type
/usr/include/xulrunner-1.9/unstable/jsapi.h:2186: error: 'JSBool' does not name a type
/usr/include/xulrunner-1.9/unstable/jsapi.h:2194: error: 'JSBool' does not name a type
/usr/include/xulrunner-1.9/unstable/jsapi.h:2251: error: 'jschar' has not been declared
/usr/include/xulrunner-1.9/unstable/jsapi.h:2254: error: expected ',' or '...' before '*' token
/usr/include/xulrunner-1.9/unstable/jsapi.h:2254: error: ISO C++ forbids declaration of 'jschar' with no type
/usr/include/xulrunner-1.9/unstable/jsapi.h:2257: error: expected ',' or '...' before '*' token
/usr/include/xulrunner-1.9/unstable/jsapi.h:2257: error: ISO C++ forbids declaration of 'jschar' with no type
/usr/include/xulrunner-1.9/unstable/jsapi.h:2260: error: expected ',' or '...' before '*' token
/usr/include/xulrunner-1.9/unstable/jsapi.h:2260: error: ISO C++ forbids declaration of 'jschar' with no type
/usr/include/xulrunner-1.9/unstable/jsapi.h:2263: error: expected ',' or '...' before '*' token
/usr/include/xulrunner-1.9/unstable/jsapi.h:2263: error: ISO C++ forbids declaration of 'jschar' with no type
/usr/include/xulrunner-1.9/unstable/jsapi.h:2268: error: expected initializer before '*' token
/usr/include/xulrunner-1.9/unstable/jsapi.h:2274: error: 'intN' does not name a type
/usr/include/xulrunner-1.9/unstable/jsapi.h:2297: error: 'jschar' has not been declared
/usr/include/xulrunner-1.9/unstable/jsapi.h:2322: error: expected initializer before '*' token
/usr/include/xulrunner-1.9/unstable/jsapi.h:2329: error: 'JSBool' does not name a type
/usr/include/xulrunner-1.9/unstable/jsapi.h:2336: error: 'JSBool' does not name a type
/usr/include/xulrunner-1.9/unstable/jsapi.h:2368: error: 'JSBool' does not name a type
/usr/include/xulrunner-1.9/unstable/jsapi.h:2372: error: 'JSBool' does not name a type
/usr/include/xulrunner-1.9/unstable/jsapi.h:2389: error: 'JSLocaleToUpperCase' does not name a type
/usr/include/xulrunner-1.9/unstable/jsapi.h:2390: error: 'JSLocaleToLowerCase' does not name a type
/usr/include/xulrunner-1.9/unstable/jsapi.h:2391: error: 'JSLocaleCompare' does not name a type
/usr/include/xulrunner-1.9/unstable/jsapi.h:2392: error: 'JSLocaleToUnicode' does not name a type
/usr/include/xulrunner-1.9/unstable/jsapi.h:2430: error: expected ',' or '...' before 'errorNumber'
/usr/include/xulrunner-1.9/unstable/jsapi.h:2430: error: ISO C++ forbids declaration of 'uintN' with no type
/usr/include/xulrunner-1.9/unstable/jsapi.h:2437: error: expected ',' or '...' before 'errorNumber'
/usr/include/xulrunner-1.9/unstable/jsapi.h:2437: error: ISO C++ forbids declaration of 'uintN' with no type
/usr/include/xulrunner-1.9/unstable/jsapi.h:2445: error: 'JSBool' does not name a type
/usr/include/xulrunner-1.9/unstable/jsapi.h:2448: error: 'JSBool' does not name a type
/usr/include/xulrunner-1.9/unstable/jsapi.h:2453: error: 'JSBool' does not name a type
/usr/include/xulrunner-1.9/unstable/jsapi.h:2472: error: 'uintN' does not name a type
/usr/include/xulrunner-1.9/unstable/jsapi.h:2475: error: ISO C++ forbids declaration of 'jschar' with no type
/usr/include/xulrunner-1.9/unstable/jsapi.h:2475: error: expected ';' before '*' token
/usr/include/xulrunner-1.9/unstable/jsapi.h:2476: error: ISO C++ forbids declaration of 'jschar' with no type
/usr/include/xulrunner-1.9/unstable/jsapi.h:2476: error: expected ';' before '*' token
/usr/include/xulrunner-1.9/unstable/jsapi.h:2477: error: 'uintN' does not name a type
/usr/include/xulrunner-1.9/unstable/jsapi.h:2478: error: 'uintN' does not name a type
/usr/include/xulrunner-1.9/unstable/jsapi.h:2479: error: ISO C++ forbids declaration of 'jschar' with no type
/usr/include/xulrunner-1.9/unstable/jsapi.h:2479: error: expected ';' before '*' token
/usr/include/xulrunner-1.9/unstable/jsapi.h:2480: error: ISO C++ forbids declaration of 'jschar' with no type
/usr/include/xulrunner-1.9/unstable/jsapi.h:2480: error: expected ';' before '*' token
/usr/include/xulrunner-1.9/unstable/jsapi.h:2516: error: 'uintN' has not been declared
/usr/include/xulrunner-1.9/unstable/jsapi.h:2519: error: 'jschar' has not been declared
/usr/include/xulrunner-1.9/unstable/jsapi.h:2519: error: 'uintN' has not been declared
/usr/include/xulrunner-1.9/unstable/jsapi.h:2522: error: 'JSBool' has not been declared
/usr/include/xulrunner-1.9/unstable/jsapi.h:2534: error: 'JSBool' does not name a type
/usr/include/xulrunner-1.9/unstable/jsapi.h:2537: error: 'JSBool' does not name a type
/usr/include/xulrunner-1.9/unstable/jsapi.h:2546: error: 'JSBool' does not name a type
/usr/include/xulrunner-1.9/unstable/jsapi.h:2583: error: 'JSBool' does not name a type
/usr/include/xulrunner-1.9/unstable/jsapi.h:2590: error: 'JSBool' does not name a type
/var/tmp/portage/net-libs/libproxy-0.4.2/work/libproxy-0.4.2/libproxy/modules/pacrunner_mozjs.cpp:45: error: 'JSBool' does not name a type
/var/tmp/portage/net-libs/libproxy-0.4.2/work/libproxy-0.4.2/libproxy/modules/pacrunner_mozjs.cpp:78: error: 'JSBool' does not name a type
/var/tmp/portage/net-libs/libproxy-0.4.2/work/libproxy-0.4.2/libproxy/modules/pacrunner_mozjs.cpp:93: error: 'JSUint32' was not declared in this scope
/var/tmp/portage/net-libs/libproxy-0.4.2/work/libproxy-0.4.2/libproxy/modules/pacrunner_mozjs.cpp:93: error: expected `)' before numeric constant
/var/tmp/portage/net-libs/libproxy-0.4.2/work/libproxy-0.4.2/libproxy/modules/pacrunner_mozjs.cpp:97: error: expected `)' before '}' token
/var/tmp/portage/net-libs/libproxy-0.4.2/work/libproxy-0.4.2/libproxy/modules/pacrunner_mozjs.cpp:97: error: expected `)' before '}' token
/var/tmp/portage/net-libs/libproxy-0.4.2/work/libproxy-0.4.2/libproxy/modules/pacrunner_mozjs.cpp:97: error: expected `)' before '}' token
/var/tmp/portage/net-libs/libproxy-0.4.2/work/libproxy-0.4.2/libproxy/modules/pacrunner_mozjs.cpp:97: error: expected `)' before '}' token
/var/tmp/portage/net-libs/libproxy-0.4.2/work/libproxy-0.4.2/libproxy/modules/pacrunner_mozjs.cpp:97: warning: missing initializer for member 'JSClass::getObjectOps'
/var/tmp/portage/net-libs/libproxy-0.4.2/work/libproxy-0.4.2/libproxy/modules/pacrunner_mozjs.cpp: In constructor 'mozjs_pacrunner::mozjs_pacrunner(std::string, const libproxy::url&)':
/var/tmp/portage/net-libs/libproxy-0.4.2/work/libproxy-0.4.2/libproxy/modules/pacrunner_mozjs.cpp:109: error: 'JS_Init' cannot be used as a function
/var/tmp/portage/net-libs/libproxy-0.4.2/work/libproxy-0.4.2/libproxy/modules/pacrunner_mozjs.cpp:115: error: 'JS_InitStandardClasses' was not declared in this scope
/var/tmp/portage/net-libs/libproxy-0.4.2/work/libproxy-0.4.2/libproxy/modules/pacrunner_mozjs.cpp:118: error: 'dnsResolve' was not declared in this scope
/var/tmp/portage/net-libs/libproxy-0.4.2/work/libproxy-0.4.2/libproxy/modules/pacrunner_mozjs.cpp:119: error: 'myIpAddress' was not declared in this scope
/var/tmp/portage/net-libs/libproxy-0.4.2/work/libproxy-0.4.2/libproxy/modules/pacrunner_mozjs.cpp:121: error: 'JS_EvaluateScript' was not declared in this scope
/var/tmp/portage/net-libs/libproxy-0.4.2/work/libproxy-0.4.2/libproxy/modules/pacrunner_mozjs.cpp: In member function 'virtual std::string mozjs_pacrunner::run(const libproxy::url&)':
/var/tmp/portage/net-libs/libproxy-0.4.2/work/libproxy-0.4.2/libproxy/modules/pacrunner_mozjs.cpp:156: error: 'JSBool' was not declared in this scope
/var/tmp/portage/net-libs/libproxy-0.4.2/work/libproxy-0.4.2/libproxy/modules/pacrunner_mozjs.cpp:156: error: expected `;' before 'result'
/var/tmp/portage/net-libs/libproxy-0.4.2/work/libproxy-0.4.2/libproxy/modules/pacrunner_mozjs.cpp:157: error: 'result' was not declared in this scope
/var/tmp/portage/net-libs/libproxy-0.4.2/work/libproxy-0.4.2/libproxy/modules/pacrunner_mozjs.cpp:149: warning: unused variable 'args'
make[2]: *** [libproxy/CMakeFiles/libproxy.dir/modules/pacrunner_mozjs.o] Error 1
make[2]: *** Waiting for unfinished jobs....
make[1]: *** [libproxy/CMakeFiles/libproxy.dir/all] Error 2
make: *** [all] Error 2
 * ERROR: net-libs/libproxy-0.4.2 failed:
 *   Make failed!
 *
 * Call stack:
 *     ebuild.sh, line   48:  Called src_compile
 *   environment, line 4971:  Called cmake-utils_src_compile
 *   environment, line 1255:  Called _execute_optionaly 'src_compile'
 *   environment, line  408:  Called enable_cmake-utils_src_compile
 *   environment, line 1614:  Called cmake-utils_src_make
 *   environment, line 1274:  Called die
 * The specific snippet of code:
 *           emake "$@" || die "Make failed!";
 *
 * If you need support, post the output of 'emerge --info =net-libs/libproxy-0.4.2',
 * the complete build log and the output of 'emerge -pqv =net-libs/libproxy-0.4.2'.
 * The complete build log is located at '/var/tmp/portage/net-libs/libproxy-0.4.2/temp/build.log'.
 * The ebuild environment file is located at '/var/tmp/portage/net-libs/libproxy-0.4.2/temp/environment'.
 * S: '/var/tmp/portage/net-libs/libproxy-0.4.2/work/libproxy-0.4.2'
Back to top
View user's profile Send private message
Kosmas
Apprentice
Apprentice


Joined: 14 Sep 2006
Posts: 266
Location: Greece

PostPosted: Wed May 26, 2010 5:49 am    Post subject: Reply with quote

Hi,

Check if except xulrunner-1.9.0.14, you also have xulrunner-1.8 in your system. I had the same and it seemed that xulrunner 1.8 was also in my system as a dependency for vlc.

Just run
qlist -I -v xulrunner
and if you have it just unmerge it, merge libproxy and then re emerge 1.8. Thats how I did it and it worked.

Hope it helps,
Kosmas
Back to top
View user's profile Send private message
m27315
Apprentice
Apprentice


Joined: 10 Dec 2004
Posts: 236
Location: 2 workstations down

PostPosted: Wed May 26, 2010 1:17 pm    Post subject: Reply with quote

I had already unmerged xulrunner-1.8 based on your existing comments; however, your qlist suggestion revealed something more:

Code:
# qlist -I -v xulrunner
net-libs/xulrunner-1.9.0.14
net-libs/xulrunner-bin-1.8.1.19


So, I did tried this for the second time:

Code:
# emerge -C xulrunner-bin xulrunner
# emerge -pvt libproxy

These are the packages that would be merged, in reverse order:

Calculating dependencies... done!
[ebuild     U ] net-libs/libproxy-0.4.2 [0.2.3-r3] USE="gnome kde networkmanager perl%* python xulrunner -debug% -vala% -webkit" 0 kB
[ebuild  N    ]  net-libs/xulrunner-1.9.0.14  USE="dbus gnome java -custom-optimization -startup-notification" 0 kB

# rm /var/tmp/portage/*
# emerge libproxy

And, I still get the same error ... :( Any suggestions?

BTW, which java engine are you using?

Code:
# eselect java-vm list
Available Java Virtual Machines:
grep: /usr/share/java-config-2/vm/java: No such file or directory
grep: /usr/share/java-config-2/vm/java-1.4.2: No such file or directory
grep: /usr/share/java-config-2/vm/java-1.4.2-gcj: No such file or directory
grep: /usr/share/java-config-2/vm/java-1.4.2-gcj-1.4.2.0: No such file or directory
grep: /usr/share/java-config-2/vm/java-gcj: No such file or directory
grep: /usr/share/java-config-2/vm/jre: No such file or directory
grep: /usr/share/java-config-2/vm/jre-1.4.2: No such file or directory
grep: /usr/share/java-config-2/vm/jre-1.4.2-gcj: No such file or directory
grep: /usr/share/java-config-2/vm/jre-gcj: No such file or directory
  [1]   emul-linux-x86-java-1.6
  [2]   icedtea6-bin
  [3]   java
  [4]   java-1.4.2
  [5]   java-1.4.2-gcj
  [6]   java-1.4.2-gcj-1.4.2.0
  [7]   java-gcj
  [8]   jre
  [9]   jre-1.4.2
  [10]  jre-1.4.2-gcj
  [11]  jre-gcj
  [12]  sun-jdk-1.5 Build Only
  [13]  sun-jdk-1.6  system-vm

!!! Warning: VMs marked as Build Only may contain Security Vulnerabilities and/or be EOL.
!!! Warning: Gentoo recommends not setting these VMs as either your System or User VM.
!!! Warning: Please see http://www.gentoo.org/doc/en/java.xml#build-only for more information.

Thanks!

Trevor

Code:
>>> Emerging (2 of 2) net-libs/libproxy-0.4.2
 * libproxy-0.4.2.tar.gz RMD160 SHA1 SHA256 size ;-) ...                                                                                                                                                                                                       [ ok ]
 * checking ebuild checksums ;-) ...                                                                                                                                                                                                                           [ ok ]
 * checking auxfile checksums ;-) ...                                                                                                                                                                                                                          [ ok ]
 * checking miscfile checksums ;-) ...                                                                                                                                                                                                                         [ ok ]
 * CPV:  net-libs/libproxy-0.4.2
 * REPO: gentoo
 * USE:  amd64 elibc_glibc gnome kde kernel_linux multilib networkmanager perl python userland_GNU xulrunner
>>> Unpacking source...
>>> Unpacking libproxy-0.4.2.tar.gz to /var/tmp/portage/net-libs/libproxy-0.4.2/work
>>> Source unpacked in /var/tmp/portage/net-libs/libproxy-0.4.2/work
>>> Preparing source in /var/tmp/portage/net-libs/libproxy-0.4.2/work/libproxy-0.4.2 ...
>>> Source prepared.
>>> Configuring source in /var/tmp/portage/net-libs/libproxy-0.4.2/work/libproxy-0.4.2 ...
>>> Working in BUILD_DIR: "/var/tmp/portage/net-libs/libproxy-0.4.2/work/libproxy-0.4.2_build"
cmake -C /var/tmp/portage/net-libs/libproxy-0.4.2/temp/gentoo_common_config.cmake -DCMAKE_INSTALL_PREFIX=/usr -DCMAKE_CXX_FLAGS=-march=native -O2 -pipe -DCMAKE_LD_FLAGS=-march=native -O2 -pipe -DWITH_GNOME=ON -DWITH_KDE4=ON -DWITH_NM=ON -DWITH_PERL=ON -DWITH_PYTHON=ON -DWITH_VALA=OFF -DWITH_WEBKIT=OFF -DWITH_MOZJS=ON -DCMAKE_BUILD_TYPE=Gentoo -DCMAKE_INSTALL_DO_STRIP=OFF -DCMAKE_USER_MAKE_RULES_OVERRIDE=/var/tmp/portage/net-libs/libproxy-0.4.2/temp/gentoo_rules.cmake  /var/tmp/portage/net-libs/libproxy-0.4.2/work/libproxy-0.4.2
loading initial cache file /var/tmp/portage/net-libs/libproxy-0.4.2/temp/gentoo_common_config.cmake
-- The C compiler identification is GNU
-- The CXX compiler identification is GNU
-- Check for working C compiler: /usr/bin/x86_64-pc-linux-gnu-gcc
-- Check for working C compiler: /usr/bin/x86_64-pc-linux-gnu-gcc -- works
-- Detecting C compiler ABI info
-- Detecting C compiler ABI info - done
-- Check for working CXX compiler: /usr/bin/x86_64-pc-linux-gnu-g++
-- Check for working CXX compiler: /usr/bin/x86_64-pc-linux-gnu-g++ -- works
-- Detecting CXX compiler ABI info
-- Detecting CXX compiler ABI info - done
-- checking for modules 'NetworkManager;dbus-1'
--   found NetworkManager, version 0.8
--   found dbus-1, version 1.2.24
-- checking for one of the modules 'xulrunner-js;firefox-js;mozilla-js;seamonkey-js'
--   found mozilla-js, version 1.9.0.14
-- checking for modules 'gconf-2.0;gobject-2.0'
--   found gconf-2.0, version 2.28.1
--   found gobject-2.0, version 2.22.5
-- Looking for Q_WS_X11
-- Looking for Q_WS_X11 - found
-- Looking for Q_WS_WIN
-- Looking for Q_WS_WIN - not found.
-- Looking for Q_WS_QWS
-- Looking for Q_WS_QWS - not found.
-- Looking for Q_WS_MAC
-- Looking for Q_WS_MAC - not found.
-- Found Qt-Version 4.6.2 (using /usr/bin/qmake)
-- Looking for XOpenDisplay in /usr/lib64/libX11.so;/usr/lib64/libXext.so;/usr/lib64/libXft.so;/usr/lib64/libXau.so;/usr/lib64/libXdmcp.so;/usr/lib64/libXpm.so
-- Looking for XOpenDisplay in /usr/lib64/libX11.so;/usr/lib64/libXext.so;/usr/lib64/libXft.so;/usr/lib64/libXau.so;/usr/lib64/libXdmcp.so;/usr/lib64/libXpm.so - found
-- Looking for gethostbyname
-- Looking for gethostbyname - found
-- Looking for connect
-- Looking for connect - found
-- Looking for remove
-- Looking for remove - found
-- Looking for shmat
-- Looking for shmat - found
-- Looking for IceConnectionNumber in ICE
-- Looking for IceConnectionNumber in ICE - found
-- Found X11: /usr/lib64/libX11.so
-- Looking for include files CMAKE_HAVE_PTHREAD_H
-- Looking for include files CMAKE_HAVE_PTHREAD_H - found
-- Looking for pthread_create in pthreads
-- Looking for pthread_create in pthreads - not found
-- Looking for pthread_create in pthread
-- Looking for pthread_create in pthread - found
-- Found Threads: TRUE
-- Looking for _POSIX_TIMERS
-- Looking for _POSIX_TIMERS - found
-- Found Automoc4: /usr/bin/automoc4
-- Found Perl: /usr/bin/perl
-- Phonon Version: 4.3.80
-- Found Phonon: /usr/lib64/libphonon.so
-- Found Phonon Includes: /usr/include/KDE;/usr/include
-- Performing Test _OFFT_IS_64BIT
-- Performing Test _OFFT_IS_64BIT - Success
-- Performing Test HAVE_FPIE_SUPPORT
-- Performing Test HAVE_FPIE_SUPPORT - Success
-- Performing Test __KDE_HAVE_W_OVERLOADED_VIRTUAL
-- Performing Test __KDE_HAVE_W_OVERLOADED_VIRTUAL - Success
-- Performing Test __KDE_HAVE_GCC_VISIBILITY
-- Performing Test __KDE_HAVE_GCC_VISIBILITY - Success
-- Found KDE 4.4 include dir: /usr/include
-- Found KDE 4.4 library dir: /usr/lib64
-- Found the KDE4 kconfig_compiler preprocessor: /usr/bin/kconfig_compiler
-- Found automoc4: /usr/bin/automoc4
-- Found Qt-Version 4.6.2 (using /usr/bin/qmake)
-- Found X11: /usr/lib64/libX11.so
MODULES TO BUILD:
        *       config_envvar
        m       config_gnome
        m       config_kde4
                config_macosx
                config_w32reg
        *       ignore_domain
        *       ignore_hostname
        *       ignore_ip
        m       network_networkmanager
        *       pacrunner_mozjs
                pacrunner_webkit
        *       wpad_dns_alias

-- Found PythonInterp: /usr/bin/python
-- Found PerlLibs: /usr/lib64/libperl.so
-- <<< Gentoo configuration >>>
Build type      Gentoo
Install path    /usr
Compiler flags:
C               -march=native -O2 -pipe
C++              -fvisibility=hidden -Os -march=native -O2 -pipe
Linker flags:
Executable      -Wl,-O1
Module          -Wl,-O1
Shared          -Wl,-O1

-- Configuring done
-- Generating done
-- Build files have been written to: /var/tmp/portage/net-libs/libproxy-0.4.2/work/libproxy-0.4.2_build
>>> Source configured.
>>> Compiling source in /var/tmp/portage/net-libs/libproxy-0.4.2/work/libproxy-0.4.2 ...
>>> Working in BUILD_DIR: "/var/tmp/portage/net-libs/libproxy-0.4.2/work/libproxy-0.4.2_build"
make -j5
Scanning dependencies of target PMlibproxy
Scanning dependencies of target libmodman
Scanning dependencies of target pxgconf
[  0%] Built target PMlibproxy
[  2%] Building CXX object libmodman/CMakeFiles/libmodman.dir/module_manager.cpp.o
Linking CXX shared library libmodman.so
[  2%] Built target libmodman
Scanning dependencies of target builtin
Scanning dependencies of target builtin_one
Scanning dependencies of target condition
Scanning dependencies of target condition_one
[  5%] [  8%] [ 11%] [ 14%] Building CXX object libmodman/CMakeFiles/condition_one.dir/libmodman/test/condition_one.cpp.o
Building CXX object libmodman/CMakeFiles/condition.dir/test/main.cpp.o
Building CXX object libmodman/CMakeFiles/builtin_one.dir/libmodman/test/builtin_one.cpp.o
Building CXX object libproxy/CMakeFiles/pxgconf.dir/modules/pxgconf.o
Linking CXX shared module test/modules/condition/condition_one.so
Linking CXX executable condition
[ 17%] Linking CXX shared module test/modules/builtin/builtin_one.so
Linking CXX executable pxgconf
Building CXX object libmodman/CMakeFiles/builtin.dir/test/builtin.cpp.o
[ 17%] Built target builtin_one
[ 17%] Scanning dependencies of target condition_two
Built target condition_one
[ 20%] Building CXX object libmodman/CMakeFiles/builtin.dir/libmodman/test/builtin_one.cpp.o
Scanning dependencies of target singleton
[ 20%] Built target condition
[ 20%] Scanning dependencies of target singleton_one
Built target pxgconf
Scanning dependencies of target singleton_two
Linking CXX executable builtin
[ 22%] [ 25%] Building CXX object libmodman/CMakeFiles/condition_two.dir/libmodman/test/condition_two.cpp.o
Building CXX object libmodman/CMakeFiles/singleton.dir/test/main.cpp.o
Linking CXX executable singleton
Linking CXX shared module test/modules/condition/condition_two.so
[ 28%] [ 31%] Building CXX object libmodman/CMakeFiles/singleton_two.dir/libmodman/test/singleton_two.cpp.o
Building CXX object libmodman/CMakeFiles/singleton_one.dir/libmodman/test/singleton_one.cpp.o
[ 31%] Built target builtin
Scanning dependencies of target sorted
Linking CXX shared module test/modules/singleton/singleton_one.so
Linking CXX shared module test/modules/singleton/singleton_two.so
[ 31%] Built target singleton
[ 31%] Scanning dependencies of target sorted_one
Built target condition_two
Scanning dependencies of target sorted_two
[ 31%] Built target singleton_two
Scanning dependencies of target symbol
[ 31%] Built target singleton_one
Scanning dependencies of target symbol_one
[ 34%] Building CXX object libmodman/CMakeFiles/sorted.dir/test/main.cpp.o
Linking CXX executable sorted
[ 37%] [ 40%] [ 42%] Building CXX object libmodman/CMakeFiles/symbol.dir/test/main.cpp.o
Building CXX object libmodman/CMakeFiles/symbol_one.dir/libmodman/test/symbol_one.cpp.o
[ 45%] Building CXX object libmodman/CMakeFiles/sorted_one.dir/libmodman/test/sorted_one.cpp.o
Building CXX object libmodman/CMakeFiles/sorted_two.dir/libmodman/test/sorted_two.cpp.o
Linking CXX shared module test/modules/symbol/symbol_one.so
Linking CXX shared module test/modules/sorted/sorted_one.so
Linking CXX shared module test/modules/sorted/sorted_two.so
Linking CXX executable symbol
[ 45%] Built target sorted
[ 45%] Scanning dependencies of target symbol_two
Built target symbol_one
[ 45%] Scanning dependencies of target symbollnk
Built target sorted_one
Scanning dependencies of target libproxy
[ 45%] Built target sorted_two
[ 45%] Built target symbol
[ 48%] Building CXX object libmodman/CMakeFiles/symbol_two.dir/libmodman/test/symbol_two.cpp.o
Linking CXX shared module test/modules/symbol/symbol_two.so
[ 51%] [ 54%] [ 57%] Building CXX object libproxy/CMakeFiles/libproxy.dir/extension_wpad.o
Building CXX object libproxy/CMakeFiles/libproxy.dir/extension_pacrunner.o
Building CXX object libproxy/CMakeFiles/libproxy.dir/extension_config.o
[ 60%] Building CXX object libmodman/CMakeFiles/symbollnk.dir/test/main.cpp.o
[ 62%] [ 65%] Building CXX object libproxy/CMakeFiles/libproxy.dir/proxy.o
Building CXX object libproxy/CMakeFiles/libproxy.dir/url.o
[ 68%] Building CXX object libproxy/CMakeFiles/libproxy.dir/modules/config_envvar.o
[ 71%] Building CXX object libproxy/CMakeFiles/libproxy.dir/modules/ignore_domain.o
[ 71%] Built target symbol_two
[ 74%] Building CXX object libproxy/CMakeFiles/libproxy.dir/modules/ignore_hostname.o
[ 77%] Linking CXX executable symbollnk
Building CXX object libproxy/CMakeFiles/libproxy.dir/modules/ignore_ip.o
[ 80%] Building CXX object libproxy/CMakeFiles/libproxy.dir/modules/pacrunner_mozjs.o
In file included from /usr/include/xulrunner-1.9/unstable/jspubtd.h:45,
                 from /usr/include/xulrunner-1.9/unstable/jsapi.h:48,
                 from /var/tmp/portage/net-libs/libproxy-0.4.2/work/libproxy-0.4.2/libproxy/modules/pacrunner_mozjs.cpp:34:
/usr/include/xulrunner-1.9/unstable/jstypes.h:251:3: error: #error "Must define one of XP_BEOS, XP_OS2, XP_WIN or XP_UNIX"
/usr/include/xulrunner-1.9/unstable/jstypes.h:263:5: warning: "JS_BYTES_PER_BYTE" is not defined
/usr/include/xulrunner-1.9/unstable/jstypes.h:267:3: error: #error No suitable type for JSInt8/JSUint8
/usr/include/xulrunner-1.9/unstable/jstypes.h:276:5: warning: "JS_BYTES_PER_SHORT" is not defined
/usr/include/xulrunner-1.9/unstable/jstypes.h:280:3: error: #error No suitable type for JSInt16/JSUint16
/usr/include/xulrunner-1.9/unstable/jstypes.h:289:5: warning: "JS_BYTES_PER_INT" is not defined
/usr/include/xulrunner-1.9/unstable/jstypes.h:294:7: warning: "JS_BYTES_PER_LONG" is not defined
/usr/include/xulrunner-1.9/unstable/jstypes.h:300:3: error: #error No suitable type for JSInt32/JSUint32
/usr/include/xulrunner-1.9/unstable/jstypes.h:351:5: warning: "JS_BYTES_PER_INT" is not defined
/usr/include/xulrunner-1.9/unstable/jstypes.h:355:3: error: #error 'sizeof(int)' not sufficient for platform use
/usr/include/xulrunner-1.9/unstable/jstypes.h:386:5: warning: "JS_BYTES_PER_WORD" is not defined
/usr/include/xulrunner-1.9/unstable/jstypes.h:415:5: warning: "JS_BYTES_PER_WORD" is not defined
[ 82%] Building CXX object libproxy/CMakeFiles/libproxy.dir/modules/wpad_dns_alias.o
In file included from /usr/include/xulrunner-1.9/unstable/jspubtd.h:45,
                 from /usr/include/xulrunner-1.9/unstable/jsapi.h:48,
                 from /var/tmp/portage/net-libs/libproxy-0.4.2/work/libproxy-0.4.2/libproxy/modules/pacrunner_mozjs.cpp:34:
/usr/include/xulrunner-1.9/unstable/jstypes.h:335: error: 'JSUint32' does not name a type
/usr/include/xulrunner-1.9/unstable/jstypes.h:400: error: 'JSIntn' does not name a type
/usr/include/xulrunner-1.9/unstable/jstypes.h:410: error: 'JSUint8' does not name a type
In file included from /usr/include/xulrunner-1.9/unstable/jstypes.h:423,
                 from /usr/include/xulrunner-1.9/unstable/jspubtd.h:45,
                 from /usr/include/xulrunner-1.9/unstable/jsapi.h:48,
                 from /var/tmp/portage/net-libs/libproxy-0.4.2/work/libproxy-0.4.2/libproxy/modules/pacrunner_mozjs.cpp:34:
/usr/include/xulrunner-1.9/unstable/jsotypes.h:73: error: 'JSUintn' does not name a type
/usr/include/xulrunner-1.9/unstable/jsotypes.h:76: error: 'JSUintn' does not name a type
/usr/include/xulrunner-1.9/unstable/jsotypes.h:79: error: 'JSUint32' does not name a type
/usr/include/xulrunner-1.9/unstable/jsotypes.h:83: error: 'JSUint16' does not name a type
/usr/include/xulrunner-1.9/unstable/jsotypes.h:84: error: 'JSUint8' does not name a type
/usr/include/xulrunner-1.9/unstable/jsotypes.h:87: error: 'JSIntn' does not name a type
/usr/include/xulrunner-1.9/unstable/jsotypes.h:106: error: 'JSInt32' does not name a type
/usr/include/xulrunner-1.9/unstable/jsotypes.h:110: error: 'JSInt16' does not name a type
/usr/include/xulrunner-1.9/unstable/jsotypes.h:111: error: 'JSInt8' does not name a type
In file included from /usr/include/xulrunner-1.9/unstable/jspubtd.h:46,
                 from /usr/include/xulrunner-1.9/unstable/jsapi.h:48,
                 from /var/tmp/portage/net-libs/libproxy-0.4.2/work/libproxy-0.4.2/libproxy/modules/pacrunner_mozjs.cpp:34:
/usr/include/xulrunner-1.9/unstable/jscompat.h:51: error: 'JSIntn' does not name a type
/usr/include/xulrunner-1.9/unstable/jscompat.h:52: error: 'JSUintn' does not name a type
In file included from /usr/include/xulrunner-1.9/unstable/jsapi.h:48,
                 from /var/tmp/portage/net-libs/libproxy-0.4.2/work/libproxy-0.4.2/libproxy/modules/pacrunner_mozjs.cpp:34:
/usr/include/xulrunner-1.9/unstable/jspubtd.h:51: error: 'uint16' does not name a type
/usr/include/xulrunner-1.9/unstable/jspubtd.h:52: error: 'int32' does not name a type
/usr/include/xulrunner-1.9/unstable/jspubtd.h:53: error: 'uint32' does not name a type
/usr/include/xulrunner-1.9/unstable/jspubtd.h:57: error: 'int32' does not name a type
In file included from /usr/include/xulrunner-1.9/unstable/jsapi.h:48,
                 from /var/tmp/portage/net-libs/libproxy-0.4.2/work/libproxy-0.4.2/libproxy/modules/pacrunner_mozjs.cpp:34:
/usr/include/xulrunner-1.9/unstable/jspubtd.h:162: error: ISO C++ forbids declaration of 'JSBool' with no type
/usr/include/xulrunner-1.9/unstable/jspubtd.h:162: error: typedef 'JSBool' is initialized (use __typeof__ instead)
/usr/include/xulrunner-1.9/unstable/jspubtd.h:162: error: 'JSPropertyOp' was not declared in this scope
/usr/include/xulrunner-1.9/unstable/jspubtd.h:193: error: ISO C++ forbids declaration of 'JSBool' with no type
/usr/include/xulrunner-1.9/unstable/jspubtd.h:193: error: typedef 'JSBool' is initialized (use __typeof__ instead)
/usr/include/xulrunner-1.9/unstable/jspubtd.h:193: error: 'JSNewEnumerateOp' was not declared in this scope
/usr/include/xulrunner-1.9/unstable/jspubtd.h:202: error: ISO C++ forbids declaration of 'JSBool' with no type
/usr/include/xulrunner-1.9/unstable/jspubtd.h:202: error: typedef 'JSBool' is initialized (use __typeof__ instead)
/usr/include/xulrunner-1.9/unstable/jspubtd.h:202: error: 'JSEnumerateOp' was not declared in this scope
/usr/include/xulrunner-1.9/unstable/jspubtd.h:217: error: ISO C++ forbids declaration of 'JSBool' with no type
/usr/include/xulrunner-1.9/unstable/jspubtd.h:217: error: typedef 'JSBool' is initialized (use __typeof__ instead)
/usr/include/xulrunner-1.9/unstable/jspubtd.h:217: error: 'JSResolveOp' was not declared in this scope
/usr/include/xulrunner-1.9/unstable/jspubtd.h:249: error: ISO C++ forbids declaration of 'JSBool' with no type
/usr/include/xulrunner-1.9/unstable/jspubtd.h:249: error: typedef 'JSBool' is initialized (use __typeof__ instead)
/usr/include/xulrunner-1.9/unstable/jspubtd.h:249: error: 'JSNewResolveOp' was not declared in this scope
/usr/include/xulrunner-1.9/unstable/jspubtd.h:257: error: ISO C++ forbids declaration of 'JSBool' with no type
/usr/include/xulrunner-1.9/unstable/jspubtd.h:257: error: typedef 'JSBool' is initialized (use __typeof__ instead)
/usr/include/xulrunner-1.9/unstable/jspubtd.h:257: error: 'JSConvertOp' was not declared in this scope
/usr/include/xulrunner-1.9/unstable/jspubtd.h:315: error: ISO C++ forbids declaration of 'JSBool' with no type
/usr/include/xulrunner-1.9/unstable/jspubtd.h:315: error: typedef 'JSBool' is initialized (use __typeof__ instead)
/usr/include/xulrunner-1.9/unstable/jspubtd.h:315: error: 'JSCheckAccessOp' was not declared in this scope
/usr/include/xulrunner-1.9/unstable/jspubtd.h:323: error: ISO C++ forbids declaration of 'JSBool' with no type
/usr/include/xulrunner-1.9/unstable/jspubtd.h:323: error: typedef 'JSBool' is initialized (use __typeof__ instead)
/usr/include/xulrunner-1.9/unstable/jspubtd.h:323: error: 'JSXDRObjectOp' was not declared in this scope
/usr/include/xulrunner-1.9/unstable/jspubtd.h:331: error: ISO C++ forbids declaration of 'JSBool' with no type
/usr/include/xulrunner-1.9/unstable/jspubtd.h:331: error: typedef 'JSBool' is initialized (use __typeof__ instead)
/usr/include/xulrunner-1.9/unstable/jspubtd.h:331: error: 'JSHasInstanceOp' was not declared in this scope
/usr/include/xulrunner-1.9/unstable/jspubtd.h:340: error: ISO C++ forbids declaration of 'uint32' with no type
/usr/include/xulrunner-1.9/unstable/jspubtd.h:340: error: typedef 'uint32' is initialized (use __typeof__ instead)
/usr/include/xulrunner-1.9/unstable/jspubtd.h:340: error: 'JSMarkOp' was not declared in this scope
/usr/include/xulrunner-1.9/unstable/jspubtd.h:392: error: 'uint32' has not been declared
/usr/include/xulrunner-1.9/unstable/jspubtd.h:417: error: ISO C++ forbids declaration of 'uint32' with no type
/usr/include/xulrunner-1.9/unstable/jspubtd.h:417: error: typedef 'uint32' is initialized (use __typeof__ instead)
/usr/include/xulrunner-1.9/unstable/jspubtd.h:417: error: 'JSReserveSlotsOp' was not declared in this scope
/usr/include/xulrunner-1.9/unstable/jspubtd.h:435: error: 'jsrefcount' has not been declared
/usr/include/xulrunner-1.9/unstable/jspubtd.h:464: error: ISO C++ forbids declaration of 'JSBool' with no type
/usr/include/xulrunner-1.9/unstable/jspubtd.h:464: error: typedef 'JSBool' is initialized (use __typeof__ instead)
/usr/include/xulrunner-1.9/unstable/jspubtd.h:464: error: 'JSLookupPropOp' was not declared in this scope
/usr/include/xulrunner-1.9/unstable/jspubtd.h:480: error: ISO C++ forbids declaration of 'JSBool' with no type
/usr/include/xulrunner-1.9/unstable/jspubtd.h:480: error: typedef 'JSBool' is initialized (use __typeof__ instead)
/usr/include/xulrunner-1.9/unstable/jspubtd.h:480: error: 'JSDefinePropOp' was not declared in this scope
/usr/include/xulrunner-1.9/unstable/jspubtd.h:494: error: ISO C++ forbids declaration of 'JSBool' with no type
/usr/include/xulrunner-1.9/unstable/jspubtd.h:494: error: typedef 'JSBool' is initialized (use __typeof__ instead)
/usr/include/xulrunner-1.9/unstable/jspubtd.h:494: error: 'JSPropertyIdOp' was not declared in this scope
/usr/include/xulrunner-1.9/unstable/jspubtd.h:504: error: ISO C++ forbids declaration of 'JSBool' with no type
/usr/include/xulrunner-1.9/unstable/jspubtd.h:504: error: typedef 'JSBool' is initialized (use __typeof__ instead)
/usr/include/xulrunner-1.9/unstable/jspubtd.h:504: error: 'JSAttributesOp' was not declared in this scope
/usr/include/xulrunner-1.9/unstable/jspubtd.h:513: error: ISO C++ forbids declaration of 'JSBool' with no type
/usr/include/xulrunner-1.9/unstable/jspubtd.h:513: error: typedef 'JSBool' is initialized (use __typeof__ instead)
/usr/include/xulrunner-1.9/unstable/jspubtd.h:513: error: 'JSCheckAccessIdOp' was not declared in this scope
/usr/include/xulrunner-1.9/unstable/jspubtd.h:531: error: 'JSBool' has not been declared
/usr/include/xulrunner-1.9/unstable/jspubtd.h:549: error: ISO C++ forbids declaration of 'JSBool' with no type
/usr/include/xulrunner-1.9/unstable/jspubtd.h:549: error: typedef 'JSBool' is initialized (use __typeof__ instead)
/usr/include/xulrunner-1.9/unstable/jspubtd.h:549: error: 'JSSetObjectSlotOp' was not declared in this scope
/usr/include/xulrunner-1.9/unstable/jspubtd.h:567: error: 'uint32' has not been declared
/usr/include/xulrunner-1.9/unstable/jspubtd.h:570: error: ISO C++ forbids declaration of 'JSBool' with no type
/usr/include/xulrunner-1.9/unstable/jspubtd.h:570: error: typedef 'JSBool' is initialized (use __typeof__ instead)
/usr/include/xulrunner-1.9/unstable/jspubtd.h:570: error: 'JSSetRequiredSlotOp' was not declared in this scope
/usr/include/xulrunner-1.9/unstable/jspubtd.h:578: error: ISO C++ forbids declaration of 'JSBool' with no type
/usr/include/xulrunner-1.9/unstable/jspubtd.h:578: error: typedef 'JSBool' is initialized (use __typeof__ instead)
/usr/include/xulrunner-1.9/unstable/jspubtd.h:578: error: 'JSSetMethodOp' was not declared in this scope
/usr/include/xulrunner-1.9/unstable/jspubtd.h:582: error: ISO C++ forbids declaration of 'JSBool' with no type
/usr/include/xulrunner-1.9/unstable/jspubtd.h:582: error: typedef 'JSBool' is initialized (use __typeof__ instead)
/usr/include/xulrunner-1.9/unstable/jspubtd.h:582: error: 'JSEnumerateValuesOp' was not declared in this scope
/usr/include/xulrunner-1.9/unstable/jspubtd.h:587: error: ISO C++ forbids declaration of 'JSBool' with no type
/usr/include/xulrunner-1.9/unstable/jspubtd.h:587: error: typedef 'JSBool' is initialized (use __typeof__ instead)
/usr/include/xulrunner-1.9/unstable/jspubtd.h:587: error: 'JSEqualityOp' was not declared in this scope
/usr/include/xulrunner-1.9/unstable/jspubtd.h:591: error: ISO C++ forbids declaration of 'JSBool' with no type
/usr/include/xulrunner-1.9/unstable/jspubtd.h:591: error: typedef 'JSBool' is initialized (use __typeof__ instead)
/usr/include/xulrunner-1.9/unstable/jspubtd.h:591: error: 'JSConcatenateOp' was not declared in this scope
/usr/include/xulrunner-1.9/unstable/jspubtd.h:597: error: ISO C++ forbids declaration of 'JSBool' with no type
/usr/include/xulrunner-1.9/unstable/jspubtd.h:597: error: typedef 'JSBool' is initialized (use __typeof__ instead)
/usr/include/xulrunner-1.9/unstable/jspubtd.h:597: error: 'JSNative' was not declared in this scope
/usr/include/xulrunner-1.9/unstable/jspubtd.h:602: error: ISO C++ forbids declaration of 'JSBool' with no type
/usr/include/xulrunner-1.9/unstable/jspubtd.h:602: error: typedef 'JSBool' is initialized (use __typeof__ instead)
/usr/include/xulrunner-1.9/unstable/jspubtd.h:602: error: 'JSFastNative' was not declared in this scope
/usr/include/xulrunner-1.9/unstable/jspubtd.h:625: error: ISO C++ forbids declaration of 'JSBool' with no type
/usr/include/xulrunner-1.9/unstable/jspubtd.h:625: error: typedef 'JSBool' is initialized (use __typeof__ instead)
/usr/include/xulrunner-1.9/unstable/jspubtd.h:625: error: 'JSContextCallback' was not declared in this scope
/usr/include/xulrunner-1.9/unstable/jspubtd.h:635: error: ISO C++ forbids declaration of 'JSBool' with no type
/usr/include/xulrunner-1.9/unstable/jspubtd.h:635: error: typedef 'JSBool' is initialized (use __typeof__ instead)
/usr/include/xulrunner-1.9/unstable/jspubtd.h:635: error: 'JSGCCallback' was not declared in this scope
/usr/include/xulrunner-1.9/unstable/jspubtd.h:645: error: ISO C++ forbids declaration of 'JSBool' with no type
/usr/include/xulrunner-1.9/unstable/jspubtd.h:645: error: typedef 'JSBool' is initialized (use __typeof__ instead)
/usr/include/xulrunner-1.9/unstable/jspubtd.h:645: error: 'JSOperationCallback' was not declared in this scope
/usr/include/xulrunner-1.9/unstable/jspubtd.h:651: error: ISO C++ forbids declaration of 'JSBool' with no type
/usr/include/xulrunner-1.9/unstable/jspubtd.h:651: error: typedef 'JSBool' is initialized (use __typeof__ instead)
/usr/include/xulrunner-1.9/unstable/jspubtd.h:651: error: 'JSBranchCallback' was not declared in this scope
/usr/include/xulrunner-1.9/unstable/jspubtd.h:680: error: 'uint16' does not name a type
/usr/include/xulrunner-1.9/unstable/jspubtd.h:683: error: 'int16' does not name a type
/usr/include/xulrunner-1.9/unstable/jspubtd.h:688: error: expected ',' or '...' before 'errorNumber'
/usr/include/xulrunner-1.9/unstable/jspubtd.h:688: error: ISO C++ forbids declaration of 'uintN' with no type
/usr/include/xulrunner-1.9/unstable/jspubtd.h:700: error: ISO C++ forbids declaration of 'JSBool' with no type
/usr/include/xulrunner-1.9/unstable/jspubtd.h:700: error: typedef 'JSBool' is initialized (use __typeof__ instead)
/usr/include/xulrunner-1.9/unstable/jspubtd.h:700: error: 'JSLocaleToUpperCase' was not declared in this scope
/usr/include/xulrunner-1.9/unstable/jspubtd.h:704: error: ISO C++ forbids declaration of 'JSBool' with no type
/usr/include/xulrunner-1.9/unstable/jspubtd.h:704: error: typedef 'JSBool' is initialized (use __typeof__ instead)
/usr/include/xulrunner-1.9/unstable/jspubtd.h:704: error: 'JSLocaleToLowerCase' was not declared in this scope
/usr/include/xulrunner-1.9/unstable/jspubtd.h:708: error: ISO C++ forbids declaration of 'JSBool' with no type
/usr/include/xulrunner-1.9/unstable/jspubtd.h:708: error: typedef 'JSBool' is initialized (use __typeof__ instead)
/usr/include/xulrunner-1.9/unstable/jspubtd.h:708: error: 'JSLocaleCompare' was not declared in this scope
/usr/include/xulrunner-1.9/unstable/jspubtd.h:713: error: ISO C++ forbids declaration of 'JSBool' with no type
/usr/include/xulrunner-1.9/unstable/jspubtd.h:713: error: typedef 'JSBool' is initialized (use __typeof__ instead)
/usr/include/xulrunner-1.9/unstable/jspubtd.h:713: error: 'JSLocaleToUnicode' was not declared in this scope
/usr/include/xulrunner-1.9/unstable/jspubtd.h:728: error: ISO C++ forbids declaration of 'JSBool' with no type
/usr/include/xulrunner-1.9/unstable/jspubtd.h:728: error: typedef 'JSBool' is initialized (use __typeof__ instead)
/usr/include/xulrunner-1.9/unstable/jspubtd.h:728: error: 'JSPrincipalsTranscoder' was not declared in this scope
In file included from /var/tmp/portage/net-libs/libproxy-0.4.2/work/libproxy-0.4.2/libproxy/modules/pacrunner_mozjs.cpp:34:
/usr/include/xulrunner-1.9/unstable/jsapi.h:273: error: 'JSBool' does not name a type
/usr/include/xulrunner-1.9/unstable/jsapi.h:354: error: 'JSBool' does not name a type
/usr/include/xulrunner-1.9/unstable/jsapi.h:357: error: 'JSBool' does not name a type
/usr/include/xulrunner-1.9/unstable/jsapi.h:369: error: 'JSBool' does not name a type
/usr/include/xulrunner-1.9/unstable/jsapi.h:376: error: 'JSBool' does not name a type
/usr/include/xulrunner-1.9/unstable/jsapi.h:383: error: 'JSBool' does not name a type
/usr/include/xulrunner-1.9/unstable/jsapi.h:391: error: 'JSBool' does not name a type
/usr/include/xulrunner-1.9/unstable/jsapi.h:397: error: 'JSBool' does not name a type
/usr/include/xulrunner-1.9/unstable/jsapi.h:400: error: 'JSBool' does not name a type
/usr/include/xulrunner-1.9/unstable/jsapi.h:424: warning: 'JS_Init' initialized and declared 'extern'
/usr/include/xulrunner-1.9/unstable/jsapi.h:424: error: 'uint32' was not declared in this scope
/usr/include/xulrunner-1.9/unstable/jsapi.h:448: error: 'jsrefcount' does not name a type
/usr/include/xulrunner-1.9/unstable/jsapi.h:452: error: 'jsrefcount' has not been declared
/usr/include/xulrunner-1.9/unstable/jsapi.h:475: error: 'jsrefcount' does not name a type
/usr/include/xulrunner-1.9/unstable/jsapi.h: In constructor 'JSAutoRequest::JSAutoRequest(JSContext*)':
/usr/include/xulrunner-1.9/unstable/jsapi.h:459: error: class 'JSAutoRequest' does not have any field named 'mSaveDepth'
/usr/include/xulrunner-1.9/unstable/jsapi.h: In member function 'void JSAutoRequest::suspend()':
/usr/include/xulrunner-1.9/unstable/jsapi.h:467: error: 'mSaveDepth' was not declared in this scope
/usr/include/xulrunner-1.9/unstable/jsapi.h:467: error: 'JS_SuspendRequest' was not declared in this scope
/usr/include/xulrunner-1.9/unstable/jsapi.h: In member function 'void JSAutoRequest::resume()':
/usr/include/xulrunner-1.9/unstable/jsapi.h:470: error: 'mSaveDepth' was not declared in this scope
/usr/include/xulrunner-1.9/unstable/jsapi.h: At global scope:
/usr/include/xulrunner-1.9/unstable/jsapi.h:493: error: 'JSContextCallback' does not name a type
/usr/include/xulrunner-1.9/unstable/jsapi.h:587: error: 'uint32' does not name a type
/usr/include/xulrunner-1.9/unstable/jsapi.h:590: error: 'uint32' does not name a type
/usr/include/xulrunner-1.9/unstable/jsapi.h:593: error: 'uint32' does not name a type
/usr/include/xulrunner-1.9/unstable/jsapi.h:612: error: 'JSBool' does not name a type
/usr/include/xulrunner-1.9/unstable/jsapi.h:628: error: 'JSBool' does not name a type
/usr/include/xulrunner-1.9/unstable/jsapi.h:632: error: 'JSBool' does not name a type
/usr/include/xulrunner-1.9/unstable/jsapi.h:644: error: 'JSBool' does not name a type
/usr/include/xulrunner-1.9/unstable/jsapi.h:705: error: 'JSBool' does not name a type
/usr/include/xulrunner-1.9/unstable/jsapi.h:708: error: 'JSBool' does not name a type
/usr/include/xulrunner-1.9/unstable/jsapi.h:727: error: 'JSBool' does not name a type
/usr/include/xulrunner-1.9/unstable/jsapi.h:736: error: 'JSBool' does not name a type
/usr/include/xulrunner-1.9/unstable/jsapi.h:739: error: 'JSBool' does not name a type
/usr/include/xulrunner-1.9/unstable/jsapi.h:742: error: 'JSBool' does not name a type
/usr/include/xulrunner-1.9/unstable/jsapi.h:745: error: 'JSBool' does not name a type
/usr/include/xulrunner-1.9/unstable/jsapi.h:815: error: 'JSBool' does not name a type
/usr/include/xulrunner-1.9/unstable/jsapi.h: In constructor 'JSAutoLocalRootScope::JSAutoLocalRootScope(JSContext*)':
/usr/include/xulrunner-1.9/unstable/jsapi.h:833: error: 'JS_EnterLocalRootScope' was not declared in this scope
/usr/include/xulrunner-1.9/unstable/jsapi.h: At global scope:
/usr/include/xulrunner-1.9/unstable/jsapi.h:886: error: ISO C++ forbids declaration of 'intN' with no type
/usr/include/xulrunner-1.9/unstable/jsapi.h:886: error: typedef 'intN' is initialized (use __typeof__ instead)
/usr/include/xulrunner-1.9/unstable/jsapi.h:886: error: 'JSGCRootMapFun' was not declared in this scope
/usr/include/xulrunner-1.9/unstable/jsapi.h:888: error: 'uint32' does not name a type
/usr/include/xulrunner-1.9/unstable/jsapi.h:891: error: 'JSBool' does not name a type
/usr/include/xulrunner-1.9/unstable/jsapi.h:894: error: 'JSBool' does not name a type
/usr/include/xulrunner-1.9/unstable/jsapi.h:897: error: 'JSBool' does not name a type
/usr/include/xulrunner-1.9/unstable/jsapi.h:900: error: 'JSBool' does not name a type
/usr/include/xulrunner-1.9/unstable/jsapi.h:945: error: 'JSUint32' was not declared in this scope
/usr/include/xulrunner-1.9/unstable/jsapi.h:945: error: expected `)' before numeric constant
/usr/include/xulrunner-1.9/unstable/jsapi.h:945: error: expected `)' before ';' token
/usr/include/xulrunner-1.9/unstable/jsapi.h:945: error: expected `)' before ';' token
/usr/include/xulrunner-1.9/unstable/jsapi.h:945: error: expected `)' before ';' token
/usr/include/xulrunner-1.9/unstable/jsapi.h:945: error: expected `)' before ';' token
/usr/include/xulrunner-1.9/unstable/jsapi.h:945: error: expected `]' before ';' token
/usr/include/xulrunner-1.9/unstable/jsapi.h:945: error: expected `)' before ';' token
/usr/include/xulrunner-1.9/unstable/jsapi.h:946: error: 'JSUint32' was not declared in this scope
/usr/include/xulrunner-1.9/unstable/jsapi.h:946: error: expected `)' before numeric constant
/usr/include/xulrunner-1.9/unstable/jsapi.h:946: error: expected `)' before ';' token
/usr/include/xulrunner-1.9/unstable/jsapi.h:946: error: expected `)' before ';' token
/usr/include/xulrunner-1.9/unstable/jsapi.h:946: error: expected `)' before ';' token
/usr/include/xulrunner-1.9/unstable/jsapi.h:946: error: expected `)' before ';' token
/usr/include/xulrunner-1.9/unstable/jsapi.h:946: error: expected `]' before ';' token
/usr/include/xulrunner-1.9/unstable/jsapi.h:946: error: expected `)' before ';' token
/usr/include/xulrunner-1.9/unstable/jsapi.h:947: error: 'JSUint32' was not declared in this scope
/usr/include/xulrunner-1.9/unstable/jsapi.h:947: error: expected `)' before numeric constant
/usr/include/xulrunner-1.9/unstable/jsapi.h:947: error: expected `)' before ';' token
/usr/include/xulrunner-1.9/unstable/jsapi.h:947: error: expected `)' before ';' token
/usr/include/xulrunner-1.9/unstable/jsapi.h:947: error: expected `)' before ';' token
/usr/include/xulrunner-1.9/unstable/jsapi.h:947: error: expected `)' before ';' token
/usr/include/xulrunner-1.9/unstable/jsapi.h:947: error: expected `]' before ';' token
/usr/include/xulrunner-1.9/unstable/jsapi.h:947: error: expected `)' before ';' token
/usr/include/xulrunner-1.9/unstable/jsapi.h:966: error: 'uint32' has not been declared
/usr/include/xulrunner-1.9/unstable/jsapi.h:1064: error: 'uint32' has not been declared
/usr/include/xulrunner-1.9/unstable/jsapi.h:1105: error: 'JSGCCallback' does not name a type
/usr/include/xulrunner-1.9/unstable/jsapi.h:1108: error: 'JSGCCallback' does not name a type
/usr/include/xulrunner-1.9/unstable/jsapi.h:1111: error: 'JSBool' does not name a type
/usr/include/xulrunner-1.9/unstable/jsapi.h:1114: error: 'JSBool' does not name a type
/usr/include/xulrunner-1.9/unstable/jsapi.h:1129: error: 'uint32' has not been declared
/usr/include/xulrunner-1.9/unstable/jsapi.h:1143: error: 'intN' does not name a type
/usr/include/xulrunner-1.9/unstable/jsapi.h:1159: error: 'intN' does not name a type
/usr/include/xulrunner-1.9/unstable/jsapi.h:1168: error: 'jschar' has not been declared
/usr/include/xulrunner-1.9/unstable/jsapi.h:1168: error: 'intN' has not been declared
/usr/include/xulrunner-1.9/unstable/jsapi.h:1174: error: 'intN' does not name a type
/usr/include/xulrunner-1.9/unstable/jsapi.h:1209: error: 'uint32' does not name a type
/usr/include/xulrunner-1.9/unstable/jsapi.h:1212: error: 'JSPropertyOp' does not name a type
/usr/include/xulrunner-1.9/unstable/jsapi.h:1213: error: 'JSPropertyOp' does not name a type
/usr/include/xulrunner-1.9/unstable/jsapi.h:1214: error: 'JSPropertyOp' does not name a type
/usr/include/xulrunner-1.9/unstable/jsapi.h:1215: error: 'JSPropertyOp' does not name a type
/usr/include/xulrunner-1.9/unstable/jsapi.h:1216: error: 'JSEnumerateOp' does not name a type
/usr/include/xulrunner-1.9/unstable/jsapi.h:1217: error: 'JSResolveOp' does not name a type
/usr/include/xulrunner-1.9/unstable/jsapi.h:1218: error: 'JSConvertOp' does not name a type
/usr/include/xulrunner-1.9/unstable/jsapi.h:1223: error: 'JSCheckAccessOp' does not name a type
/usr/include/xulrunner-1.9/unstable/jsapi.h:1224: error: 'JSNative' does not name a type
/usr/include/xulrunner-1.9/unstable/jsapi.h:1225: error: 'JSNative' does not name a type
/usr/include/xulrunner-1.9/unstable/jsapi.h:1226: error: 'JSXDRObjectOp' does not name a type
/usr/include/xulrunner-1.9/unstable/jsapi.h:1227: error: 'JSHasInstanceOp' does not name a type
/usr/include/xulrunner-1.9/unstable/jsapi.h:1228: error: 'JSMarkOp' does not name a type
/usr/include/xulrunner-1.9/unstable/jsapi.h:1229: error: 'JSReserveSlotsOp' does not name a type
/usr/include/xulrunner-1.9/unstable/jsapi.h:1234: error: 'JSEqualityOp' does not name a type
/usr/include/xulrunner-1.9/unstable/jsapi.h:1319: error: 'JSLookupPropOp' does not name a type
/usr/include/xulrunner-1.9/unstable/jsapi.h:1320: error: 'JSDefinePropOp' does not name a type
/usr/include/xulrunner-1.9/unstable/jsapi.h:1321: error: 'JSPropertyIdOp' does not name a type
/usr/include/xulrunner-1.9/unstable/jsapi.h:1322: error: 'JSPropertyIdOp' does not name a type
/usr/include/xulrunner-1.9/unstable/jsapi.h:1323: error: 'JSAttributesOp' does not name a type
/usr/include/xulrunner-1.9/unstable/jsapi.h:1324: error: 'JSAttributesOp' does not name a type
/usr/include/xulrunner-1.9/unstable/jsapi.h:1325: error: 'JSPropertyIdOp' does not name a type
/usr/include/xulrunner-1.9/unstable/jsapi.h:1326: error: 'JSConvertOp' does not name a type
/usr/include/xulrunner-1.9/unstable/jsapi.h:1327: error: 'JSNewEnumerateOp' does not name a type
/usr/include/xulrunner-1.9/unstable/jsapi.h:1328: error: 'JSCheckAccessIdOp' does not name a type
/usr/include/xulrunner-1.9/unstable/jsapi.h:1333: error: 'JSNative' does not name a type
/usr/include/xulrunner-1.9/unstable/jsapi.h:1334: error: 'JSNative' does not name a type
/usr/include/xulrunner-1.9/unstable/jsapi.h:1335: error: 'JSXDRObjectOp' does not name a type
/usr/include/xulrunner-1.9/unstable/jsapi.h:1336: error: 'JSHasInstanceOp' does not name a type
/usr/include/xulrunner-1.9/unstable/jsapi.h:1337: error: 'JSSetObjectSlotOp' does not name a type
/usr/include/xulrunner-1.9/unstable/jsapi.h:1338: error: 'JSSetObjectSlotOp' does not name a type
/usr/include/xulrunner-1.9/unstable/jsapi.h:1342: error: 'JSSetRequiredSlotOp' does not name a type
/usr/include/xulrunner-1.9/unstable/jsapi.h:1348: error: 'JSSetMethodOp' does not name a type
/usr/include/xulrunner-1.9/unstable/jsapi.h:1349: error: 'JSEnumerateValuesOp' does not name a type
/usr/include/xulrunner-1.9/unstable/jsapi.h:1350: error: 'JSEqualityOp' does not name a type
/usr/include/xulrunner-1.9/unstable/jsapi.h:1351: error: 'JSConcatenateOp' does not name a type
/usr/include/xulrunner-1.9/unstable/jsapi.h:1369: error: 'jsint' does not name a type
/usr/include/xulrunner-1.9/unstable/jsapi.h:1376: error: 'JSBool' does not name a type
/usr/include/xulrunner-1.9/unstable/jsapi.h:1379: error: 'JSBool' does not name a type
/usr/include/xulrunner-1.9/unstable/jsapi.h:1398: error: 'JSBool' does not name a type
/usr/include/xulrunner-1.9/unstable/jsapi.h:1401: error: 'JSBool' does not name a type
/usr/include/xulrunner-1.9/unstable/jsapi.h:1404: error: 'JSBool' does not name a type
/usr/include/xulrunner-1.9/unstable/jsapi.h:1407: error: 'JSBool' does not name a type
/usr/include/xulrunner-1.9/unstable/jsapi.h:1416: error: 'uint8' does not name a type
/usr/include/xulrunner-1.9/unstable/jsapi.h:1417: error: 'uint8' does not name a type
/usr/include/xulrunner-1.9/unstable/jsapi.h:1427: error: 'int8' does not name a type
/usr/include/xulrunner-1.9/unstable/jsapi.h:1428: error: 'uint8' does not name a type
/usr/include/xulrunner-1.9/unstable/jsapi.h:1429: error: 'JSPropertyOp' does not name a type
/usr/include/xulrunner-1.9/unstable/jsapi.h:1430: error: 'JSPropertyOp' does not name a type
/usr/include/xulrunner-1.9/unstable/jsapi.h:1435: error: 'JSNative' does not name a type
/usr/include/xulrunner-1.9/unstable/jsapi.h:1441: error: 'uint16' does not name a type
/usr/include/xulrunner-1.9/unstable/jsapi.h:1442: error: 'uint16' does not name a type
/usr/include/xulrunner-1.9/unstable/jsapi.h:1450: error: 'uint32' does not name a type
/usr/include/xulrunner-1.9/unstable/jsapi.h:1481: error: 'JSNative' has not been declared
/usr/include/xulrunner-1.9/unstable/jsapi.h:1481: error: 'uintN' has not been declared
/usr/include/xulrunner-1.9/unstable/jsapi.h:1497: error: 'JSBool' does not name a type
/usr/include/xulrunner-1.9/unstable/jsapi.h:1500: error: 'JSBool' does not name a type
/usr/include/xulrunner-1.9/unstable/jsapi.h:1506: error: 'JSBool' does not name a type
/usr/include/xulrunner-1.9/unstable/jsapi.h:1516: error: 'JSBool' does not name a type
/usr/include/xulrunner-1.9/unstable/jsapi.h:1522: error: 'JSBool' does not name a type
/usr/include/xulrunner-1.9/unstable/jsapi.h:1533: error: 'JSBool' does not name a type
/usr/include/xulrunner-1.9/unstable/jsapi.h:1547: error: 'JSBool' does not name a type
/usr/include/xulrunner-1.9/unstable/jsapi.h:1556: error: 'uintN' has not been declared
/usr/include/xulrunner-1.9/unstable/jsapi.h:1560: error: 'uintN' has not been declared
/usr/include/xulrunner-1.9/unstable/jsapi.h:1562: error: 'JSBool' does not name a type
/usr/include/xulrunner-1.9/unstable/jsapi.h:1565: error: 'JSBool' does not name a type
/usr/include/xulrunner-1.9/unstable/jsapi.h:1568: error: 'JSBool' does not name a type
/usr/include/xulrunner-1.9/unstable/jsapi.h:1578: error: 'JSBool' does not name a type
/usr/include/xulrunner-1.9/unstable/jsapi.h:1587: error: 'JSBool' does not name a type
/usr/include/xulrunner-1.9/unstable/jsapi.h:1600: error: 'JSBool' does not name a type
/usr/include/xulrunner-1.9/unstable/jsapi.h:1604: error: 'JSBool' does not name a type
/usr/include/xulrunner-1.9/unstable/jsapi.h:1610: error: 'JSBool' does not name a type
/usr/include/xulrunner-1.9/unstable/jsapi.h:1614: error: 'JSBool' does not name a type
/usr/include/xulrunner-1.9/unstable/jsapi.h:1618: error: 'JSBool' does not name a type
/usr/include/xulrunner-1.9/unstable/jsapi.h:1621: error: 'JSBool' does not name a type
/usr/include/xulrunner-1.9/unstable/jsapi.h:1624: error: 'JSBool' does not name a type
/usr/include/xulrunner-1.9/unstable/jsapi.h:1628: error: 'JSBool' does not name a type
/usr/include/xulrunner-1.9/unstable/jsapi.h:1631: error: 'JSBool' does not name a type
/usr/include/xulrunner-1.9/unstable/jsapi.h:1635: error: 'JSBool' does not name a type
/usr/include/xulrunner-1.9/unstable/jsapi.h:1639: error: 'JSBool' does not name a type
/usr/include/xulrunner-1.9/unstable/jsapi.h:1642: error: 'JSBool' does not name a type
/usr/include/xulrunner-1.9/unstable/jsapi.h:1645: error: 'JSBool' does not name a type
/usr/include/xulrunner-1.9/unstable/jsapi.h:1649: error: 'JSBool' does not name a type
/usr/include/xulrunner-1.9/unstable/jsapi.h:1661: error: 'JSBool' does not name a type
/usr/include/xulrunner-1.9/unstable/jsapi.h:1671: error: 'JSBool' does not name a type
/usr/include/xulrunner-1.9/unstable/jsapi.h:1684: error: 'JSBool' does not name a type
/usr/include/xulrunner-1.9/unstable/jsapi.h:1690: error: 'JSBool' does not name a type
/usr/include/xulrunner-1.9/unstable/jsapi.h:1697: error: 'JSBool' does not name a type
/usr/include/xulrunner-1.9/unstable/jsapi.h:1701: error: 'JSBool' does not name a type
/usr/include/xulrunner-1.9/unstable/jsapi.h:1706: error: 'JSBool' does not name a type
/usr/include/xulrunner-1.9/unstable/jsapi.h:1711: error: 'JSBool' does not name a type
/usr/include/xulrunner-1.9/unstable/jsapi.h:1716: error: 'JSBool' does not name a type
/usr/include/xulrunner-1.9/unstable/jsapi.h:1721: error: 'JSBool' does not name a type
/usr/include/xulrunner-1.9/unstable/jsapi.h:1727: error: 'jsint' has not been declared
/usr/include/xulrunner-1.9/unstable/jsapi.h:1729: error: 'JSBool' does not name a type
/usr/include/xulrunner-1.9/unstable/jsapi.h:1732: error: 'JSBool' does not name a type
/usr/include/xulrunner-1.9/unstable/jsapi.h:1735: error: 'JSBool' does not name a type
/usr/include/xulrunner-1.9/unstable/jsapi.h:1738: error: 'JSBool' does not name a type
/usr/include/xulrunner-1.9/unstable/jsapi.h:1741: error: 'JSBool' does not name a type
/usr/include/xulrunner-1.9/unstable/jsapi.h:1745: error: 'JSBool' does not name a type
/usr/include/xulrunner-1.9/unstable/jsapi.h:1748: error: 'JSBool' does not name a type
/usr/include/xulrunner-1.9/unstable/jsapi.h:1752: error: 'JSBool' does not name a type
/usr/include/xulrunner-1.9/unstable/jsapi.h:1755: error: 'JSBool' does not name a type
/usr/include/xulrunner-1.9/unstable/jsapi.h:1758: error: 'JSBool' does not name a type
/usr/include/xulrunner-1.9/unstable/jsapi.h:1761: error: 'JSBool' does not name a type
/usr/include/xulrunner-1.9/unstable/jsapi.h:1764: error: 'JSBool' does not name a type
/usr/include/xulrunner-1.9/unstable/jsapi.h:1767: error: 'JSBool' does not name a type
/usr/include/xulrunner-1.9/unstable/jsapi.h:1789: error: 'JSBool' does not name a type
/usr/include/xulrunner-1.9/unstable/jsapi.h:1792: error: 'JSBool' does not name a type
/usr/include/xulrunner-1.9/unstable/jsapi.h:1796: error: 'JSCheckAccessOp' does not name a type
/usr/include/xulrunner-1.9/unstable/jsapi.h:1799: error: 'JSBool' does not name a type
/usr/include/xulrunner-1.9/unstable/jsapi.h:1802: error: 'JSBool' does not name a type
/usr/include/xulrunner-1.9/unstable/jsapi.h:1815: error: expected identifier before '*' token
/usr/include/xulrunner-1.9/unstable/jsapi.h:1815: error: ISO C++ forbids declaration of 'JSBool' with no type
/usr/include/xulrunner-1.9/unstable/jsapi.h:1815: error: 'JSBool' declared as function returning a function
/usr/include/xulrunner-1.9/unstable/jsapi.h:1818: error: 'jsrefcount' does not name a type
/usr/include/xulrunner-1.9/unstable/jsapi.h:1821: error: expected identifier before '*' token
/usr/include/xulrunner-1.9/unstable/jsapi.h:1821: error: ISO C++ forbids declaration of 'JSBool' with no type
/usr/include/xulrunner-1.9/unstable/jsapi.h:1821: error: 'JSBool' declared as function returning a function
/usr/include/xulrunner-1.9/unstable/jsapi.h:1821: error: 'int JSPrincipals::JSBool(int*)' cannot be overloaded
/usr/include/xulrunner-1.9/unstable/jsapi.h:1815: error: with 'int JSPrincipals::JSBool(int*)'
/usr/include/xulrunner-1.9/unstable/jsapi.h:1842: error: 'JSPrincipalsTranscoder' does not name a type
/usr/include/xulrunner-1.9/unstable/jsapi.h:1854: error: 'JSNative' has not been declared
/usr/include/xulrunner-1.9/unstable/jsapi.h:1854: error: 'uintN' has not been declared
/usr/include/xulrunner-1.9/unstable/jsapi.h:1854: error: 'uintN' has not been declared
/usr/include/xulrunner-1.9/unstable/jsapi.h:1883: error: 'uintN' does not name a type
/usr/include/xulrunner-1.9/unstable/jsapi.h:1889: error: 'uint16' does not name a type
/usr/include/xulrunner-1.9/unstable/jsapi.h:1898: error: 'JSBool' does not name a type
/usr/include/xulrunner-1.9/unstable/jsapi.h:1901: error: 'JSBool' does not name a type
/usr/include/xulrunner-1.9/unstable/jsapi.h:1905: error: 'JSNative' has not been declared
/usr/include/xulrunner-1.9/unstable/jsapi.h:1906: error: 'uintN' has not been declared
/usr/include/xulrunner-1.9/unstable/jsapi.h:1906: error: 'uintN' has not been declared
/usr/include/xulrunner-1.9/unstable/jsapi.h:1910: error: expected ',' or '...' before '*' token
/usr/include/xulrunner-1.9/unstable/jsapi.h:1911: error: ISO C++ forbids declaration of 'jschar' with no type
/usr/include/xulrunner-1.9/unstable/jsapi.h:1923: error: 'JSBool' does not name a type
/usr/include/xulrunner-1.9/unstable/jsapi.h:1937: error: 'uintN' has not been declared
/usr/include/xulrunner-1.9/unstable/jsapi.h:1943: error: 'uintN' has not been declared
/usr/include/xulrunner-1.9/unstable/jsapi.h:1947: error: expected ',' or '...' before '*' token
/usr/include/xulrunner-1.9/unstable/jsapi.h:1948: error: ISO C++ forbids declaration of 'jschar' with no type
/usr/include/xulrunner-1.9/unstable/jsapi.h:1953: error: expected ',' or '...' before '*' token
/usr/include/xulrunner-1.9/unstable/jsapi.h:1954: error: ISO C++ forbids declaration of 'jschar' with no type
/usr/include/xulrunner-1.9/unstable/jsapi.h:1999: error: 'uintN' has not been declared
/usr/include/xulrunner-1.9/unstable/jsapi.h:2001: error: 'uintN' has not been declared
/usr/include/xulrunner-1.9/unstable/jsapi.h:2006: error: 'uintN' has not been declared
/usr/include/xulrunner-1.9/unstable/jsapi.h:2008: error: 'uintN' has not been declared
/usr/include/xulrunner-1.9/unstable/jsapi.h:2012: error: 'uintN' has not been declared
/usr/include/xulrunner-1.9/unstable/jsapi.h:2013: error: expected ',' or '...' before '*' token
/usr/include/xulrunner-1.9/unstable/jsapi.h:2014: error: ISO C++ forbids declaration of 'jschar' with no type
/usr/include/xulrunner-1.9/unstable/jsapi.h:2019: error: 'uintN' has not been declared
/usr/include/xulrunner-1.9/unstable/jsapi.h:2020: error: expected ',' or '...' before '*' token
/usr/include/xulrunner-1.9/unstable/jsapi.h:2021: error: ISO C++ forbids declaration of 'jschar' with no type
/usr/include/xulrunner-1.9/unstable/jsapi.h:2025: error: 'uintN' has not been declared
/usr/include/xulrunner-1.9/unstable/jsapi.h:2034: error: 'uintN' has not been declared
/usr/include/xulrunner-1.9/unstable/jsapi.h:2037: error: 'uintN' has not been declared
/usr/include/xulrunner-1.9/unstable/jsapi.h:2074: error: 'JSBool' does not name a type
/usr/include/xulrunner-1.9/unstable/jsapi.h:2083: error: 'JSBool' does not name a type
/usr/include/xulrunner-1.9/unstable/jsapi.h:2087: error: 'JSBool' does not name a type
/usr/include/xulrunner-1.9/unstable/jsapi.h:2093: error: 'JSBool' does not name a type
/usr/include/xulrunner-1.9/unstable/jsapi.h:2100: error: 'JSBool' does not name a type
/usr/include/xulrunner-1.9/unstable/jsapi.h:2106: error: 'JSBool' does not name a type
/usr/include/xulrunner-1.9/unstable/jsapi.h:2113: error: 'JSBool' does not name a type
/usr/include/xulrunner-1.9/unstable/jsapi.h:2117: error: 'JSBool' does not name a type
/usr/include/xulrunner-1.9/unstable/jsapi.h:2121: error: 'JSBool' does not name a type
/usr/include/xulrunner-1.9/unstable/jsapi.h:2146: error: 'JSOperationCallback' has not been declared
/usr/include/xulrunner-1.9/unstable/jsapi.h:2147: error: 'uint32' has not been declared
/usr/include/xulrunner-1.9/unstable/jsapi.h:2152: error: 'JSOperationCallback' does not name a type
/usr/include/xulrunner-1.9/unstable/jsapi.h:2160: error: 'uint32' does not name a type
/usr/include/xulrunner-1.9/unstable/jsapi.h:2169: error: 'uint32' has not been declared
/usr/include/xulrunner-1.9/unstable/jsapi.h:2180: error: 'JSBranchCallback' does not name a type
/usr/include/xulrunner-1.9/unstable/jsapi.h:2183: error: 'JSBool' does not name a type
/usr/include/xulrunner-1.9/unstable/jsapi.h:2186: error: 'JSBool' does not name a type
/usr/include/xulrunner-1.9/unstable/jsapi.h:2194: error: 'JSBool' does not name a type
/usr/include/xulrunner-1.9/unstable/jsapi.h:2251: error: 'jschar' has not been declared
/usr/include/xulrunner-1.9/unstable/jsapi.h:2254: error: expected ',' or '...' before '*' token
/usr/include/xulrunner-1.9/unstable/jsapi.h:2254: error: ISO C++ forbids declaration of 'jschar' with no type
/usr/include/xulrunner-1.9/unstable/jsapi.h:2257: error: expected ',' or '...' before '*' token
/usr/include/xulrunner-1.9/unstable/jsapi.h:2257: error: ISO C++ forbids declaration of 'jschar' with no type
/usr/include/xulrunner-1.9/unstable/jsapi.h:2260: error: expected ',' or '...' before '*' token
/usr/include/xulrunner-1.9/unstable/jsapi.h:2260: error: ISO C++ forbids declaration of 'jschar' with no type
/usr/include/xulrunner-1.9/unstable/jsapi.h:2263: error: expected ',' or '...' before '*' token
/usr/include/xulrunner-1.9/unstable/jsapi.h:2263: error: ISO C++ forbids declaration of 'jschar' with no type
/usr/include/xulrunner-1.9/unstable/jsapi.h:2268: error: expected initializer before '*' token
/usr/include/xulrunner-1.9/unstable/jsapi.h:2274: error: 'intN' does not name a type
/usr/include/xulrunner-1.9/unstable/jsapi.h:2297: error: 'jschar' has not been declared
/usr/include/xulrunner-1.9/unstable/jsapi.h:2322: error: expected initializer before '*' token
/usr/include/xulrunner-1.9/unstable/jsapi.h:2329: error: 'JSBool' does not name a type
/usr/include/xulrunner-1.9/unstable/jsapi.h:2336: error: 'JSBool' does not name a type
/usr/include/xulrunner-1.9/unstable/jsapi.h:2368: error: 'JSBool' does not name a type
/usr/include/xulrunner-1.9/unstable/jsapi.h:2372: error: 'JSBool' does not name a type
/usr/include/xulrunner-1.9/unstable/jsapi.h:2389: error: 'JSLocaleToUpperCase' does not name a type
/usr/include/xulrunner-1.9/unstable/jsapi.h:2390: error: 'JSLocaleToLowerCase' does not name a type
/usr/include/xulrunner-1.9/unstable/jsapi.h:2391: error: 'JSLocaleCompare' does not name a type
/usr/include/xulrunner-1.9/unstable/jsapi.h:2392: error: 'JSLocaleToUnicode' does not name a type
/usr/include/xulrunner-1.9/unstable/jsapi.h:2430: error: expected ',' or '...' before 'errorNumber'
/usr/include/xulrunner-1.9/unstable/jsapi.h:2430: error: ISO C++ forbids declaration of 'uintN' with no type
/usr/include/xulrunner-1.9/unstable/jsapi.h:2437: error: expected ',' or '...' before 'errorNumber'
/usr/include/xulrunner-1.9/unstable/jsapi.h:2437: error: ISO C++ forbids declaration of 'uintN' with no type
/usr/include/xulrunner-1.9/unstable/jsapi.h:2445: error: 'JSBool' does not name a type
/usr/include/xulrunner-1.9/unstable/jsapi.h:2448: error: 'JSBool' does not name a type
/usr/include/xulrunner-1.9/unstable/jsapi.h:2453: error: 'JSBool' does not name a type
/usr/include/xulrunner-1.9/unstable/jsapi.h:2472: error: 'uintN' does not name a type
/usr/include/xulrunner-1.9/unstable/jsapi.h:2475: error: ISO C++ forbids declaration of 'jschar' with no type
/usr/include/xulrunner-1.9/unstable/jsapi.h:2475: error: expected ';' before '*' token
/usr/include/xulrunner-1.9/unstable/jsapi.h:2476: error: ISO C++ forbids declaration of 'jschar' with no type
/usr/include/xulrunner-1.9/unstable/jsapi.h:2476: error: expected ';' before '*' token
/usr/include/xulrunner-1.9/unstable/jsapi.h:2477: error: 'uintN' does not name a type
/usr/include/xulrunner-1.9/unstable/jsapi.h:2478: error: 'uintN' does not name a type
/usr/include/xulrunner-1.9/unstable/jsapi.h:2479: error: ISO C++ forbids declaration of 'jschar' with no type
/usr/include/xulrunner-1.9/unstable/jsapi.h:2479: error: expected ';' before '*' token
/usr/include/xulrunner-1.9/unstable/jsapi.h:2480: error: ISO C++ forbids declaration of 'jschar' with no type
/usr/include/xulrunner-1.9/unstable/jsapi.h:2480: error: expected ';' before '*' token
/usr/include/xulrunner-1.9/unstable/jsapi.h:2516: error: 'uintN' has not been declared
/usr/include/xulrunner-1.9/unstable/jsapi.h:2519: error: 'jschar' has not been declared
/usr/include/xulrunner-1.9/unstable/jsapi.h:2519: error: 'uintN' has not been declared
/usr/include/xulrunner-1.9/unstable/jsapi.h:2522: error: 'JSBool' has not been declared
/usr/include/xulrunner-1.9/unstable/jsapi.h:2534: error: 'JSBool' does not name a type
/usr/include/xulrunner-1.9/unstable/jsapi.h:2537: error: 'JSBool' does not name a type
/usr/include/xulrunner-1.9/unstable/jsapi.h:2546: error: 'JSBool' does not name a type
/usr/include/xulrunner-1.9/unstable/jsapi.h:2583: error: 'JSBool' does not name a type
/usr/include/xulrunner-1.9/unstable/jsapi.h:2590: error: 'JSBool' does not name a type
/var/tmp/portage/net-libs/libproxy-0.4.2/work/libproxy-0.4.2/libproxy/modules/pacrunner_mozjs.cpp:45: error: 'JSBool' does not name a type
/var/tmp/portage/net-libs/libproxy-0.4.2/work/libproxy-0.4.2/libproxy/modules/pacrunner_mozjs.cpp:78: error: 'JSBool' does not name a type
...
Back to top
View user's profile Send private message
Kosmas
Apprentice
Apprentice


Joined: 14 Sep 2006
Posts: 266
Location: Greece

PostPosted: Tue Jun 01, 2010 5:59 pm    Post subject: Reply with quote

Sorry for the delayed answer.

I use the same as you do:
Code:
Available Java Virtual Machines:
  [1]   emul-linux-x86-java-1.6
  [2]   icedtea6-bin
  [3]   sun-jdk-1.5 Build Only
  [4]   sun-jdk-1.6  system-vm
  [5]   sun-jre-bin-1.6

!!! Warning: VMs marked as Build Only may contain Security Vulnerabilities and/or be EOL.
!!! Warning: Gentoo recommends not setting these VMs as either your System or User VM.
!!! Warning: Please see http://www.gentoo.org/doc/en/java.xml#build-only for more information.

But I see a lot of leftovers. Maybe you should clean your system just a little bit (if you dont use the old versions for anything) and then try again...
Back to top
View user's profile Send private message
m27315
Apprentice
Apprentice


Joined: 10 Dec 2004
Posts: 236
Location: 2 workstations down

PostPosted: Tue Jun 01, 2010 6:33 pm    Post subject: solved - for me Reply with quote

ok - thanks for the advice. ... I was seeing the same problem as you, because I was using an old version of 1.9, 1.9.0.14. I had masked the newer versions, because of some incompatibilities with other ~amd64 packages, like so:

Code:
# cat  /etc/portage/package.mask
>=net-libs/xulrunner-1.9.1

Once I removed this mask, I was finally able to upgrade to the newest version of xulrunner and then emerge libproxy successfully.

Thanks for the help!
Back to top
View user's profile Send private message
paramita
n00b
n00b


Joined: 24 Feb 2014
Posts: 1

PostPosted: Mon Feb 24, 2014 7:18 am    Post subject: i am facing problem in building firefox27 using xulrunner. Reply with quote

getting huge number of errors in jsapi.h.. specially "jschar". kindly help.

[code]

c:\xulrunner-27.0\mozilla-release\js\src\vm/Unicode.h(70) : error C4430: missing type specifier - int assumed. Note: C++ does not support default-int
c:\xulrunner-27.0\mozilla-release\js\src\vm/Unicode.h(71) : error C4430: missing type specifier - int assumed. Note: C++ does not support default-int
c:\xulrunner-27.0\mozilla-release\js\src\vm/Unicode.h(71) : error C2146: syntax error : missing ';' before identifier 'NO_BREAK_SPACE'
c:\xulrunner-27.0\mozilla-release\js\src\vm/Unicode.h(71) : error C2086: 'const int js::unicode::jschar' : redefinition
c:\xulrunner-27.0\mozilla-release\js\src\vm/Unicode.h(70) : see declaration of 'js::unicode::jschar'
c:\xulrunner-27.0\mozilla-release\js\src\vm/Unicode.h(71) : error C4430: missing type specifier - int assumed. Note: C++ does not support default-int
c:\xulrunner-27.0\mozilla-release\js\src\vm/Unicode.h(117) : error C2146: syntax error : missing ')' before identifier 'code'
c:\xulrunner-27.0\mozilla-release\js\src\vm/Unicode.h(117) : error C2433: 'CharInfo' : 'inline' not permitted on data declarations
c:\xulrunner-27.0\mozilla-release\js\src\vm/Unicode.h(117) : error C2440: 'initializing' : cannot convert from 'const int' to 'const js::unicode::CharacterInfo &'
Reason: cannot convert from 'const int' to 'const js::unicode::CharacterInfo'
No constructor could take the source type, or constructor overload resolution was ambiguous
c:\xulrunner-27.0\mozilla-release\js\src\vm/Unicode.h(117) : error C2059: syntax error : ')'
c:\xulrunner-27.0\mozilla-release\js\src\vm/Unicode.h(117) : fatal error C1003: error count exceeds 100; stopping compilation
Module.cpp
c:\xulrunner-27.0\objdir\dist\include\js/TypeDecls.h(53) : error C2146: syntax error : missing ';' before identifier 'jschar'
c:\xulrunner-27.0\objdir\dist\include\js/TypeDecls.h(53) : error C4430: missing type specifier - int assumed. Note: C++ does not support default-int
c:\xulrunner-27.0\objdir\dist\include\js/TypeDecls.h(53) : error C4430: missing type specifier - int assumed. Note: C++ does not support default-int
c:\xulrunner-27.0\objdir\dist\include\js/GCAPI.h(158) : error C2143: syntax error : missing ';' before '*'
c:\xulrunner-27.0\objdir\dist\include\js/GCAPI.h(158) : error C4430: missing type specifier - int assumed. Note: C++ does not support default-int
c:\xulrunner-27.0\objdir\dist\include\js/GCAPI.h(158) : error C4430: missing type specifier - int assumed. Note: C++ does not support default-int
c:\xulrunner-27.0\objdir\dist\include\js/GCAPI.h(158) : warning C4183: 'formatMessage': missing return type; assumed to be a member function returning 'int'
c:\xulrunner-27.0\objdir\dist\include\js/GCAPI.h(159) : error C2143: syntax error : missing ';' before '*'
c:\xulrunner-27.0\objdir\dist\include\js/GCAPI.h(159) : error C4430: missing type specifier - int assumed. Note: C++ does not support default-int
c:\xulrunner-27.0\objdir\dist\include\js/GCAPI.h(159) : error C4430: missing type specifier - int assumed. Note: C++ does not support default-int
c:\xulrunner-27.0\objdir\dist\include\js/GCAPI.h(159) : warning C4183: 'formatJSON': missing return type; assumed to be a member function returning 'int'
c:\xulrunner-27.0\objdir\dist\include\js/Class.h(264) : error C2061: syntax error : identifier 'jschar'
c:\xulrunner-27.0\mozilla-release\js\src\jsfriendapi.h(242) : error C2061: syntax error : identifier 'jschar'
c:\xulrunner-27.0\mozilla-release\js\src\jsfriendapi.h(441) : error C4430: missing type specifier - int assumed. Note: C++ does not support default-int
c:\xulrunner-27.0\mozilla-release\js\src\jsfriendapi.h(441) : error C2143: syntax error : missing ';' before '*'
c:\xulrunner-27.0\mozilla-release\js\src\jsfriendapi.h(441) : error C4430: missing type specifier - int assumed. Note: C++ does not support default-int
c:\xulrunner-27.0\mozilla-release\js\src\jsfriendapi.h(611) : error C4430: missing type specifier - int assumed. Note: C++ does not support default-int
c:\xulrunner-27.0\mozilla-release\js\src\jsfriendapi.h(611) : error C2143: syntax error : missing ';' before '*'
c:\xulrunner-27.0\mozilla-release\js\src\jsfriendapi.h(611) : error C2433: 'jschar' : 'inline' not permitted on data declarations
c:\xulrunner-27.0\mozilla-release\js\src\jsfriendapi.h(613) : error C4430: missing type specifier - int assumed. Note: C++ does not support default-int
c:\xulrunner-27.0\mozilla-release\js\src\jsfriendapi.h(614) : error C2039: 'chars' : is not a member of 'js::shadow::Atom'
c:\xulrunner-27.0\mozilla-release\js\src\jsfriendapi.h(438) : see declaration of 'js::shadow::Atom'
c:\xulrunner-27.0\mozilla-release\js\src\jsfriendapi.h(614) : warning C4508: 'js::GetAtomChars' : function should return a value; 'void' return type assumed
c:\xulrunner-27.0\mozilla-release\js\src\jsfriendapi.h(796) : error C4430: missing type specifier - int assumed. Note: C++ does not support default-int
c:\xulrunner-27.0\mozilla-release\js\src\jsfriendapi.h(796) : error C2143: syntax error : missing ';' before '*'
c:\xulrunner-27.0\mozilla-release\js\src\jsfriendapi.h(796) : error C2370: 'js::jschar' : redefinition; different storage class
c:\xulrunner-27.0\mozilla-release\js\src\jsfriendapi.h(611) : see declaration of 'js::jschar'
c:\xulrunner-27.0\mozilla-release\js\src\jsfriendapi.h(797) : error C4430: missing type specifier - int assumed. Note: C++ does not support default-int
c:\xulrunner-27.0\mozilla-release\js\src\jsapi.h(42) : error C4430: missing type specifier - int assumed. Note: C++ does not support default-int
c:\xulrunner-27.0\mozilla-release\js\src\jsapi.h(42) : error C2146: syntax error : missing ',' before identifier 'jschar'
c:\xulrunner-27.0\mozilla-release\js\src\jsapi.h(42) : error C2977: 'mozilla::RangedPtr' : too many template arguments
c:\xulrunner-27.0\objdir\dist\include\mozilla/RangedPtr.h(43) : see declaration of 'mozilla::RangedPtr'
c:\xulrunner-27.0\mozilla-release\js\src\jsapi.h(44) : error C2955: 'mozilla::RangedPtr' : use of class template requires template argument list
c:\xulrunner-27.0\objdir\dist\include\mozilla/RangedPtr.h(43) : see declaration of 'mozilla::RangedPtr'
c:\xulrunner-27.0\mozilla-release\js\src\jsapi.h(47) : error C4430: missing type specifier - int assumed. Note: C++ does not support default-int
c:\xulrunner-27.0\mozilla-release\js\src\jsapi.h(47) : error C2146: syntax error : missing ',' before identifier 'jschar'
c:\xulrunner-27.0\mozilla-release\js\src\jsapi.h(47) : error C2977: 'mozilla::RangedPtr' : too many template arguments
c:\xulrunner-27.0\objdir\dist\include\mozilla/RangedPtr.h(43) : see declaration of 'mozilla::RangedPtr'
c:\xulrunner-27.0\mozilla-release\js\src\jsapi.h(47) : error C4430: missing type specifier - int assumed. Note: C++ does not support default-int
c:\xulrunner-27.0\mozilla-release\js\src\jsapi.h(47) : error C2146: syntax error : missing ',' before identifier 'jschar'
c:\xulrunner-27.0\mozilla-release\js\src\jsapi.h(47) : error C2977: 'mozilla::RangedPtr' : too many template arguments
c:\xulrunner-27.0\objdir\dist\include\mozilla/RangedPtr.h(43) : see declaration of 'mozilla::RangedPtr'
c:\xulrunner-27.0\mozilla-release\js\src\jsapi.h(48) : error C4430: missing type specifier - int assumed. Note: C++ does not support default-int
c:\xulrunner-27.0\mozilla-release\js\src\jsapi.h(48) : error C2143: syntax error : missing ',' before '*'
c:\xulrunner-27.0\mozilla-release\js\src\jsapi.h(49) : error C4430: missing type specifier - int assumed. Note: C++ does not support default-int
c:\xulrunner-27.0\mozilla-release\js\src\jsapi.h(49) : error C2143: syntax error : missing ',' before '*'
c:\xulrunner-27.0\mozilla-release\js\src\jsapi.h(49) : error C2535: 'JS::StableCharPtr::StableCharPtr(const int)' : member function already defined or declared
c:\xulrunner-27.0\mozilla-release\js\src\jsapi.h(48) : see declaration of 'JS::StableCharPtr::StableCharPtr'
c:\xulrunner-27.0\mozilla-release\js\src\jsapi.h(46) : error C2542: 'RangedPtr' : class object has no constructor for initialization
c:\xulrunner-27.0\mozilla-release\js\src\jsapi.h(47) : error C2542: 'RangedPtr' : class object has no constructor for initialization
c:\xulrunner-27.0\mozilla-release\js\src\jsapi.h(48) : error C2065: 's' : undeclared identifier
c:\xulrunner-27.0\mozilla-release\js\src\jsapi.h(48) : error C2065: 'len' : undeclared identifier
c:\xulrunner-27.0\mozilla-release\js\src\jsapi.h(48) : error C2542: 'RangedPtr' : class object has no constructor for initialization
c:\xulrunner-27.0\mozilla-release\js\src\jsapi.h(49) : error C2065: 'pos' : undeclared identifier
c:\xulrunner-27.0\mozilla-release\js\src\jsapi.h(49) : error C2065: 'start' : undeclared identifier
c:\xulrunner-27.0\mozilla-release\js\src\jsapi.h(49) : error C2065: 'len' : undeclared identifier
c:\xulrunner-27.0\mozilla-release\js\src\jsapi.h(51) : error C2542: 'RangedPtr' : class object has no constructor for initialization
c:\xulrunner-27.0\mozilla-release\js\src\jsapi.h(1774) : error C4430: missing type specifier - int assumed. Note: C++ does not support default-int
c:\xulrunner-27.0\mozilla-release\js\src\jsapi.h(1774) : error C2143: syntax error : missing ',' before '*'
c:\xulrunner-27.0\mozilla-release\js\src\jsapi.h(2153) : error C4430: missing type specifier - int assumed. Note: C++ does not support default-int
c:\xulrunner-27.0\mozilla-release\js\src\jsapi.h(2153) : error C2143: syntax error : missing ',' before '*'
c:\xulrunner-27.0\mozilla-release\js\src\jsapi.h(2845) : error C4430: missing type specifier - int assumed. Note: C++ does not support default-int
c:\xulrunner-27.0\mozilla-release\js\src\jsapi.h(2845) : error C2143: syntax error : missing ',' before '*'
c:\xulrunner-27.0\mozilla-release\js\src\jsapi.h(2851) : error C4430: missing type specifier - int assumed. Note: C++ does not support default-int
c:\xulrunner-27.0\mozilla-release\js\src\jsapi.h(2851) : error C2143: syntax error : missing ',' before '*'
c:\xulrunner-27.0\mozilla-release\js\src\jsapi.h(2857) : error C4430: missing type specifier - int assumed. Note: C++ does not support default-int
c:\xulrunner-27.0\mozilla-release\js\src\jsapi.h(2857) : error C2143: syntax error : missing ',' before '*'
c:\xulrunner-27.0\mozilla-release\js\src\jsapi.h(2862) : error C4430: missing type specifier - int assumed. Note: C++ does not support default-int
c:\xulrunner-27.0\mozilla-release\js\src\jsapi.h(2862) : error C2143: syntax error : missing ',' before '*'
c:\xulrunner-27.0\mozilla-release\js\src\jsapi.h(2867) : error C4430: missing type specifier - int assumed. Note: C++ does not support default-int
c:\xulrunner-27.0\mozilla-release\js\src\jsapi.h(2867) : error C2143: syntax error : missing ',' before '*'
c:\xulrunner-27.0\mozilla-release\js\src\jsapi.h(2872) : error C4430: missing type specifier - int assumed. Note: C++ does not support default-int
c:\xulrunner-27.0\mozilla-release\js\src\jsapi.h(2872) : error C2143: syntax error : missing ',' before '*'
c:\xulrunner-27.0\mozilla-release\js\src\jsapi.h(2877) : error C4430: missing type specifier - int assumed. Note: C++ does not support default-int
c:\xulrunner-27.0\mozilla-release\js\src\jsapi.h(2877) : error C2143: syntax error : missing ',' before '*'
c:\xulrunner-27.0\mozilla-release\js\src\jsapi.h(2881) : error C4430: missing type specifier - int assumed. Note: C++ does not support default-int
c:\xulrunner-27.0\mozilla-release\js\src\jsapi.h(2881) : error C2143: syntax error : missing ',' before '*'
c:\xulrunner-27.0\mozilla-release\js\src\jsapi.h(3176) : error C4430: missing type specifier - int assumed. Note: C++ does not support default-int
c:\xulrunner-27.0\mozilla-release\js\src\jsapi.h(3176) : error C2143: syntax error : missing ',' before '*'
c:\xulrunner-27.0\mozilla-release\js\src\jsapi.h(3213) : error C4430: missing type specifier - int assumed. Note: C++ does not support default-int
c:\xulrunner-27.0\mozilla-release\js\src\jsapi.h(3213) : error C2143: syntax error : missing ',' before '*'
c:\xulrunner-27.0\mozilla-release\js\src\jsapi.h(3219) : error C4430: missing type specifier - int assumed. Note: C++ does not support default-int
c:\xulrunner-27.0\mozilla-release\js\src\jsapi.h(3219) : error C2143: syntax error : missing ',' before '*'
c:\xulrunner-27.0\mozilla-release\js\src\jsapi.h(3241) : error C4430: missing type specifier - int assumed. Note: C++ does not support default-int
c:\xulrunner-27.0\mozilla-release\js\src\jsapi.h(3241) : error C2143: syntax error : missing ',' before '*'
c:\xulrunner-27.0\mozilla-release\js\src\jsapi.h(3287) : error C2248: 'JS::Handle<T>::operator =' : cannot access private member declared in class 'JS::Handle<T>'
with
[
T=JSObject *
]
c:\xulrunner-27.0\objdir\dist\include\js/RootingAPI.h(467) : see declaration of 'JS::Handle<T>::operator ='
with
[
T=JSObject *
]
c:\xulrunner-27.0\mozilla-release\js\src\jsapi.h(3302) : error C4430: missing type specifier - int assumed. Note: C++ does not support default-int
c:\xulrunner-27.0\mozilla-release\js\src\jsapi.h(3302) : error C2143: syntax error : missing ',' before '*'
c:\xulrunner-27.0\mozilla-release\js\src\jsapi.h(3331) : error C4430: missing type specifier - int assumed. Note: C++ does not support default-int
c:\xulrunner-27.0\mozilla-release\js\src\jsapi.h(3331) : error C2143: syntax error : missing ',' before '*'
c:\xulrunner-27.0\mozilla-release\js\src\jsapi.h(3345) : error C4430: missing type specifier - int assumed. Note: C++ does not support default-int
c:\xulrunner-27.0\mozilla-release\js\src\jsapi.h(3345) : error C2143: syntax error : missing ',' before '*'
c:\xulrunner-27.0\mozilla-release\js\src\jsapi.h(3434) : error C4430: missing type specifier - int assumed. Note: C++ does not support default-int
c:\xulrunner-27.0\mozilla-release\js\src\jsapi.h(3434) : error C2143: syntax error : missing ',' before '*'
c:\xulrunner-27.0\mozilla-release\js\src\jsapi.h(3441) : error C4430: missing type specifier - int assumed. Note: C++ does not support default-int
c:\xulrunner-27.0\mozilla-release\js\src\jsapi.h(3441) : error C2143: syntax error : missing ',' before '*'
c:\xulrunner-27.0\mozilla-release\js\src\jsapi.h(3448) : error C4430: missing type specifier - int assumed. Note: C++ does not support default-int
c:\xulrunner-27.0\mozilla-release\js\src\jsapi.h(3448) : error C2143: syntax error : missing ',' before '*'
c:\xulrunner-27.0\mozilla-release\js\src\jsapi.h(3464) : error C4430: missing type specifier - int assumed. Note: C++ does not support default-int
c:\xulrunner-27.0\mozilla-release\js\src\jsapi.h(3464) : error C2143: syntax error : missing ',' before '*'
c:\xulrunner-27.0\mozilla-release\js\src\jsapi.h(3472) : error C4430: missing type specifier - int assumed. Note: C++ does not support default-int
c:\xulrunner-27.0\mozilla-release\js\src\jsapi.h(3472) : error C2143: syntax error : missing ',' before '*'
c:\xulrunner-27.0\mozilla-release\js\src\jsapi.h(3617) : error C2061: syntax error : identifier 'jschar'
c:\xulrunner-27.0\mozilla-release\js\src\jsapi.h(3620) : error C4430: missing type specifier - int assumed. Note: C++ does not support default-int
c:\xulrunner-27.0\mozilla-release\js\src\jsapi.h(3620) : error C2143: syntax error : missing ',' before '*'
c:\xulrunner-27.0\mozilla-release\js\src\jsapi.h(3623) : error C4430: missing type specifier - int assumed. Note: C++ does not support default-int
c:\xulrunner-27.0\mozilla-release\js\src\jsapi.h(3623) : error C2143: syntax error : missing ',' before '*'
c:\xulrunner-27.0\mozilla-release\js\src\jsapi.h(3626) : error C4430: missing type specifier - int assumed. Note: C++ does not support default-int
c:\xulrunner-27.0\mozilla-release\js\src\jsapi.h(3626) : error C2143: syntax error : missing ',' before '*'
c:\xulrunner-27.0\mozilla-release\js\src\jsapi.h(3629) : error C4430: missing type specifier - int assumed. Note: C++ does not support default-int
c:\xulrunner-27.0\mozilla-release\js\src\jsapi.h(3629) : error C2143: syntax error : missing ',' before '*'
c:\xulrunner-27.0\mozilla-release\js\src\jsapi.h(3681) : error C4430: missing type specifier - int assumed. Note: C++ does not support default-int
c:\xulrunner-27.0\mozilla-release\js\src\jsapi.h(3681) : error C2143: syntax error : missing ';' before '*'
c:\xulrunner-27.0\mozilla-release\js\src\jsapi.h(3681) : error C2373: 'jschar' : redefinition; different type modifiers
c:\xulrunner-27.0\objdir\dist\include\js/TypeDecls.h(53) : see declaration of 'jschar'
c:\xulrunner-27.0\mozilla-release\js\src\jsapi.h(3682) : error C4430: missing type specifier - int assumed. Note: C++ does not support default-int
c:\xulrunner-27.0\mozilla-release\js\src\jsapi.h(3684) : error C4430: missing type specifier - int assumed. Note: C++ does not support default-int
c:\xulrunner-27.0\mozilla-release\js\src\jsapi.h(3684) : error C2143: syntax error : missing ';' before '*'
c:\xulrunner-27.0\mozilla-release\js\src\jsapi.h(3684) : error C2373: 'jschar' : redefinition; different type modifiers
c:\xulrunner-27.0\objdir\dist\include\js/TypeDecls.h(53) : see declaration of 'jschar'
c:\xulrunner-27.0\mozilla-release\js\src\jsapi.h(3685) : error C4430: missing type specifier - int assumed. Note: C++ does not support default-int
c:\xulrunner-27.0\mozilla-release\js\src\jsapi.h(3687) : error C4430: missing type specifier - int assumed. Note: C++ does not support default-int
c:\xulrunner-27.0\mozilla-release\js\src\jsapi.h(3687) : error C2143: syntax error : missing ';' before '*'
c:\xulrunner-27.0\mozilla-release\js\src\jsapi.h(3687) : error C2373: 'jschar' : redefinition; different type modifiers
c:\xulrunner-27.0\objdir\dist\include\js/TypeDecls.h(53) : see declaration of 'jschar'
c:\xulrunner-27.0\mozilla-release\js\src\jsapi.h(3688) : error C4430: missing type specifier - int assumed. Note: C++ does not support default-int
c:\xulrunner-27.0\mozilla-release\js\src\jsapi.h(3690) : error C4430: missing type specifier - int assumed. Note: C++ does not support default-int
c:\xulrunner-27.0\mozilla-release\js\src\jsapi.h(3690) : error C2143: syntax error : missing ';' before '*'
c:\xulrunner-27.0\mozilla-release\js\src\jsapi.h(3690) : error C2373: 'jschar' : redefinition; different type modifiers
c:\xulrunner-27.0\objdir\dist\include\js/TypeDecls.h(53) : see declaration of 'jschar'
c:\xulrunner-27.0\mozilla-release\js\src\jsapi.h(3691) : error C4430: missing type specifier - int assumed. Note: C++ does not support default-int
c:\xulrunner-27.0\mozilla-release\js\src\jsapi.h(3693) : error C4430: missing type specifier - int assumed. Note: C++ does not support default-int
c:\xulrunner-27.0\mozilla-release\js\src\jsapi.h(3693) : error C2143: syntax error : missing ';' before '*'
c:\xulrunner-27.0\mozilla-release\js\src\jsapi.h(3693) : error C2373: 'jschar' : redefinition; different type modifiers
c:\xulrunner-27.0\objdir\dist\include\js/TypeDecls.h(53) : see declaration of 'jschar'
c:\xulrunner-27.0\mozilla-release\js\src\jsapi.h(3694) : error C4430: missing type specifier - int assumed. Note: C++ does not support default-int
c:\xulrunner-27.0\mozilla-release\js\src\jsapi.h(3699) : error C4430: missing type specifier - int assumed. Note: C++ does not support default-int
c:\xulrunner-27.0\mozilla-release\js\src\jsapi.h(3699) : error C2143: syntax error : missing ';' before '*'
c:\xulrunner-27.0\mozilla-release\js\src\jsapi.h(3699) : error C2373: 'jschar' : redefinition; different type modifiers
c:\xulrunner-27.0\objdir\dist\include\js/TypeDecls.h(53) : see declaration of 'jschar'
c:\xulrunner-27.0\mozilla-release\js\src\jsapi.h(3700) : error C4430: missing type specifier - int assumed. Note: C++ does not support default-int
c:\xulrunner-27.0\mozilla-release\js\src\jsapi.h(3737) : error C2061: syntax error : identifier 'jschar'
c:\xulrunner-27.0\mozilla-release\js\src\jsapi.h(3769) : error C2061: syntax error : identifier 'jschar'
c:\xulrunner-27.0\mozilla-release\js\src\jsapi.h(3879) : error C4430: missing type specifier - int assumed. Note: C++ does not support default-int
c:\xulrunner-27.0\mozilla-release\js\src\jsapi.h(3879) : error C2143: syntax error : missing ',' before '*'
c:\xulrunner-27.0\mozilla-release\js\src\jsapi.h(3892) : error C4430: missing type specifier - int assumed. Note: C++ does not support default-int
c:\xulrunner-27.0\mozilla-release\js\src\jsapi.h(3892) : error C2143: syntax error : missing ',' before '*'
c:\xulrunner-27.0\mozilla-release\js\src\jsapi.h(3895) : error C4430: missing type specifier - int assumed. Note: C++ does not support default-int
c:\xulrunner-27.0\mozilla-release\js\src\jsapi.h(3895) : error C2143: syntax error : missing ',' before '*'
c:\xulrunner-27.0\mozilla-release\js\src\jsapi.h(3978) : error C4430: missing type specifier - int assumed. Note: C++ does not support default-int
c:\xulrunner-27.0\mozilla-release\js\src\jsapi.h(3978) : error C2143: syntax error : missing ',' before '*'
c:\xulrunner-27.0\mozilla-release\js\src\jsapi.h(4017) : error C4430: missing type specifier - int assumed. Note: C++ does not support default-int
c:\xulrunner-27.0\mozilla-release\js\src\jsapi.h(4017) : error C2143: syntax error : missing ';' before '*'
c:\xulrunner-27.0\mozilla-release\js\src\jsapi.h(4017) : error C4430: missing type specifier - int assumed. Note: C++ does not support default-int
c:\xulrunner-27.0\mozilla-release\js\src\jsapi.h(4018) : error C4430: missing type specifier - int assumed. Note: C++ does not support default-int
c:\xulrunner-27.0\mozilla-release\js\src\jsapi.h(4018) : error C2143: syntax error : missing ';' before '*'
c:\xulrunner-27.0\mozilla-release\js\src\jsapi.h(4018) : error C2086: 'const int JSErrorReport::jschar' : redefinition
c:\xulrunner-27.0\mozilla-release\js\src\jsapi.h(4017) : see declaration of 'JSErrorReport::jschar'
c:\xulrunner-27.0\mozilla-release\js\src\jsapi.h(4018) : error C4430: missing type specifier - int assumed. Note: C++ does not support default-int
c:\xulrunner-27.0\mozilla-release\js\src\jsapi.h(4021) : error C4430: missing type specifier - int assumed. Note: C++ does not support default-int
c:\xulrunner-27.0\mozilla-release\js\src\jsapi.h(4021) : error C2143: syntax error : missing ';' before '*'
c:\xulrunner-27.0\mozilla-release\js\src\jsapi.h(4021) : error C2086: 'const int JSErrorReport::jschar' : redefinition
c:\xulrunner-27.0\mozilla-release\js\src\jsapi.h(4017) : see declaration of 'JSErrorReport::jschar'
c:\xulrunner-27.0\mozilla-release\js\src\jsapi.h(4021) : error C4430: missing type specifier - int assumed. Note: C++ does not support default-int
c:\xulrunner-27.0\mozilla-release\js\src\jsapi.h(4022) : error C4430: missing type specifier - int assumed. Note: C++ does not support default-int
c:\xulrunner-27.0\mozilla-release\js\src\jsapi.h(4022) : error C2143: syntax error : missing ';' before '*'
c:\xulrunner-27.0\mozilla-release\js\src\jsapi.h(4022) : error C2086: 'const int JSErrorReport::jschar' : redefinition
c:\xulrunner-27.0\mozilla-release\js\src\jsapi.h(4017) : see declaration of 'JSErrorReport::jschar'
c:\xulrunner-27.0\mozilla-release\js\src\jsapi.h(4022) : error C4430: missing type specifier - int assumed. Note: C++ does not support default-int
c:\xulrunner-27.0\mozilla-release\js\src\jsapi.h(4101) : error C2061: syntax error : identifier 'jschar'
c:\xulrunner-27.0\mozilla-release\js\src\jsapi.h(4110) : error C2061: syntax error : identifier 'jschar'
c:\xulrunner-27.0\mozilla-release\js\src\jsapi.h(4119) : error C2061: syntax error : identifier 'jschar'
c:\xulrunner-27.0\mozilla-release\js\src\jsapi.h(4122) : error C2061: syntax error : identifier 'jschar'

[/code]
Back to top
View user's profile Send private message
Display posts from previous:   
Reply to topic    Gentoo Forums Forum Index Portage & Programming All times are GMT
Page 1 of 1

 
Jump to:  
You cannot post new topics in this forum
You cannot reply to topics in this forum
You cannot edit your posts in this forum
You cannot delete your posts in this forum
You cannot vote in polls in this forum