Gentoo Forums
Gentoo Forums
Gentoo Forums
Quick Search: in
error compiling Broadcom sta
View unanswered posts
View posts from last 24 hours

 
Reply to topic    Gentoo Forums Forum Index Installing Gentoo
View previous topic :: View next topic  
Author Message
cuginguilu4
Tux's lil' helper
Tux's lil' helper


Joined: 17 Dec 2009
Posts: 98

PostPosted: Wed Jan 13, 2010 11:40 pm    Post subject: error compiling Broadcom sta Reply with quote

Here is the log:

Code:

   Entire Agreement.  This Agreement sets forth the entire Agreement between the parties and supersedes any and all prior proposals, agreements and rep$
 ^[[32;01m*^[[0m Do you accept the terms of this license (Broadcom)? [yes/no]  ^[[32;01m*^[[0m Determining the location of the kernel source code
 ^[[32;01m*^[[0m Found kernel source directory:
 ^[[32;01m*^[[0m     /usr/src/linux
 ^[[32;01m*^[[0m Found kernel object directory:
 ^[[32;01m*^[[0m     /lib/modules/2.6.31-gentoo-r6/build
 ^[[32;01m*^[[0m Found sources for kernel version:
 ^[[32;01m*^[[0m     2.6.31-gentoo-r6
 ^[[32;01m*^[[0m Checking for suitable kernel configuration options...
^[[A^[[149C  ^[[34;01m[ ^[[32;01mok^[[34;01m ]^[[0m
>>> Unpacking source...
>>> Unpacking hybrid-portsrc-x86_64-v5.10.91.9.3.tar.gz to /var/tmp/portage/net-wireless/broadcom-sta-5.10.91.9.3-r2/work
 ^[[32;01m*^[[0m Applying broadcom-sta-5.10.91.9-license.patch ...
^[[A^[[149C  ^[[34;01m[ ^[[32;01mok^[[34;01m ]^[[0m
 ^[[32;01m*^[[0m Applying broadcom-sta-5.10.91.9.3-linux-2.6.32.patch ...
^[[A^[[149C  ^[[34;01m[ ^[[32;01mok^[[34;01m ]^[[0m
>>> Source unpacked in /var/tmp/portage/net-wireless/broadcom-sta-5.10.91.9.3-r2/work
>>> Compiling source in /var/tmp/portage/net-wireless/broadcom-sta-5.10.91.9.3-r2/work ...
ln: creating symbolic link `Module.symvers': File exists
 ^[[32;01m*^[[0m Preparing wl module
make -j3 HOSTCC=x86_64-pc-linux-gnu-gcc CROSS_COMPILE=x86_64-pc-linux-gnu- LDFLAGS= -C /usr/src/linux M=/var/tmp/portage/net-wireless/broadcom-sta-5.10.91.9$
make: Entering directory `/usr/src/linux-2.6.31-gentoo-r6'
  CC [M]  /var/tmp/portage/net-wireless/broadcom-sta-5.10.91.9.3-r2/work/src/wl/sys/wl_linux.o
  CC [M]  /var/tmp/portage/net-wireless/broadcom-sta-5.10.91.9.3-r2/work/src/wl/sys/wl_iw.o
  CC [M]  /var/tmp/portage/net-wireless/broadcom-sta-5.10.91.9.3-r2/work/src/shared/linux_osl.o
/var/tmp/portage/net-wireless/broadcom-sta-5.10.91.9.3-r2/work/src/wl/sys/wl_iw.c:2129: error: 'wl_get_wireless_stats' undeclared here (not in a function)
/var/tmp/portage/net-wireless/broadcom-sta-5.10.91.9.3-r2/work/src/wl/sys/wl_linux.c:219:5: warning: "WIRELESS_EXT" is not defined
/var/tmp/portage/net-wireless/broadcom-sta-5.10.91.9.3-r2/work/src/wl/sys/wl_linux.c: In function 'wl_tkip_keyset':
/var/tmp/portage/net-wireless/broadcom-sta-5.10.91.9.3-r2/work/src/wl/sys/wl_linux.c:1936: error: 'IW_ENCODE_SEQ_MAX_SIZE' undeclared (first use in this fun$
/var/tmp/portage/net-wireless/broadcom-sta-5.10.91.9.3-r2/work/src/wl/sys/wl_linux.c:1936: error: (Each undeclared identifier is reported only once
/var/tmp/portage/net-wireless/broadcom-sta-5.10.91.9.3-r2/work/src/wl/sys/wl_linux.c:1936: error: for each function it appears in.)
/var/tmp/portage/net-wireless/broadcom-sta-5.10.91.9.3-r2/work/src/wl/sys/wl_linux.c:1936: warning: unused variable 'rxseq'
make[1]: *** [/var/tmp/portage/net-wireless/broadcom-sta-5.10.91.9.3-r2/work/src/wl/sys/wl_iw.o] Error 1
make[1]: *** Waiting for unfinished jobs....
make[1]: *** [/var/tmp/portage/net-wireless/broadcom-sta-5.10.91.9.3-r2/work/src/wl/sys/wl_linux.o] Error 1
make: *** [wl.ko] Error 2
make: Leaving directory `/usr/src/linux-2.6.31-gentoo-r6'
 ^[[31;01m*^[[0m
 ^[[31;01m*^[[0m ERROR: net-wireless/broadcom-sta-5.10.91.9.3-r2 failed.
 ^[[31;01m*^[[0m Call stack:
 ^[[31;01m*^[[0m               ebuild.sh, line   49:  Called src_compile
 ^[[31;01m*^[[0m             environment, line 3495:  Called linux-mod_src_compile
 ^[[31;01m*^[[0m             environment, line 2706:  Called die
 ^[[31;01m*^[[0m The specific snippet of code:
 ^[[31;01m*^[[0m               eval "emake HOSTCC=\"$(tc-getBUILD_CC)\"                                                 CROSS_COMPILE=${CHOST}-             $
 ^[[31;01m*^[[0m  The die message:
 ^[[31;01m*^[[0m   Unable to emake HOSTCC=x86_64-pc-linux-gnu-gcc CROSS_COMPILE=x86_64-pc-linux-gnu- LDFLAGS=  -C /usr/src/linux M=/var/tmp/portage/net-wire$
 ^[[31;01m*^[[0m
 ^[[31;01m*^[[0m If you need support, post the topmost build error, and the call stack if relevant.
 ^[[31;01m*^[[0m A complete build log is located at '/var/tmp/portage/net-wireless/broadcom-sta-5.10.91.9.3-r2/temp/build.log'.
 ^[[31;01m*^[[0m The ebuild environment file is located at '/var/tmp/portage/net-wireless/broadcom-sta-5.10.91.9.3-r2/temp/environment'.
 ^[[31;01m*^[[0m
Back to top
View user's profile Send private message
Mike Hunt
Watchman
Watchman


Joined: 19 Jul 2009
Posts: 5287

PostPosted: Thu Jan 14, 2010 2:18 am    Post subject: Reply with quote

If you try with the 5.10.91.9.3-r1 version, do you still get the same build errors?
Code:
emerge -av =net-wireless/broadcom-sta-5.10.91.9.3-r1
Back to top
View user's profile Send private message
d2_racing
Moderator
Moderator


Joined: 25 Apr 2005
Posts: 13046
Location: Ste-Foy,Canada

PostPosted: Thu Jan 14, 2010 2:50 am    Post subject: Reply with quote

Right now, I'm more concern with that kind of error : warning: "WIRELESS_EXT" is not defined
_________________
Sysadmin of GentooQuébec.org
Wiki
Signature
IRC on Freenode : #gentoo-quebec
Back to top
View user's profile Send private message
Mike Hunt
Watchman
Watchman


Joined: 19 Jul 2009
Posts: 5287

PostPosted: Thu Jan 14, 2010 3:25 am    Post subject: Reply with quote

... and WIRELESS_EXT is found in /usr/src/linux ---> make menuconfig ---> Networking Support ---> Wireless ---> Wireless Extensions

Then recompile your kernel and reinstall it. Make sure your /boot partition is mounted when you re-install the kernel.
Back to top
View user's profile Send private message
cach0rr0
Moderator
Moderator


Joined: 13 Nov 2008
Posts: 4121
Location: Houston, Republic of Texas

PostPosted: Thu Jan 14, 2010 4:41 am    Post subject: Reply with quote

d2_racing wrote:
Right now, I'm more concern with that kind of error : warning: "WIRELESS_EXT" is not defined


your advice actually fixed this in another thread :P

http://forums.gentoo.org/viewtopic-p-6127694.html

Those settings should sort the issue. From what I can tell this is another bug in the ebuild, where it should have another CONFIG_CHECK section for kernels >= 2.6.32

It's simple enough I could probably do it and proffer a new ebuild =/

EDIT:

New ebuild should be something like:

Code:

--- broadcom-sta-5.10.91.9.3-r2.ebuild  2009-12-07 09:47:15.000000000 -0600
+++ broadcom-sta-5.10.91.9.3-r2.ebuild.new      2010-01-13 22:54:56.981476480 -0600
@@ -29,7 +29,7 @@
 pkg_setup() {
        check_license

-       CONFIG_CHECK="~!B43 ~!SSB"
+       CONFIG_CHECK="!B43 !SSB ~!MAC80211 WIRELESS_EXT"
        if kernel_is ge 2 6 31; then
                CONFIG_CHECK="${CONFIG_CHECK} LIB80211"
        elif kernel_is ge 2 6 29; then

_________________
Lost configuring your system?
dump lspci -n here | see Pappy's guide | Link Stash
Back to top
View user's profile Send private message
d2_racing
Moderator
Moderator


Joined: 25 Apr 2005
Posts: 13046
Location: Ste-Foy,Canada

PostPosted: Thu Jan 14, 2010 11:52 am    Post subject: Reply with quote

Actually,we should open an another bugzilla for that
_________________
Sysadmin of GentooQuébec.org
Wiki
Signature
IRC on Freenode : #gentoo-quebec
Back to top
View user's profile Send private message
cuginguilu4
Tux's lil' helper
Tux's lil' helper


Joined: 17 Dec 2009
Posts: 98

PostPosted: Thu Jan 14, 2010 2:37 pm    Post subject: Reply with quote

I'll recompile the kernel when I get home.
Back to top
View user's profile Send private message
d2_racing
Moderator
Moderator


Joined: 25 Apr 2005
Posts: 13046
Location: Ste-Foy,Canada

PostPosted: Thu Jan 14, 2010 3:21 pm    Post subject: Reply with quote

No problem, keep us inform of your progress.
_________________
Sysadmin of GentooQuébec.org
Wiki
Signature
IRC on Freenode : #gentoo-quebec
Back to top
View user's profile Send private message
cach0rr0
Moderator
Moderator


Joined: 13 Nov 2008
Posts: 4121
Location: Houston, Republic of Texas

PostPosted: Fri Jan 15, 2010 12:56 am    Post subject: Reply with quote

d2_racing wrote:
Actually,we should open an another bugzilla for that


Probably so, but I went ahead and submitted an ebuild on the existing bug that should do the relevant checks

http://bugs.gentoo.org/show_bug.cgi?id=300570

The original bug was in reference solely to B43 and SSB, but after chatting to a few folks this should be extended to make sure WIRELESS_EXT is enabled, and make sure MAC80211 isn't enabled; easy enough to add these checks, so I went ahead and included those in the new ebuild.
_________________
Lost configuring your system?
dump lspci -n here | see Pappy's guide | Link Stash
Back to top
View user's profile Send private message
cuginguilu4
Tux's lil' helper
Tux's lil' helper


Joined: 17 Dec 2009
Posts: 98

PostPosted: Fri Jan 15, 2010 1:16 am    Post subject: Reply with quote

The problem is solved, but I have another :|

When I try to emerge gdm i got errors this error:

Code:

>>> Failed to emerge gnome-base/gdm-2.20.10-r2, Log file:

>>>  '/var/tmp/portage/gnome-base/gdm-2.20.10-r2/temp/build.log'

 * Messages for package gnome-base/gdm-2.20.10-r2:

 *
 * ERROR: gnome-base/gdm-2.20.10-r2 failed.
 * Call stack:
 *               ebuild.sh, line   49:  Called src_compile
 *             environment, line 3034:  Called gnome2_src_compile
 *             environment, line 2256:  Called die
 * The specific snippet of code:
 *       emake || die "compile failure"
 *  The die message:
 *   compile failure
 *
 * If you need support, post the topmost build error, and the call stack if relevant.
 * A complete build log is located at '/var/tmp/portage/gnome-base/gdm-2.20.10-r2/temp/build.log'.
 * The ebuild environment file is located at '/var/tmp/portage/gnome-base/gdm-2.20.10-r2/temp/environment'.
 *

Don't know why I'm getting all these errors -.-
Back to top
View user's profile Send private message
cach0rr0
Moderator
Moderator


Joined: 13 Nov 2008
Posts: 4121
Location: Houston, Republic of Texas

PostPosted: Fri Jan 15, 2010 1:24 am    Post subject: Reply with quote

unrelated, and the interesting parts of that error message will be the last 40 or so lines above what you've posted.
_________________
Lost configuring your system?
dump lspci -n here | see Pappy's guide | Link Stash
Back to top
View user's profile Send private message
cuginguilu4
Tux's lil' helper
Tux's lil' helper


Joined: 17 Dec 2009
Posts: 98

PostPosted: Fri Jan 15, 2010 1:29 am    Post subject: Reply with quote

cach0rr0 wrote:
unrelated, and the interesting parts of that error message will be the last 40 or so lines above what you've posted.


sorry, so here's the log (after the checking/config lines):

Code:

GDM2 configuration summary:
===========================

CFLAGS : -march=nocona -O2 -pipe -Wall -Wmissing-prototypes
LDFLAGS : -Wl,-O1

prefix : /usr
sysconf : /etc/X11
sysconfsubdir : gdm
gdmconf dir : ${sysconfdir}/${sysconfsubdir}
dmconf dir : /etc/X11/dm
bin dir : ${exec_prefix}/bin
sbin dir : ${exec_prefix}/sbin
PAM prefix : /etc
data dir : /usr/share
X server : /usr/bin/X

TCP Wrappers support                  : YES
Xinerama support                      : NO
XDMCP (remote login) support          : YES
Secure remote connection              : NO
DMX (Distributed Multihead X) support : NO
Console helper                        : NO
SELinux support                       : NO
Solaris Trusted Extensions support    : NO
ConsoleKit support                    : YES
Authentication scheme                 : verify-pam
Extra utilities built                 : gdmopen gdmaskpass gdmprefetch

>>> Source configured.
>>> Compiling source in /var/tmp/portage/gnome-base/gdm-2.20.10-r2/work/gdm-2.20.10 ...
make -j3
make  all-recursive
make[1]: Entrando no diretório `/var/tmp/portage/gnome-base/gdm-2.20.10-r2/work/gdm-2.20.10'
Making all in po
make[2]: Entrando no diretório `/var/tmp/portage/gnome-base/gdm-2.20.10-r2/work/gdm-2.20.10/po'
file=`echo pt | sed 's,.*/,,'`.gmo \
          && rm -f $file && /usr/bin/gmsgfmt -o $file pt.po
make[2]: Saindo do diretório `/var/tmp/portage/gnome-base/gdm-2.20.10-r2/work/gdm-2.20.10/po'
Making all in config
make[2]: Entrando no diretório `/var/tmp/portage/gnome-base/gdm-2.20.10-r2/work/gdm-2.20.10/config'
sed     -e 's,[@]GDMPREFETCHCMD[@],/usr/lib64/gdmprefetch \@/etc/X11/gdm/gdmprefetchlist,g' \
                -e 's,[@]GDM_CUSTOM_CONF[@],/etc/X11/gdm/custom.conf,g' \
                -e 's,[@]GDM_USER_PATH[@],/bin:/usr/bin,g' \
                -e 's,[@]HALT_COMMAND[@],/usr/bin/poweroff;/sbin/poweroff;/sbin/shutdown -h now;/usr/sbin/shutdown -h now,g' \
                -e 's,[@]REBOOT_COMMAND[@],/usr/bin/reboot;/sbin/reboot;/sbin/shutdown -r now;/usr/sbin/shutdown -r now,g' \
                -e 's,[@]SOUND_PROGRAM[@],/usr/bin/gdmplay,g' \
                -e 's,[@]SUSPEND_COMMAND[@],,g' \
                -e 's,[@]XEVIE_OPTION[@],,g' \
                -e 's,[@]ALWAYS_RESTART_SERVER[@],,g' \
                -e 's,[@]UTMP_LINE_ATTACHED[@],/dev/console,g' \
                -e 's,[@]UTMP_LINE_REMOTE[@],,g' \
                -e 's,[@]UTMP_PSEUDO_DEVICE[@],false,g' \
                -e 's,[@]X_CONFIG_OPTIONS[@],-audit 0,g' \
                -e 's,[@]X_SERVER[@],/usr/bin/X,g' \
                -e 's,[@]X_XNEST_CMD[@],/usr/bin/Xnest,g' \
                -e 's,[@]X_XNEST_CONFIG_OPTIONS[@],-audit 0 -name Xnest,g' \
                -e 's,[@]X_XNEST_UNSCALED_FONTPATH[@],true,g' \
                -e 's,[@]GDM_RBAC_SYSCMD_KEYS[@],,g' \
                -e 's,[@]authdir[@],/var/gdm,g' \
                -e 's,[@]datadir[@],/usr/share,g' \
                -e 's,[@]dmconfdir[@],/etc/X11/dm,g' \
                -e 's,[@]gdmconfdir[@],/etc/X11/gdm,g' \
                -e 's,[@]libdir[@],/usr/lib64,g' \
                -e 's,[@]libexecdir[@],/usr/libexec,g' \
                -e 's,[@]gdmlocaledir[@],/etc/X11/gdm,g' \
                -e 's,[@]logdir[@],/var/log/gdm,g' \
                -e 's,[@]pixmapdir[@],/usr/share/pixmaps,g' \
                -e 's,[@]sbindir[@],/usr/sbin,g' \
                <./gdm.conf.in >gdm.conf
make[2]: Saindo do diretório `/var/tmp/portage/gnome-base/gdm-2.20.10-r2/work/gdm-2.20.10/config'
Making all in pixmaps
make[2]: Entrando no diretório `/var/tmp/portage/gnome-base/gdm-2.20.10-r2/work/gdm-2.20.10/pixmaps'
Making all in 16x16
make[3]: Entrando no diretório `/var/tmp/portage/gnome-base/gdm-2.20.10-r2/work/gdm-2.20.10/pixmaps/16x16'
make[3]: Nada a ser feito para `all'.
make[3]: Saindo do diretório `/var/tmp/portage/gnome-base/gdm-2.20.10-r2/work/gdm-2.20.10/pixmaps/16x16'
Making all in 24x24
make[3]: Entrando no diretório `/var/tmp/portage/gnome-base/gdm-2.20.10-r2/work/gdm-2.20.10/pixmaps/24x24'
gdk-pixbuf-csource --raw --build-list preferences_desktop_locale_24 ./preferences-desktop-locale.png preferences_desktop_remote_desktop_24 ./preferen$

(process:31212): GdkPixbuf-WARNING **: Cannot open pixbuf loader module file '/etc/gtk-2.0/gdk-pixbuf.loaders': No such file or directory
failed to load "./preferences-desktop-locale.png": Couldn't recognize the image file format for file './preferences-desktop-locale.png'
make[3]: ** [inlines.h] Erro 1
make[3]: Saindo do diretório `/var/tmp/portage/gnome-base/gdm-2.20.10-r2/work/gdm-2.20.10/pixmaps/24x24'
make[2]: ** [all-recursive] Erro 1
make[2]: Saindo do diretório `/var/tmp/portage/gnome-base/gdm-2.20.10-r2/work/gdm-2.20.10/pixmaps'
make[1]: ** [all-recursive] Erro 1
make[1]: Saindo do diretório `/var/tmp/portage/gnome-base/gdm-2.20.10-r2/work/gdm-2.20.10'
make: ** [all] Erro 2
 ^[[31;01m*^[[0m
 ^[[31;01m*^[[0m ERROR: gnome-base/gdm-2.20.10-r2 failed.
 ^[[31;01m*^[[0m Call stack:
 ^[[31;01m*^[[0m               ebuild.sh, line   49:  Called src_compile
 ^[[31;01m*^[[0m             environment, line 3034:  Called gnome2_src_compile
 ^[[31;01m*^[[0m             environment, line 2256:  Called die
 ^[[31;01m*^[[0m The specific snippet of code:
 ^[[31;01m*^[[0m       emake || die "compile failure"
 ^[[31;01m*^[[0m  The die message:
 ^[[31;01m*^[[0m   compile failure
 ^[[31;01m*^[[0m
 ^[[31;01m*^[[0m If you need support, post the topmost build error, and the call stack if relevant.
 ^[[31;01m*^[[0m A complete build log is located at '/var/tmp/portage/gnome-base/gdm-2.20.10-r2/temp/build.log'.
 ^[[31;01m*^[[0m The ebuild environment file is located at '/var/tmp/portage/gnome-base/gdm-2.20.10-r2/temp/environment'.
 ^[[31;01m*^[[0m

Back to top
View user's profile Send private message
cuginguilu4
Tux's lil' helper
Tux's lil' helper


Joined: 17 Dec 2009
Posts: 98

PostPosted: Fri Jan 15, 2010 9:52 pm    Post subject: Reply with quote

What should I do anyway? anyone know? T_T
Back to top
View user's profile Send private message
DONAHUE
Watchman
Watchman


Joined: 09 Dec 2006
Posts: 6499
Location: Goose Creek SC

PostPosted: Sat Jan 16, 2010 6:00 am    Post subject: Reply with quote

Quote:
(process:31212): GdkPixbuf-WARNING **: Cannot open pixbuf loader module file '/etc/gtk-2.0/gdk-pixbuf.loaders': No such file or directory

No such file or directory is true here also but emerge gdm works. Suggesting you received a bad ebuild/make file.
'/etc/gtk-2.0/x86_64-pc-linux-gnu/gdk-pixbuf.loaders' does exist here.

If
Code:
 ls -l /etc/gtk-2.0/
produces
Quote:
total 4
drwxr-xr-x 2 root root 120 Jan 7 2009 i686-pc-linux-gnu
-rw-r--r-- 1 root root 890 Dec 30 17:09 im-multipress.conf
drwxr-xr-x 2 root root 184 Dec 30 17:09 x86_64-pc-linux-gnu
You could try tricking the compile by making the appropriate symlink:
For 64 bit kernel:
Code:
ln -s /etc/gtk-2.0/x86_64-pc-linux-gnu/gdk-pixbuf.loaders /etc/gtk-2.0/gdk-pixbuf.loaders

For 32 bit kernel:
Code:
ln -s /etc/gtk-2.0/i686-pc-linux-gnu/gdk-pixbuf.loaders /etc/gtk-2.0/gdk-pixbuf.loaders

and try again.
Back to top
View user's profile Send private message
Mike Hunt
Watchman
Watchman


Joined: 19 Jul 2009
Posts: 5287

PostPosted: Sat Jan 16, 2010 2:05 pm    Post subject: Reply with quote

... or re-emerge x11-libs/gtk+ maybe ?
Code:
emerge --oneshot x11-libs/gtk+
Back to top
View user's profile Send private message
d2_racing
Moderator
Moderator


Joined: 25 Apr 2005
Posts: 13046
Location: Ste-Foy,Canada

PostPosted: Sat Jan 16, 2010 5:53 pm    Post subject: Reply with quote

And if we don't find something, maybe you should try that :

Code:

# emerge -e world
# revdep-rebuild -i


That's the hard way do solve a bug.
_________________
Sysadmin of GentooQuébec.org
Wiki
Signature
IRC on Freenode : #gentoo-quebec
Back to top
View user's profile Send private message
Skirmitch
Tux's lil' helper
Tux's lil' helper


Joined: 15 Jun 2013
Posts: 91

PostPosted: Tue Jul 23, 2013 3:36 am    Post subject: Reply with quote

Heyas, i reopened this thread cuz the error is the same. Trying to emerge broadcom-sta to then patch with https://bugs.launchpad.net/ubuntu/+source/linux/+bug/1173761/comments/29 i get the following error:

Code:
 * Package:    net-wireless/broadcom-sta-6.30.223.30-r1
 * Repository: gentoo
 * Maintainer: tomboy64@sina.cn proxy-maint@gentoo.org
 * USE:        amd64 elibc_glibc kernel_linux userland_GNU
 * FEATURES:   preserve-libs sandbox
 * Determining the location of the kernel source code
 * Found kernel source directory:
 *     /usr/src/linux
 * Found kernel object directory:
 *     /lib/modules/3.10.0-gentoo/build
 * Found sources for kernel version:
 *     3.10.0-gentoo
 * Checking for suitable kernel configuration options...
 [ ok ]
>>> Unpacking source...
>>> Unpacking bcmwl-kernel-source_6.30.223.30%2Bbdcom-0ubuntu1%7Eppa1_amd64.deb to /var/tmp/portage/net-wireless/broadcom-sta-6.30.223.30-r1/work
>>> Unpacking data.tar.gz to /var/tmp/portage/net-wireless/broadcom-sta-6.30.223.30-r1/work
>>> Source unpacked in /var/tmp/portage/net-wireless/broadcom-sta-6.30.223.30-r1/work
>>> Preparing source in /var/tmp/portage/net-wireless/broadcom-sta-6.30.223.30-r1/work/usr/src/bcmwl-6.30.223.30+bdcom ...
 * Applying various patches (bugfixes/updates) ...
 *   0001-MODULE_LICENSE.patch ...
 [ ok ]
 *   Skipping 0002-Makefile.patch due to EPATCH_EXCLUDE ...
 *   0003-Make-up-for-missing-init_MUTEX.patch ...
 [ ok ]
 *   Skipping 0004-Add-support-for-Linux-3.2.patch due to EPATCH_EXCLUDE ...
 *   Skipping 0005-add-support-for-linux-3.4.0.patch due to EPATCH_EXCLUDE ...
 *   0006-add-support-for-linux-3.8.0.patch ...
 [ ok ]
 *   0007-nl80211-move-scan-API-to-wdev.patch ...
 [ ok ]
 * Done with patching
 * Applying broadcom-sta-6.30.223.30-makefile.patch ...
 [ ok ]
 * Applying broadcom-sta-6.30.223.30-linux-3.9.0.patch ...
 [ ok ]
>>> Source prepared.
>>> Configuring source in /var/tmp/portage/net-wireless/broadcom-sta-6.30.223.30-r1/work/usr/src/bcmwl-6.30.223.30+bdcom ...
>>> Source configured.
>>> Compiling source in /var/tmp/portage/net-wireless/broadcom-sta-6.30.223.30-r1/work/usr/src/bcmwl-6.30.223.30+bdcom ...
ln: failed to create symbolic link 'Module.symvers': File exists
 * Preparing wl module
make -j9 HOSTCC=x86_64-pc-linux-gnu-gcc CROSS_COMPILE=x86_64-pc-linux-gnu- 'LDFLAGS=-m elf_x86_64' -C /usr/src/linux M=/var/tmp/portage/net-wireless/broadcom-sta-6.30.223.30-r1/work/usr/src/bcmwl-6.30.223.30+bdcom wl.ko
make: Entering directory `/usr/src/linux-3.10.0-gentoo'
CFG80211 API is prefered for this kernel version
Using CFG80211 API
  CC [M]  /var/tmp/portage/net-wireless/broadcom-sta-6.30.223.30-r1/work/usr/src/bcmwl-6.30.223.30+bdcom/src/shared/linux_osl.o
  CC [M]  /var/tmp/portage/net-wireless/broadcom-sta-6.30.223.30-r1/work/usr/src/bcmwl-6.30.223.30+bdcom/src/wl/sys/wl_linux.o
  CC [M]  /var/tmp/portage/net-wireless/broadcom-sta-6.30.223.30-r1/work/usr/src/bcmwl-6.30.223.30+bdcom/src/wl/sys/wl_iw.o
  CC [M]  /var/tmp/portage/net-wireless/broadcom-sta-6.30.223.30-r1/work/usr/src/bcmwl-6.30.223.30+bdcom/src/wl/sys/wl_cfg80211_hybrid.o
/var/tmp/portage/net-wireless/broadcom-sta-6.30.223.30-r1/work/usr/src/bcmwl-6.30.223.30+bdcom/src/wl/sys/wl_linux.c: In function 'wl_tkip_printstats':
/var/tmp/portage/net-wireless/broadcom-sta-6.30.223.30-r1/work/usr/src/bcmwl-6.30.223.30+bdcom/src/wl/sys/wl_linux.c:3247:7: warning: passing argument 1 of 'wl->tkipmodops->print_stats' from incompatible pointer type [enabled by default]
/var/tmp/portage/net-wireless/broadcom-sta-6.30.223.30-r1/work/usr/src/bcmwl-6.30.223.30+bdcom/src/wl/sys/wl_linux.c:3247:7: note: expected 'struct seq_file *' but argument is of type 'char *'
/var/tmp/portage/net-wireless/broadcom-sta-6.30.223.30-r1/work/usr/src/bcmwl-6.30.223.30+bdcom/src/wl/sys/wl_linux.c:3250:4: warning: passing argument 1 of 'wl->tkipmodops->print_stats' from incompatible pointer type [enabled by default]
/var/tmp/portage/net-wireless/broadcom-sta-6.30.223.30-r1/work/usr/src/bcmwl-6.30.223.30+bdcom/src/wl/sys/wl_linux.c:3250:4: note: expected 'struct seq_file *' but argument is of type 'char *'
/var/tmp/portage/net-wireless/broadcom-sta-6.30.223.30-r1/work/usr/src/bcmwl-6.30.223.30+bdcom/src/wl/sys/wl_linux.c: In function 'wl_reg_proc_entry':
/var/tmp/portage/net-wireless/broadcom-sta-6.30.223.30-r1/work/usr/src/bcmwl-6.30.223.30+bdcom/src/wl/sys/wl_linux.c:3471:2: error: implicit declaration of function 'create_proc_entry' [-Werror=implicit-function-declaration]
/var/tmp/portage/net-wireless/broadcom-sta-6.30.223.30-r1/work/usr/src/bcmwl-6.30.223.30+bdcom/src/wl/sys/wl_linux.c:3471:22: warning: assignment makes pointer from integer without a cast [enabled by default]
/var/tmp/portage/net-wireless/broadcom-sta-6.30.223.30-r1/work/usr/src/bcmwl-6.30.223.30+bdcom/src/wl/sys/wl_linux.c:3476:16: error: dereferencing pointer to incomplete type
/var/tmp/portage/net-wireless/broadcom-sta-6.30.223.30-r1/work/usr/src/bcmwl-6.30.223.30+bdcom/src/wl/sys/wl_linux.c:3477:16: error: dereferencing pointer to incomplete type
/var/tmp/portage/net-wireless/broadcom-sta-6.30.223.30-r1/work/usr/src/bcmwl-6.30.223.30+bdcom/src/wl/sys/wl_linux.c:3478:16: error: dereferencing pointer to incomplete type
cc1: some warnings being treated as errors
make[1]: *** [/var/tmp/portage/net-wireless/broadcom-sta-6.30.223.30-r1/work/usr/src/bcmwl-6.30.223.30+bdcom/src/wl/sys/wl_linux.o] Error 1
make[1]: *** Waiting for unfinished jobs....
make: *** [wl.ko] Error 2
make: Leaving directory `/usr/src/linux-3.10.0-gentoo'
 * ERROR: net-wireless/broadcom-sta-6.30.223.30-r1 failed (compile phase):
 *   emake failed
 *
 * If you need support, post the output of `emerge --info '=net-wireless/broadcom-sta-6.30.223.30-r1'`,
 * the complete build log and the output of `emerge -pqv '=net-wireless/broadcom-sta-6.30.223.30-r1'`.
 * The complete build log is located at '/var/tmp/portage/net-wireless/broadcom-sta-6.30.223.30-r1/temp/build.log'.
 * The ebuild environment file is located at '/var/tmp/portage/net-wireless/broadcom-sta-6.30.223.30-r1/temp/environment'.
 * Working directory: '/var/tmp/portage/net-wireless/broadcom-sta-6.30.223.30-r1/work/usr/src/bcmwl-6.30.223.30+bdcom'
 * S: '/var/tmp/portage/net-wireless/broadcom-sta-6.30.223.30-r1/work/usr/src/bcmwl-6.30.223.30+bdcom'


Tryed using CFG80211 as module and as inkernel and nothing changed. Any suggestions are appreciated
Back to top
View user's profile Send private message
Skirmitch
Tux's lil' helper
Tux's lil' helper


Joined: 15 Jun 2013
Posts: 91

PostPosted: Thu Jul 25, 2013 6:15 pm    Post subject: Reply with quote

Any help here please? my laptop is absolutly useless without wifi =(
Back to top
View user's profile Send private message
Skirmitch
Tux's lil' helper
Tux's lil' helper


Joined: 15 Jun 2013
Posts: 91

PostPosted: Sun Aug 04, 2013 10:10 pm    Post subject: Reply with quote

Ok, seems there's something here http://bugs.debian.org/cgi-bin/bugreport.cgi?bug=716999 so i'll wait and see what i get here
Back to top
View user's profile Send private message
666threesixes666
Veteran
Veteran


Joined: 31 May 2011
Posts: 1237
Location: 42.68n 85.41w

PostPosted: Sun Aug 04, 2013 10:28 pm    Post subject: Reply with quote

many broadcom cards are also covered by b43. please stop bumping this OLD thread. wireless_ext is now CONFIG_CFG80211_WEXT=y

https://wiki.gentoo.org/wiki/Wifi#b43

3 years? open your own thread about it....
_________________
cat /etc/*-release
Funtoo Linux - baselayout 2.2.0
consider this warning no. 1
https://wiki.gentoo.org/index.php?title=Special:Contributions/666threesixes666&offset=&limit=500&target=666threesixes666
Back to top
View user's profile Send private message
Skirmitch
Tux's lil' helper
Tux's lil' helper


Joined: 15 Jun 2013
Posts: 91

PostPosted: Mon Aug 05, 2013 1:33 pm    Post subject: Reply with quote

Whats the reason to open a new thread with the same info that its in this one? duplicated threadas? dont seem so usefull imho. My "own thread" as if i owned it XD. This one is not covered by b43 read the thread b4 posting please, it says clearly i need wl to use an other bugfix thats arround and that one finally fixes my card and oc wireless_ext is that new thing, oc i knew it..... do u think i just tryed to compile and as it didnt work i posted this and sat back to wait?
Back to top
View user's profile Send private message
Gusar
Advocate
Advocate


Joined: 09 Apr 2005
Posts: 2642
Location: Slovenia

PostPosted: Mon Aug 05, 2013 2:09 pm    Post subject: Reply with quote

666threesixes666 wrote:
wireless_ext is now CONFIG_CFG80211_WEXT=y

No, it's not. CFG80211_WEXT is a wext compatibility layer for netlink-based (nl80211) drivers, it allows you to use old tools (iwconfig/iwlist) with these drivers. WIRELESS_EXT is something entirely different, it's the old deprecated wireless framework. You can't directly select it in the kernel since a long time now, you can only get it by selecting one of the few drivers that are actually wext-based rather than netlink-based (the common example is ipw2100/ipw2200).

@Skirmitch: The reason you should open a new thread is because info in this one is outdated and therefore not useful anymore. Also, your error is not the same as the one discussed here, your error is specific to kernel 3.10, a kernel that definitely did not exist three years ago.
Back to top
View user's profile Send private message
Skirmitch
Tux's lil' helper
Tux's lil' helper


Joined: 15 Jun 2013
Posts: 91

PostPosted: Mon Aug 05, 2013 3:02 pm    Post subject: Reply with quote

Gusar wrote:
666threesixes666 wrote:
wireless_ext is now CONFIG_CFG80211_WEXT=y
open a new thread is because info in this one is outdated and therefore not useful anymore. Also, your error is not the same as the one discussed here, your error is specific to kernel 3.10, a kernel that definitely did not exist three years ago.


Oh, sorry i thought it was the same one that cuginguilu4 posted at last, if you tell me its not, i will open a new thread. Also, can you help me on when this is a matter to be posted in a bug tracker and when its a matter of this forum? Greetings
Back to top
View user's profile Send private message
Display posts from previous:   
Reply to topic    Gentoo Forums Forum Index Installing Gentoo All times are GMT
Page 1 of 1

 
Jump to:  
You cannot post new topics in this forum
You cannot reply to topics in this forum
You cannot edit your posts in this forum
You cannot delete your posts in this forum
You cannot vote in polls in this forum