Gentoo Forums
Gentoo Forums
Gentoo Forums
Quick Search: in
[qt overlay] Qt beta and live ebuilds & Qt4 apps
View unanswered posts
View posts from last 24 hours

Goto page Previous  1, 2, 3 ... 12, 13, 14, 15, 16  Next  
Reply to topic    Gentoo Forums Forum Index Unsupported Software
View previous topic :: View next topic  
Author Message
Hwoarang
Developer
Developer


Joined: 24 Feb 2007
Posts: 701
Location: Leeds, UK

PostPosted: Mon Jun 28, 2010 8:16 am    Post subject: Reply with quote

I have the problem from time to time. The error message indicates that there is a problem with upstream repo
Back to top
View user's profile Send private message
TheDodger
Tux's lil' helper
Tux's lil' helper


Joined: 12 Aug 2002
Posts: 126
Location: Hamburg

PostPosted: Mon Jun 28, 2010 8:20 am    Post subject: Reply with quote

Hwoarang wrote:
I have the problem from time to time. The error message indicates that there is a problem with upstream repo


hmmm
i have currently this problem only when i run the emerge.
not when i use git from the command line.

but i cant use my handclone from git ... emerge removed all sources. :(
*narf*
Back to top
View user's profile Send private message
TheDodger
Tux's lil' helper
Tux's lil' helper


Joined: 12 Aug 2002
Posts: 126
Location: Hamburg

PostPosted: Mon Jun 28, 2010 8:39 am    Post subject: Reply with quote

TheDodger wrote:
Hwoarang wrote:
I have the problem from time to time. The error message indicates that there is a problem with upstream repo


hmmm
i have currently this problem only when i run the emerge.
not when i use git from the command line.

but i cant use my handclone from git ... emerge removed all sources. :(
*narf*


Okay ... hardcore way.
I clone the git manually (i have debug the correct commandline from the eclass ;) ) and run emerge after this.
now runs the building ;)
Back to top
View user's profile Send private message
Rion
Guru
Guru


Joined: 12 Oct 2006
Posts: 366
Location: Ekaterinburg, Russia

PostPosted: Mon Jul 05, 2010 7:06 am    Post subject: Reply with quote

>>> Emerging (22 of 22) dev-util/eric-5.0.0 from qting-edge
* eric5-5.0.0.tar.gz RMD160 SHA1 SHA256 size ;-) ... [ ok ]
* eric5-i18n-ru-5.0.0.tar.gz RMD160 SHA1 SHA256 size ;-) ... [ ok ]
* checking ebuild checksums ;-) ... [ ok ]
* checking auxfile checksums ;-) ... [ ok ]
* checking miscfile checksums ;-) ... [ ok ]
You should enable -g (or higher) for debugging!
* CPV: dev-util/eric-5.0.0
* REPO: qting-edge
* USE: amd64 elibc_glibc kernel_linux linguas_ru multilib spell userland_GNU
>>> Unpacking source...
>>> Unpacking eric5-5.0.0.tar.gz to /var/tmp/portage/dev-util/eric-5.0.0/work
>>> Unpacking eric5-i18n-ru-5.0.0.tar.gz to /var/tmp/portage/dev-util/eric-5.0.0/work
>>> Source unpacked in /var/tmp/portage/dev-util/eric-5.0.0/work
>>> Preparing source in /var/tmp/portage/dev-util/eric-5.0.0/work/eric5-5.0.0 ...
* Applying eric-5.0_no_interactive.patch ... [ ok ]
* Applying eric-5.0_remove_coverage.patch ... [ ok ]
>>> Source prepared.
>>> Configuring source in /var/tmp/portage/dev-util/eric-5.0.0/work/eric5-5.0.0 ...
>>> Source configured.
>>> Compiling source in /var/tmp/portage/dev-util/eric-5.0.0/work/eric5-5.0.0 ...
>>> Source compiled.
>>> Test phase [not enabled]: dev-util/eric-5.0.0

>>> Install eric-5.0.0 into /var/tmp/portage/dev-util/eric-5.0.0/image/ category dev-util
* Installation of dev-util/eric-5.0.0 with CPython 3.1...
Checking dependencies
Python Version: 3.1.2
Found PyQt
Found QScintilla2
Qt Version: 4.6.3
PyQt Version: 4.7.3
QScintilla Version: 2.4.3
All dependencies ok.

Compiling user interface files...

Installing eric5 ...
ACCESS DENIED open_wr: /usr/share/pixmaps/eric.png
An internal error occured. Please report all the output of the program,
including the following traceback, to eric5-bugs@eric-ide.python-projects.org.

Traceback (most recent call last):
File "install.py", line 811, in <module>
main(sys.argv)
File "install.py", line 769, in main
installEric()
File "install.py", line 414, in installEric
shutil.copy(os.path.join("eric", "icons", "default", "eric.png"), "/usr/share/pixmaps")
File "/usr/lib64/python3.1/shutil.py", line 106, in copy
copyfile(src, dst)
File "/usr/lib64/python3.1/shutil.py", line 68, in copyfile
fdst = open(dst, 'wb')
IOError: [Errno 13] Permission denied: '/usr/share/pixmaps/eric.png'
* ERROR: dev-util/eric-5.0.0 failed:
* Installation failed with CPython 3.1 in installation() function
*
* Call stack:
* ebuild.sh, line 48: Called src_install
* environment, line 4475: Called python_execute_function 'installation'
* environment, line 3232: Called die
* The specific snippet of code:
* die "${failure_message}";
*
* If you need support, post the output of 'emerge --info =dev-util/eric-5.0.0',
* the complete build log and the output of 'emerge -pqv =dev-util/eric-5.0.0'.
* This ebuild is from an overlay named 'qting-edge': '/var/lib/layman/qting-edge/'
* The complete build log is located at '/var/tmp/portage/dev-util/eric-5.0.0/temp/build.log'.
* The ebuild environment file is located at '/var/tmp/portage/dev-util/eric-5.0.0/temp/environment'.
* S: '/var/tmp/portage/dev-util/eric-5.0.0/work/eric5-5.0.0'
--------------------------- ACCESS VIOLATION SUMMARY ---------------------------
LOG FILE "/var/log/sandbox/sandbox-10907.log"

VERSION 1.0
FORMAT: F - Function called
FORMAT: S - Access Status
FORMAT: P - Path as passed to function
FORMAT: A - Absolute Path (not canonical)
FORMAT: R - Canonical Path
FORMAT: C - Command Line

F: open_wr
S: deny
P: /usr/share/pixmaps/eric.png
A: /usr/share/pixmaps/eric.png
R: /usr/share/pixmaps/eric.png
C: python3.1 install.py -z -b /usr/bin -i /var/tmp/portage/dev-util/eric-5.0.0/image/ -d /usr/lib64/python3.1/site-packages -c
--------------------------------------------------------------------------------

>>> Failed to emerge dev-util/eric-5.0.0, Log file:

>>> '/var/tmp/portage/dev-util/eric-5.0.0/temp/build.log'
_________________
~amd64
rion-overlay
Back to top
View user's profile Send private message
Hwoarang
Developer
Developer


Joined: 24 Feb 2007
Posts: 701
Location: Leeds, UK

PostPosted: Tue Jul 06, 2010 8:40 am    Post subject: Reply with quote

Could you please resync your clone and try again?
Back to top
View user's profile Send private message
Rion
Guru
Guru


Joined: 12 Oct 2006
Posts: 366
Location: Ekaterinburg, Russia

PostPosted: Tue Jul 06, 2010 9:34 am    Post subject: Reply with quote

yes it installs now but conflicts with eric4 on install (the same files)
_________________
~amd64
rion-overlay
Back to top
View user's profile Send private message
Rion
Guru
Guru


Joined: 12 Oct 2006
Posts: 366
Location: Ekaterinburg, Russia

PostPosted: Mon Jul 12, 2010 10:15 am    Post subject: Reply with quote

what about qt-creator-2.1 ?
_________________
~amd64
rion-overlay
Back to top
View user's profile Send private message
kernelOfTruth
Watchman
Watchman


Joined: 20 Dec 2005
Posts: 5681
Location: Vienna, Austria; Germany; hello world :)

PostPosted: Thu Aug 19, 2010 9:54 pm    Post subject: Reply with quote

SpectreDragon wrote:
Hwoarang wrote:
SpectreDragon wrote:
...

Sync again please

Maybe sure you enable glib use flag on qt-assistant if you have it enabled on qt-gui as well

thx, compiles without any problems now :)


didn't work for me :(

http://pastebin.com/CHZem3Gm

I tried to re-compile qt-core, qt-gui and qt-assistant with and without gtk & glib, but both times qt-assistant fails with the posted errors

help please :P
_________________
Unofficial minimal livecd x86/amd64 w/reiser4+truecrypt (by Neo2)
2.6.37.2_plus_v1: BFS, CFS,THP,compaction, zcache or TOI
Hardcore Linux user since 2004 :D
Back to top
View user's profile Send private message
Bluey_the_dog
n00b
n00b


Joined: 13 Oct 2002
Posts: 52
Location: Perth, Australia

PostPosted: Wed Aug 25, 2010 5:16 am    Post subject: Reply with quote

Quick question,
I've just added the qting-edge overlay and managed to get a whole lot of stuff to rebuild and show, via portage,

Code:
Latest version available: 4.7.0_beta2
Latest version installed: 4.7.0_beta2


Unfortunately an attempt to install qt-creator v2 results in:

Code:
emerge --search creator
...
...
...
dev-util/qt-creator
      Latest version available: 1.3.1-r1
      Latest version installed: 1.3.1-r1
      Size of files: 10,374 kB
      Homepage:      http://qt.nokia.com/products/developer-tools
      Description:   Lightweight IDE for C++ development centering around Qt
      License:       LGPL-2.1


Am I correct in thinking that the fact that other things build to 4.7.0_beta2, that qt-creator v2 should be available and that something is broken or have I done something wrong?

Andrew
Back to top
View user's profile Send private message
Lustmored
Apprentice
Apprentice


Joined: 28 May 2010
Posts: 204
Location: Poland

PostPosted: Wed Aug 25, 2010 10:30 am    Post subject: Reply with quote

Code:
* dev-util/qt-creator
    ::gentoo                  1.2.1 1.3.1-r1* {:0}
    ::qting-edge              (2.0.0)R(~) (2.0.9999)K (2.9999)K (9999)K {:0}


Just unmask it :)
Back to top
View user's profile Send private message
Bluey_the_dog
n00b
n00b


Joined: 13 Oct 2002
Posts: 52
Location: Perth, Australia

PostPosted: Mon Aug 30, 2010 12:47 pm    Post subject: Reply with quote

Thanks for that Lustmored. I know have QT 4.7 running. Next question now.

I'm trying to build Paraview V3.8 from the science overlay. The emerge is failing with the error:

Code:
CMake Error: The following variables are used in this project, but they are set to NOTFOUND.
Please set them or make sure they are set and tested correctly in the CMake files:
QT_QTASSISTANTCLIENT_INCLUDE_DIR (ADVANCED)
   used as include directory in directory /var/tmp/portage/sci-visualization/paraview-3.8.0/work/ParaView-3.8.0/Qt/ApplicationComponents


Does anyone have any ideas as to whether this is a QT error or a Paraview error? The only environment variable for QT that's currently defined is QT_PLUGIN_PATH. Should there be others? After I've emerged QT, using the command:

Code:
emerge -av1 $(eix -I --only-names x11-libs/qt-)


as outlined in http://www.linuxized.com/2010/05/qt-4-7-beta-1-in-qting-edge-gentoo-overlay/ are there any other things I need to do?

Any thoughts greatly appreciated.
Back to top
View user's profile Send private message
Bluey_the_dog
n00b
n00b


Joined: 13 Oct 2002
Posts: 52
Location: Perth, Australia

PostPosted: Wed Sep 01, 2010 12:34 pm    Post subject: Reply with quote

In answer to my post above, it looks like at the moment Paraview does not build under QT 4.7 that is unless something has accidentally been left out of the QT 4.7 ebuild.

Hwoarang, is there any chance you could have a quick look at the following bug, http://bugs.gentoo.org/show_bug.cgi?id=317345 where the maintainer lists some files that Paraview needs and confirm that they don't actually exist under QT 4.7?

Andrew
Back to top
View user's profile Send private message
fb
l33t
l33t


Joined: 08 Dec 2003
Posts: 631
Location: New Zealand

PostPosted: Wed Sep 01, 2010 11:54 pm    Post subject: Reply with quote

Bluey_the_dog wrote:
In answer to my post above, it looks like at the moment Paraview does not build under QT 4.7 that is unless something has accidentally been left out of the QT 4.7 ebuild.

Hwoarang, is there any chance you could have a quick look at the following bug, http://bugs.gentoo.org/show_bug.cgi?id=317345 where the maintainer lists some files that Paraview needs and confirm that they don't actually exist under QT 4.7?

Andrew

Hi,

I guess i'll pipe in directly. Like I said in the bug, from the look of things, in cmake-2.8.1 the FindQt4.cmake file looks for qt-assistant headers
files:
Code:
   # Set QT_QTASSISTANT_INCLUDE_DIR
  FIND_PATH(QT_QTASSISTANT_INCLUDE_DIR QtAssistant
    PATHS
    ${QT_HEADERS_DIR}/QtAssistant
    ${QT_LIBRARY_DIR}/QtAssistant.framework/Headers
    NO_DEFAULT_PATH
    )

And Andrew doesn't have any of the following files when compared to version 4.6.2
Code:
/usr/include/qt4/QtAssistant
/usr/include/qt4/QtAssistant/QAssistantClient
/usr/include/qt4/QtAssistant/QtAssistant
/usr/include/qt4/QtAssistant/qassistantclient.h
/usr/include/qt4/QtAssistant/qassistantclient_global.h
/usr/lib/pkgconfig/QtAssistantClient.pc

Which means that QT_QTASSISTANT_INCLUDE_DIR is set to "not found" and rightly so.
If these files have indeed gone from qt-4.7 is there a page about what to do to migrate code?

Francois
Back to top
View user's profile Send private message
fb
l33t
l33t


Joined: 08 Dec 2003
Posts: 631
Location: New Zealand

PostPosted: Thu Sep 02, 2010 2:00 am    Post subject: Reply with quote

Looks like paraview and probably a few other packages will need this:
http://labs.trolltech.com/blogs/2010/06/22/qt-assistant-compat-version-available-as-extra-source-package/
Hopefully one day apps will migrate to the new help system.
Back to top
View user's profile Send private message
Bluey_the_dog
n00b
n00b


Joined: 13 Oct 2002
Posts: 52
Location: Perth, Australia

PostPosted: Mon Sep 06, 2010 3:00 am    Post subject: Reply with quote

I'm looking for a bit of advice relative to QT 4.7. I'm about to start work on an app, which uses QT and am using another app as a starting point. This other app is currently based upon QT 4.7. As a part of the other app, which I have to build from source, there is the QT Property Browser. My build instructions tell me to, amongst other things:

Quote:
Extract the tar.gz in the same directory where Qt is installed:
cd ~/opt
tar xfv qtpropertybrowser-2.5_1-opensource.tar.gz


This assumes QT has been installed in ~/opt and not the way that Gentoo does, which is where my problem lies. Just where does Gentoo install the source for QT so that I can install the property browser source? Does portage just uncompress the source, build QT then delete the source or is it hidden away somewhere that I can find and place the property browser source into?

Sorry if this isn't very QT 4.7 specific, so if anyone knows of a more appropriate forum/list etc please feel free to let me know.

Any thoughts greatly appreciated.

Andrew
Back to top
View user's profile Send private message
fb
l33t
l33t


Joined: 08 Dec 2003
Posts: 631
Location: New Zealand

PostPosted: Mon Sep 06, 2010 4:02 am    Post subject: Reply with quote

Bluey_the_dog wrote:
I'm looking for a bit of advice relative to QT 4.7. I'm about to start work on an app, which uses QT and am using another app as a starting point. This other app is currently based upon QT 4.7. As a part of the other app, which I have to build from source, there is the QT Property Browser. My build instructions tell me to, amongst other things:

Quote:
Extract the tar.gz in the same directory where Qt is installed:
cd ~/opt
tar xfv qtpropertybrowser-2.5_1-opensource.tar.gz


This assumes QT has been installed in ~/opt and not the way that Gentoo does, which is where my problem lies. Just where does Gentoo install the source for QT so that I can install the property browser source? Does portage just uncompress the source, build QT then delete the source or is it hidden away somewhere that I can find and place the property browser source into?

Sorry if this isn't very QT 4.7 specific, so if anyone knows of a more appropriate forum/list etc please feel free to let me know.

Any thoughts greatly appreciated.

Andrew

Hi Andrew,

technically your instructions don't mention the sources. It would be very unusual for an app. to require the source of a library.
It however probably assumes that everything resides under $SOMEPATH/qt4 and makes this assumption to find the headers (/usr/include/qt4 )
the libraries (/usr/lib(64)/qt4 ) and qmake (/usr/bin/qmake). Without the sources of the app in question it is a bit hard to decide what to do.
What is the build system? Probably a kind of simple Makefile. The headers probably can be patched or you can add -I/usr/include/qt4 and
so on.

I am curious can you point us to the source in question?

Francois
Back to top
View user's profile Send private message
Bluey_the_dog
n00b
n00b


Joined: 13 Oct 2002
Posts: 52
Location: Perth, Australia

PostPosted: Mon Sep 06, 2010 5:02 am    Post subject: Reply with quote

Francois,
Thanks for your reply. The background to this is that there is firstly QT. Then in turn an application I can't name, sort of NDA type of thing, is build upon QT then in turn again, my application is built upon the unnamed app. I've been given build instructions for the unnamed app which are below:

Code:
Qt:

1. Download the Qt 4.7 Beta 2 (or later) tar.gz source package from:
   http://qt.nokia.com/developer/qt-qtcreator-prerelease#download
   -> Qt 4.7.0 Beta 2: Source (.tar.gz, 192 MB)

2. Extract the source package, for example in ~/opt:
   cd ~/opt
   tar xfv qt-everywhere-opensource-src-4.7.0-beta2.tar.gz

3. Optional: create a link from installation dir to src dir to
   avoid duplication of Qt files when installing Qt:
   ln -s ~/opt/qt-everywhere-opensource-src-4.7.0-beta2 ~/local/qt

4. Configure Qt:
   cd ~/opt/qt-everywhere-opensource-src-4.7.0-beta2
   ./configure -fast -opensource -debug-and-release -no-qt3support -prefix ~/local/qt -confirm-license

5. Build Qt
   (add -jX to make for X threads,
    e.g. -j8 to compile with 8 threads,
    typically on a machine with a quad core processor with hyper-threading):
   make -j8

6. Install Qt (only necessary if no link was created in step 3)

7. Set QTDIR and PATH environment, so Qt tools can be found:
   vim ~/.bashrc
   export QTDIR=$HOME/opt/qt-everywhere-opensource-src-4.7.0-beta2
   export PATH=$PATH:$QTDIR/bin
   . ~/.bashrc

Qt Property Browser:

1. Download the Qt Property Browser solution from:
   http://qt.nokia.com/products/appdev/add-on-products/catalog/4/Widgets/qtpropertybrowser/
   or directly from:
   http://get.qt.nokia.com/qt/solutions/lgpl/qtpropertybrowser-2.5_1-opensource.tar.gz

2. Extract the tar.gz in the same directory where Qt is installed:
   cd ~/opt
   tar xfv qtpropertybrowser-2.5_1-opensource.tar.gz

3. Do NOT attempt to compile the Qt Property Browser, it will be compiled as part
   of [i]PRODUCT I CAN'T MENTION[/i]


There are then more steps to do with the QT script generator, http://qt.gitorious.org/qt-labs/qtscriptgenerator, and then the actual building of the unnamed app, with its source also installed under ~/opt. The unnamed app is built, like the others, with the command:

Code:
qmake && make


When I enter this command I get the error:

Code:
Project ERROR: Qt Property Browser Module not found in /../


I've done as the build instructions asked and installed qtpropertybrowser. I would assume the problem arises due to Gentoo "hiding the source" from the "general user", whereas I'm a developer, admittedly new to QT though, and need things more "exposed".

Any thoughts greatly appreciated.

Andrew

p.s. Francois, I see from your "signature" you're in New Zealand. I take it you're not in Christchurch!!!!!
Back to top
View user's profile Send private message
fb
l33t
l33t


Joined: 08 Dec 2003
Posts: 631
Location: New Zealand

PostPosted: Mon Sep 06, 2010 7:24 am    Post subject: Reply with quote

Indeed I am not in Christchurch - I am in Palmerston North [North island, Christchurch is around the middle of the South island].
Your error message suggest you have unpacked your qtpropertybrowser in the wrong place, probably one level up or down what it
should be. My guess.

Of course it looks like for what you are doing you may need Qt source code. Unless you are customizing Qt this is usually regarded
as a bad idea (tm), not your idea I would guess. Gentoo doesn't install the sources as far as I know. Very few ebuilds, outside of the kernel,
actually install their sources.
Back to top
View user's profile Send private message
bers
n00b
n00b


Joined: 28 Nov 2008
Posts: 49

PostPosted: Mon Sep 13, 2010 5:32 pm    Post subject: can't compile qt-gui-4.7.0_rc1 Reply with quote

emerge qt-gui-4.7.0_rc1
---------

In file included from ../../include/QtGui/private/qpaintengineex_p.h:2,
from ../../include/QtGui/private/../../../src/gui/painting/qpaintengine_raster_p.h:57,
from ../../include/QtGui/private/qpaintengine_raster_p.h:2,
from ../../include/QtGui/private/../../../src/gui/painting/qdrawhelper_mmx_p.h:59,
from ../../include/QtGui/private/qdrawhelper_mmx_p.h:2,
from painting/qdrawhelper_mmx3dnow.cpp:47:
../../include/QtGui/private/../../../src/gui/painting/qpaintengineex_p.h:200: ошибка: expected unqualified-id before ‘*’ token
../../include/QtGui/private/../../../src/gui/painting/qpaintengineex_p.h:200: ошибка: expected ‘)’ before ‘*’ token
../../include/QtGui/private/../../../src/gui/painting/qpaintengineex_p.h:200: ошибка: expected ‘;’ before ‘*’ token
In file included from ../../include/QtGui/private/qpaintengineex_p.h:2,
from ../../include/QtGui/private/../../../src/gui/painting/qpaintengine_raster_p.h:57,
from ../../include/QtGui/private/qpaintengine_raster_p.h:2,
from ../../include/QtGui/private/../../../src/gui/painting/qdrawhelper_mmx_p.h:59,
from ../../include/QtGui/private/qdrawhelper_mmx_p.h:2,
from painting/qdrawhelper_mmx.cpp:47:
../../include/QtGui/private/../../../src/gui/painting/qpaintengineex_p.h:200: ошибка: expected unqualified-id before ‘*’ token
../../include/QtGui/private/../../../src/gui/painting/qpaintengineex_p.h:200: ошибка: expected ‘)’ before ‘*’ token
../../include/QtGui/private/../../../src/gui/painting/qpaintengineex_p.h:200: ошибка: expected ‘;’ before ‘*’ token
make: *** [.obj/release-shared/qdrawhelper_mmx3dnow.o] Ошибка 1
make: *** Ожидание завершения заданий...
make: *** [.obj/release-shared/qdrawhelper_mmx.o] Ошибка 1
In file included from ../../include/QtGui/private/qpaintengineex_p.h:2,
from ../../include/QtGui/private/../../../src/gui/painting/qpaintengine_raster_p.h:57,
from ../../include/QtGui/private/qpaintengine_raster_p.h:2,
from ../../include/QtGui/private/../../../src/gui/painting/qdrawhelper_mmx_p.h:59,
from ../../include/QtGui/private/qdrawhelper_mmx_p.h:2,
from ../../include/QtGui/private/../../../src/gui/painting/qdrawhelper_sse_p.h:57,
from ../../include/QtGui/private/qdrawhelper_sse_p.h:2,
from painting/qdrawhelper_sse3dnow.cpp:47:
../../include/QtGui/private/../../../src/gui/painting/qpaintengineex_p.h:200: ошибка: expected unqualified-id before ‘*’ token
../../include/QtGui/private/../../../src/gui/painting/qpaintengineex_p.h:200: ошибка: expected ‘)’ before ‘*’ token
../../include/QtGui/private/../../../src/gui/painting/qpaintengineex_p.h:200: ошибка: expected ‘;’ before ‘*’ token
make: *** [.obj/release-shared/qdrawhelper_sse3dnow.o] Ошибка 1
emake failed
Back to top
View user's profile Send private message
kernelOfTruth
Watchman
Watchman


Joined: 20 Dec 2005
Posts: 5681
Location: Vienna, Austria; Germany; hello world :)

PostPosted: Tue Sep 14, 2010 3:58 pm    Post subject: Reply with quote

why is upstream taking so long to implement functionality which the competition already has since ages ?

there's still no functionality to print separate pages along with page-ranges (see acrobat reader) :evil:

(afaik there's already a bug-entry)


I couldn't get 4.7.0_rc1* builds to work - fortunately 4.7.9999* worked fine for me

thanks for providing these ebuilds ! :)
_________________
Unofficial minimal livecd x86/amd64 w/reiser4+truecrypt (by Neo2)
2.6.37.2_plus_v1: BFS, CFS,THP,compaction, zcache or TOI
Hardcore Linux user since 2004 :D
Back to top
View user's profile Send private message
Lustmored
Apprentice
Apprentice


Joined: 28 May 2010
Posts: 204
Location: Poland

PostPosted: Mon Sep 20, 2010 10:38 am    Post subject: Reply with quote

qt-gui-4.7.0_rc1 fails with egl flag here (amd64):

fail wrote:
egl/qegl.cpp: In static member function 'static void QEglContextTracker::deref()':
egl/qegl.cpp:67:41: error: 'eglTerminate' was not declared in this scope
egl/qegl.cpp: In constructor 'QEglContext::QEglContext()':
egl/qegl.cpp:91:11: error: 'EGL_NO_CONTEXT' was not declared in this scope
egl/qegl.cpp:93:22: error: 'EGL_NO_SURFACE' was not declared in this scope
egl/qegl.cpp: In member function 'bool QEglContext::isValid() const':
egl/qegl.cpp:114:20: error: 'EGL_NO_CONTEXT' was not declared in this scope
egl/qegl.cpp: In function 'EGLConfig QEgl::defaultConfig(int, QEgl::API, QEgl::ConfigOptions)':
egl/qegl.cpp:215:13: error: 'EGL_CONFIG_ID' was not declared in this scope
egl/qegl.cpp:219:77: error: 'eglChooseConfig' was not declared in this scope
egl/qegl.cpp:231:27: error: 'EGL_WINDOW_BIT' was not declared in this scope
egl/qegl.cpp:234:27: error: 'EGL_PIXMAP_BIT' was not declared in this scope
egl/qegl.cpp:237:27: error: 'EGL_PBUFFER_BIT' was not declared in this scope
egl/qegl.cpp:249:28: error: 'EGL_SURFACE_TYPE' was not declared in this scope
egl/qegl.cpp:263:32: error: 'EGL_ALPHA_MASK_SIZE' was not declared in this scope
egl/qegl.cpp:267:32: error: 'EGL_STENCIL_SIZE' was not declared in this scope
egl/qegl.cpp:268:32: error: 'EGL_SAMPLE_BUFFERS' was not declared in this scope
egl/qegl.cpp:271:32: error: 'EGL_DEPTH_SIZE' was not declared in this scope
egl/qegl.cpp:276:32: error: 'EGL_ALPHA_SIZE' was not declared in this scope
egl/qegl.cpp: In function 'EGLConfig QEgl::chooseConfig(const QEglProperties*, QEgl::PixelFormatMatch)':
egl/qegl.cpp:292:70: error: 'eglChooseConfig' was not declared in this scope
egl/qegl.cpp:298:78: error: 'eglChooseConfig' was not declared in this scope
egl/qegl.cpp:308:80: error: 'eglChooseConfig' was not declared in this scope
egl/qegl.cpp:311:59: error: 'EGL_RED_SIZE' was not declared in this scope
egl/qegl.cpp:311:77: error: 'eglGetConfigAttrib' was not declared in this scope
egl/qegl.cpp:312:59: error: 'EGL_GREEN_SIZE' was not declared in this scope
egl/qegl.cpp:313:59: error: 'EGL_BLUE_SIZE' was not declared in this scope
egl/qegl.cpp:314:59: error: 'EGL_ALPHA_SIZE' was not declared in this scope
egl/qegl.cpp: In member function 'bool QEglContext::createContext(QEglContext*, const QEglProperties*)':
egl/qegl.cpp:385:46: error: 'EGL_NO_CONTEXT' was not declared in this scope
egl/qegl.cpp:388:98: error: 'eglCreateContext' was not declared in this scope
egl/qegl.cpp:389:20: error: 'EGL_NO_CONTEXT' was not declared in this scope
egl/qegl.cpp:396:16: error: 'EGL_NO_CONTEXT' was not declared in this scope
egl/qegl.cpp:397:76: error: 'eglCreateContext' was not declared in this scope
egl/qegl.cpp: In member function 'void QEglContext::destroySurface(EGLSurface)':
egl/qegl.cpp:410:20: error: 'EGL_NO_SURFACE' was not declared in this scope
egl/qegl.cpp:413:45: error: 'eglDestroySurface' was not declared in this scope
egl/qegl.cpp: In member function 'void QEglContext::destroyContext()':
egl/qegl.cpp:420:16: error: 'EGL_NO_CONTEXT' was not declared in this scope
egl/qegl.cpp:421:41: error: 'eglDestroyContext' was not declared in this scope
egl/qegl.cpp:422:11: error: 'EGL_NO_CONTEXT' was not declared in this scope
egl/qegl.cpp: In member function 'bool QEglContext::makeCurrent(EGLSurface)':
egl/qegl.cpp:428:16: error: 'EGL_NO_CONTEXT' was not declared in this scope
egl/qegl.cpp:433:20: error: 'EGL_NO_SURFACE' was not declared in this scope
egl/qegl.cpp:461:68: error: 'eglMakeCurrent' was not declared in this scope
egl/qegl.cpp: In member function 'bool QEglContext::doneCurrent()':
egl/qegl.cpp:471:16: error: 'EGL_NO_CONTEXT' was not declared in this scope
egl/qegl.cpp:475:22: error: 'EGL_NO_SURFACE' was not declared in this scope
egl/qegl.cpp:490:79: error: 'EGL_NO_CONTEXT' was not declared in this scope
egl/qegl.cpp:490:93: error: 'eglMakeCurrent' was not declared in this scope
egl/qegl.cpp: In member function 'bool QEglContext::swapBuffers(EGLSurface)':
egl/qegl.cpp:509:15: error: 'EGL_NO_CONTEXT' was not declared in this scope
egl/qegl.cpp:512:54: error: 'eglSwapBuffers' was not declared in this scope
egl/qegl.cpp: In member function 'int QEglContext::configAttrib(int) const':
egl/qegl.cpp:546:79: error: 'eglGetConfigAttrib' was not declared in this scope
egl/qegl.cpp:550:16: error: 'EGL_DONT_CARE' was not declared in this scope
egl/qegl.cpp: In function 'EGLDisplay QEgl::display()':
egl/qegl.cpp:566:29: error: 'EGL_NO_DISPLAY' was not declared in this scope
egl/qegl.cpp:568:44: error: 'eglGetDisplay' was not declared in this scope
egl/qegl.cpp:572:54: error: 'EGL_DEFAULT_DISPLAY' was not declared in this scope
egl/qegl.cpp:579:43: error: 'eglInitialize' was not declared in this scope
egl/qegl.cpp:587:94: error: 'eglGetProcAddress' was not declared in this scope
egl/qegl.cpp:593:115: error: 'eglGetProcAddress' was not declared in this scope
egl/qegl.cpp: In function 'void QEgl::dumpAllConfigs()':
egl/qegl.cpp:712:47: error: 'eglGetConfigs' was not declared in this scope
egl/qegl.cpp:715:52: error: 'eglGetConfigs' was not declared in this scope
egl/qegl.cpp: In function 'QString QEgl::extensions()':
egl/qegl.cpp:725:56: error: 'EGL_EXTENSIONS' was not declared in this scope
egl/qegl.cpp:725:70: error: 'eglQueryString' was not declared in this scope
egl/qegl.cpp: In function 'bool QEgl::hasExtension(const char*)':
egl/qegl.cpp:733:46: error: 'EGL_EXTENSIONS' was not declared in this scope
egl/qegl.cpp:733:60: error: 'eglQueryString' was not declared in this scope
egl/qegl.cpp: In member function 'int QEglContext::configAttrib(int) const':
egl/qegl.cpp:551:1: warning: control reaches end of non-void function
egl/qegl.cpp: In member function 'bool QEglContext::isValid() const':
egl/qegl.cpp:115:1: warning: control reaches end of non-void function
make: *** [.obj/release-shared/qegl.o] Error 1
make: *** Waiting for unfinished jobs....
/usr/libexec/paludis/utils/emake: emake returned error 2
Back to top
View user's profile Send private message
widremann
Veteran
Veteran


Joined: 14 Mar 2005
Posts: 1314

PostPosted: Thu Sep 23, 2010 2:48 pm    Post subject: Reply with quote

qt-gui-4.7.0 is not building for me and searching here, bugs.g.o and google does not reveal anything:

Code:

x86_64-pc-linux-gnu-g++ -c -O2 -pipe -fomit-frame-pointer -march=native -mtune=native -pipe -msse4.1 -I/usr/include/glib-2.0 -I/usr/lib64/glib-2.0/include -I/usr/include/freetype2 -pthread -I/usr/include/glib-2.0 -I/usr/lib64/glib-2.0/include -pthread -DQT_SHARED -I/usr/include/gtk-2.0 -I/usr/lib64/gtk-2.0/include -I/usr/include/atk-1.0 -I/usr/include/cairo -I/usr/include/pango-1.0 -I/usr/include/glib-2.0 -I/usr/lib64/glib-2.0/include -I/usr/include/pixman-1 -I/usr/include/freetype2 -I/usr/include/libpng14 -I/usr/include/qt4 -I/usr/include/qt4/QtGui -I/usr/include/libdrm -I/usr/include/qt4/QtCore -fvisibility=hidden -fvisibility-inlines-hidden -Wall -W -D_REENTRANT -I/usr/include/freetype2 -fPIC -DQT_SHARED -DQT_BUILD_GUI_LIB -DQT_NO_USING_NAMESPACE -DQT_NO_CAST_TO_ASCII -DQT_ASCII_CAST_WARNINGS -DQT3_SUPPORT -DQT_MOC_COMPAT -DQT_USE_FAST_OPERATOR_PLUS -DQT_USE_FAST_CONCATENATION -DQT_HAVE_MMX -DQT_HAVE_3DNOW -DQT_HAVE_SSE -DQT_HAVE_MMXEXT -DQT_HAVE_SSE2 -DQT_NO_OPENTYPE -DQT_NO_STYLE_MAC -DQT_NO_STYLE_WINDOWSVISTA -DQT_NO_STYLE_WINDOWSXP -DQT_NO_STYLE_WINDOWSCE -DQT_NO_STYLE_WINDOWSMOBILE -DQT_NO_STYLE_S60 -DQ_INTERNAL_QAPP_SRC -DQT_NO_DEBUG -DQT_CORE_LIB -D_LARGEFILE64_SOURCE -D_LARGEFILE_SOURCE -I../../mkspecs/linux-g++ -I. -I../../include/QtCore -I../../include -I../../include/QtGui -I.rcc/release-shared -I../3rdparty/xorg -Iimage -I/usr/include/freetype2 -I../3rdparty/harfbuzz/src -Idialogs -I.moc/release-shared -I/usr/X11R6/include -I.uic/release-shared -o .obj/release-shared/qwidget.o kernel/qwidget.cpp
kernel/qwidget.cpp:175: error: 'QWidgetBackingStoreTracker' has not been declared
kernel/qwidget.cpp:175: error: ISO C++ forbids declaration of 'QWidgetBackingStoreTracker' with no type
kernel/qwidget.cpp: In function 'int QWidgetBackingStoreTracker()':
kernel/qwidget.cpp:176: error: only constructors take base initializers
kernel/qwidget.cpp:179: warning: no return statement in function returning non-void
kernel/qwidget.cpp: At global scope:
kernel/qwidget.cpp:181: error: expected constructor, destructor, or type conversion before '::' token
kernel/qwidget.cpp:192: error: 'QWidgetBackingStoreTracker' is not a class or namespace
kernel/qwidget.cpp: In function 'void create(QWidget*)':
kernel/qwidget.cpp:194: error: 'destroy' was not declared in this scope
kernel/qwidget.cpp:195: error: 'm_ptr' was not declared in this scope
kernel/qwidget.cpp: At global scope:
kernel/qwidget.cpp:203: error: 'QWidgetBackingStoreTracker' is not a class or namespace
kernel/qwidget.cpp: In function 'void destroy()':
kernel/qwidget.cpp:205: error: 'm_ptr' was not declared in this scope
kernel/qwidget.cpp:207: error: 'm_widgets' was not declared in this scope
kernel/qwidget.cpp: At global scope:
kernel/qwidget.cpp:215: error: 'QWidgetBackingStoreTracker' is not a class or namespace
kernel/qwidget.cpp: In function 'void registerWidget(QWidget*)':
kernel/qwidget.cpp:220: error: 'm_widgets' was not declared in this scope
kernel/qwidget.cpp: At global scope:
kernel/qwidget.cpp:230: error: 'QWidgetBackingStoreTracker' is not a class or namespace
kernel/qwidget.cpp: In function 'void unregisterWidget(QWidget*)':
kernel/qwidget.cpp:232: error: 'm_widgets' was not declared in this scope
kernel/qwidget.cpp:233: error: 'm_ptr' was not declared in this scope


emerge --info:
Code:

Portage 2.2_rc86 (default/linux/amd64/10.0/desktop, gcc-4.4.4, glibc-2.12.1-r1, 2.6.35-gentoo-kms x86_64)
=================================================================
System uname: Linux-2.6.35-gentoo-kms-x86_64-Intel-R-_Core-TM-2_Duo_CPU_T9600_@_2.80GHz-with-gentoo-2.0.1
Timestamp of tree: Thu, 23 Sep 2010 13:15:01 +0000
app-shells/bash:     4.1_p7
dev-java/java-config: 2.1.11
dev-lang/python:     2.6.5-r3, 3.1.2-r4
dev-util/cmake:      2.8.1-r2
sys-apps/baselayout: 2.0.1
sys-apps/openrc:     0.6.3
sys-apps/sandbox:    2.3-r1
sys-devel/autoconf:  2.13, 2.67
sys-devel/automake:  1.8.5-r4, 1.9.6-r3, 1.10.3, 1.11.1
sys-devel/binutils:  2.20.1-r1
sys-devel/gcc:       4.4.4-r2
sys-devel/gcc-config: 1.4.1
sys-devel/libtool:   2.2.10
sys-devel/make:      3.81-r2
virtual/os-headers:  2.6.35 (sys-kernel/linux-headers)
ACCEPT_KEYWORDS="amd64 ~amd64"
ACCEPT_LICENSE="*"
CBUILD="x86_64-pc-linux-gnu"
CFLAGS="-O2 -pipe -fomit-frame-pointer -march=native -mtune=native -pipe -msse4.1"
CHOST="x86_64-pc-linux-gnu"
CONFIG_PROTECT="/etc /usr/share/X11/xkb /usr/share/config"
CONFIG_PROTECT_MASK="/etc/ca-certificates.conf /etc/env.d /etc/env.d/java/ /etc/fonts/fonts.conf /etc/gconf /etc/gentoo-release /etc/revdep-rebuild /etc/sandbox.d /etc/terminfo"
CXXFLAGS="-O2 -pipe -fomit-frame-pointer -march=native -mtune=native -pipe -msse4.1"
DISTDIR="/usr/portage/distfiles"
EMERGE_DEFAULT_OPTS="--with-bdeps=y"
FEATURES="assume-digests distlocks fixlafiles fixpackages news parallel-fetch preserve-libs protect-owned sandbox sfperms strict unknown-features-warn unmerge-logs unmerge-orphans userfetch"
GENTOO_MIRRORS="ftp://ftp.gtlib.gatech.edu/pub/gentoo http://gentoo.osuosl.org/ ftp://mirror.datapipe.net/gentoo"
LDFLAGS="-Wl,-O1 -Wl,--as-needed"
PKGDIR="/usr/portage/packages"
PORTAGE_CONFIGROOT="/"
PORTAGE_RSYNC_OPTS="--recursive --links --safe-links --perms --times --compress --force --whole-file --delete --stats --timeout=180 --exclude=/distfiles --exclude=/local --exclude=/packages"
PORTAGE_TMPDIR="/var/tmp"
PORTDIR="/usr/portage"
PORTDIR_OVERLAY="/var/lib/layman/qting-edge /var/lib/layman/desktop-effects /var/lib/layman/kde /usr/local/portage"
SYNC="rsync://rsync.namerica.gentoo.org/gentoo-portage"
USE="X a52 aac aalib acl acpi aim alsa amd64 berkdb bluetooth branding bzip2 cairo cdr cli consolekit cracklib crypt custom-cflags cxx dbus dri dts dvd dvdr emboss encode exif fam fbcon fbcondecor ffmpeg firefox flac fontconfig fortran gdbm gif git gpm gtk hal iconv ieee1394 ipv6 java6 jpeg kde laptop lcms ldap libnotify lm_sensors mad mikmod mmx mng modules mp3 mp4 mpeg mplayer msn mudflap multilib ncurses networkmanager nls nptl nptlonly nsplugin ogg opengl openmp oscar pam pango pcre pdf perl png ppds pppd python qt qt3 qt3support qt4 qtscript readline reflection samba sdl session spell sse sse2 sse3 ssl startup-notification svg sysfs tcpd tiff truetype unicode usb vorbis wifi x264 xcb xcomposite xinerama xml xorg xulrunner xv xvid zeroconf zlib" ALSA_CARDS="ali5451 als4000 atiixp atiixp-modem bt87x ca0106 cmipci emu10k1x ens1370 ens1371 es1938 es1968 fm801 hda-intel intel8x0 intel8x0m maestro3 trident usb-audio via82xx via82xx-modem ymfpci" ALSA_PCM_PLUGINS="adpcm alaw asym copy dmix dshare dsnoop empty extplug file hooks iec958 ioplug ladspa lfloat linear meter mmap_emul mulaw multi null plug rate route share shm softvol" APACHE2_MODULES="actions alias auth_basic authn_alias authn_anon authn_dbm authn_default authn_file authz_dbm authz_default authz_groupfile authz_host authz_owner authz_user autoindex cache cgi cgid dav dav_fs dav_lock deflate dir disk_cache env expires ext_filter file_cache filter headers include info log_config logio mem_cache mime mime_magic negotiation rewrite setenvif speling status unique_id userdir usertrack vhost_alias" ELIBC="glibc" INPUT_DEVICES="evdev keyboard mouse synaptics" KERNEL="linux" LCD_DEVICES="bayrad cfontz cfontz633 glk hd44780 lb216 lcdm001 mtxorb ncurses text" RUBY_TARGETS="ruby18" USERLAND="GNU" VIDEO_CARDS="intel vesa radeon" XTABLES_ADDONS="quota2 psd pknock lscan length2 ipv4options ipset ipp2p iface geoip fuzzy condition tee tarpit sysrq steal rawnat logmark ipmark dhcpmac delude chaos account"
Unset:  CPPFLAGS, CTARGET, FFLAGS, INSTALL_MASK, LANG, LC_ALL, LINGUAS, MAKEOPTS, PORTAGE_BUNZIP2_COMMAND, PORTAGE_COMPRESS, PORTAGE_COMPRESS_FLAGS, PORTAGE_RSYNC_EXTRA_OPTS
Back to top
View user's profile Send private message
firephoto
Veteran
Veteran


Joined: 29 Oct 2003
Posts: 1560
Location: +48° 5' 23.40", -119° 48' 30.00"

PostPosted: Thu Sep 23, 2010 3:50 pm    Post subject: Reply with quote

I see you have both qt4 and cairo use flags so if you have +qt4 on cairo-1.10 it's most likely the cause of qt-gui not building.

Bug here. http://bugs.gentoo.org/show_bug.cgi?id=336801
_________________
#gentoo-kde on freenode
Back to top
View user's profile Send private message
kernelOfTruth
Watchman
Watchman


Joined: 20 Dec 2005
Posts: 5681
Location: Vienna, Austria; Germany; hello world :)

PostPosted: Thu Sep 23, 2010 4:25 pm    Post subject: Reply with quote

ok, well so qt-assistant is still failing for me with the pre-packaged source-builds (say: all non-9999 git stuff):

it builds with stable-branch and -stable-branch so the provided packages from qt seem to miss something

I tried to build it with pretty trimmed-down C-/CXX- and LDFLAGS but it still fails:

Code:
FEATURES="-sandbox -usersandbox" CFLAGS="-O2 -march=core2 -mtune=core2 -pipe" CXXFLAGS="${CFLAGS}" emerge qt-core qt-sql qt-script qt-test qt-xmlpatterns qt-gui qt-qt3support qt-svg qt-opengl qt-multimedia qt-dbus qt-webkit qt-declarative qt-assistant -1


LDFLAGS are the one provided by portage (as-needed; O1)

I'm pretty confident that it built with those exact flags for the qt 4.7.9999 builds with or without stable-branch

just to confirm it I'll let it re-compile it through all those packages ...

what is the following BS error message supposed to say ?
Quote:
/var/tmp/portage/x11-libs/qt-assistant-4.7.0/work/qt-everywhere-opensource-src-4.7.0/doc/src/declarative/qml-intro.qdoc:62: Cannot find example file 'doc/src/snippets/declarative/qml-intro/basic-syntax.qml'
/var/tmp/portage/x11-libs/qt-assistant-4.7.0/work/qt-everywhere-opensource-src-4.7.0/doc/src/declarative/qml-intro.qdoc:62: Unexpected '\snippet (//! [basic syntax])'
/var/tmp/portage/x11-libs/qt-assistant-4.7.0/work/qt-everywhere-opensource-src-4.7.0/doc/src/declarative/qml-intro.qdoc:85: Cannot find example file 'doc/src/snippets/declarative/qml-intro/rectangle.qml'
/var/tmp/portage/x11-libs/qt-assistant-4.7.0/work/qt-everywhere-opensource-src-4.7.0/doc/src/declarative/qml-intro.qdoc:116: Cannot find example file 'doc/src/snippets/declarative/qml-intro/hello-world1.qml'
/var/tmp/portage/x11-libs/qt-assistant-4.7.0/work/qt-everywhere-opensource-src-4.7.0/doc/src/declarative/qml-intro.qdoc:131: Cannot find example file 'doc/src/snippets/declarative/qml-intro/hello-world2.qml'
/var/tmp/portage/x11-libs/qt-assistant-4.7.0/work/qt-everywhere-opensource-src-4.7.0/doc/src/declarative/qml-intro.qdoc:131: Unexpected '\snippet (//! [updated text])'
/var/tmp/portage/x11-libs/qt-assistant-4.7.0/work/qt-everywhere-opensource-src-4.7.0/doc/src/declarative/qml-intro.qdoc:142: Cannot find example file 'doc/src/snippets/declarative/qml-intro/hello-world3.qml'
/var/tmp/portage/x11-libs/qt-assistant-4.7.0/work/qt-everywhere-opensource-src-4.7.0/doc/src/declarative/qml-intro.qdoc:142: Unexpected '\snippet (//! [updated text])'
/var/tmp/portage/x11-libs/qt-assistant-4.7.0/work/qt-everywhere-opensource-src-4.7.0/doc/src/declarative/qml-intro.qdoc:160: Cannot find example file 'doc/src/snippets/declarative/qml-intro/hello-world4.qml'
/var/tmp/portage/x11-libs/qt-assistant-4.7.0/work/qt-everywhere-opensource-src-4.7.0/doc/src/declarative/qml-intro.qdoc:160: Unexpected '\snippet (//! [added an image])'
/var/tmp/portage/x11-libs/qt-assistant-4.7.0/work/qt-everywhere-opensource-src-4.7.0/doc/src/declarative/qml-intro.qdoc:171: Cannot find example file 'doc/src/snippets/declarative/qml-intro/hello-world5.qml'
/var/tmp/portage/x11-libs/qt-assistant-4.7.0/work/qt-everywhere-opensource-src-4.7.0/doc/src/declarative/qml-intro.qdoc:171: Unexpected '\snippet (//! [positioning the image])'
/var/tmp/portage/x11-libs/qt-assistant-4.7.0/work/qt-everywhere-opensource-src-4.7.0/doc/src/declarative/qml-intro.qdoc:175: Cannot find example file 'doc/src/snippets/declarative/qml-intro/hello-world5.qml'
/var/tmp/portage/x11-libs/qt-assistant-4.7.0/work/qt-everywhere-opensource-src-4.7.0/doc/src/declarative/qml-intro.qdoc:206: Cannot find example file 'doc/src/snippets/declarative/qml-intro/anchors1.qml'
/var/tmp/portage/x11-libs/qt-assistant-4.7.0/work/qt-everywhere-opensource-src-4.7.0/doc/src/declarative/qml-intro.qdoc:225: Cannot find example file 'doc/src/snippets/declarative/qml-intro/anchors2.qml'
/var/tmp/portage/x11-libs/qt-assistant-4.7.0/work/qt-everywhere-opensource-src-4.7.0/doc/src/declarative/qml-intro.qdoc:237: Cannot find example file 'doc/src/snippets/declarative/qml-intro/anchors3.qml'
/var/tmp/portage/x11-libs/qt-assistant-4.7.0/work/qt-everywhere-opensource-src-4.7.0/doc/src/declarative/qml-intro.qdoc:237: Unexpected '\snippet (//! [adding some text])'
/var/tmp/portage/x11-libs/qt-assistant-4.7.0/work/qt-everywhere-opensource-src-4.7.0/doc/src/declarative/qml-intro.qdoc:285: Cannot find example file 'doc/src/snippets/declarative/qml-intro/transformations1.qml'
/var/tmp/portage/x11-libs/qt-assistant-4.7.0/work/qt-everywhere-opensource-src-4.7.0/doc/src/declarative/qml-intro.qdoc:323: Cannot find example file 'doc/src/snippets/declarative/number-animation1.qml'
/var/tmp/portage/x11-libs/qt-assistant-4.7.0/work/qt-everywhere-opensource-src-4.7.0/doc/src/declarative/qml-intro.qdoc:336: Cannot find example file 'doc/src/snippets/declarative/number-animation2.qml'
/var/tmp/portage/x11-libs/qt-assistant-4.7.0/work/qt-everywhere-opensource-src-4.7.0/doc/src/declarative/qml-intro.qdoc:365: Cannot find example file 'doc/src/snippets/declarative/sequential-animation1.qml'
/var/tmp/portage/x11-libs/qt-assistant-4.7.0/work/qt-everywhere-opensource-src-4.7.0/doc/src/declarative/qml-intro.qdoc:379: Cannot find example file 'doc/src/snippets/declarative/sequential-animation2.qml'
/var/tmp/portage/x11-libs/qt-assistant-4.7.0/work/qt-everywhere-opensource-src-4.7.0/doc/src/declarative/qml-intro.qdoc:379: Unexpected '\snippet (//! [adding a sequential animation])'
/var/tmp/portage/x11-libs/qt-assistant-4.7.0/work/qt-everywhere-opensource-src-4.7.0/doc/src/declarative/qml-intro.qdoc:393: Cannot find example file 'doc/src/snippets/declarative/sequential-animation3.qml'
/var/tmp/portage/x11-libs/qt-assistant-4.7.0/work/qt-everywhere-opensource-src-4.7.0/doc/src/declarative/qml-intro.qdoc:474: Cannot find example file 'doc/src/snippets/declarative/states1.qml'
qdeclarative.qdocconf: error: Cannot open C++ source file '/var/tmp/portage/x11-libs/qt-assistant-4.7.0/work/qt-everywhere-opensource-src-4.7.0/doc/src/tutorials/declarative.qdoc' (No such file or directory)
/var/tmp/portage/x11-libs/qt-assistant-4.7.0/work/qt-everywhere-opensource-src-4.7.0/src/declarative/qml/qdeclarativeimageprovider.cpp:52: Cannot link to 'declarative/cppextensions/imageprovider' in QDeclarativeImageProvider
/var/tmp/portage/x11-libs/qt-assistant-4.7.0/work/qt-everywhere-opensource-src-4.7.0/src/declarative/qml/qdeclarativenetworkaccessmanagerfactory.cpp:46: Cannot link to 'declarative/cppextensions/networkaccessmanagerfactory' in QDeclarativeNetworkAccessManagerFactory
/var/tmp/portage/x11-libs/qt-assistant-4.7.0/work/qt-everywhere-opensource-src-4.7.0/src/declarative/qml/qdeclarativecomponent.cpp:383: Cannot link to 'QUrl::fromLocalFile()' in QDeclarativeComponent::QDeclarativeComponent()
/var/tmp/portage/x11-libs/qt-assistant-4.7.0/work/qt-everywhere-opensource-src-4.7.0/src/declarative/qml/qdeclarativecomponent.cpp:477: Cannot link to 'QUrl::fromLocalFile()' in QDeclarativeComponent::loadUrl()
/var/tmp/portage/x11-libs/qt-assistant-4.7.0/work/qt-everywhere-opensource-src-4.7.0/src/declarative/qml/qdeclarativeextensionplugin.cpp:46: Cannot link to 'declarative/cppextensions/plugins' in QDeclarativeExtensionPlugin
/var/tmp/portage/x11-libs/qt-assistant-4.7.0/work/qt-everywhere-opensource-src-4.7.0/src/declarative/qml/qdeclarativeextensionplugin.cpp:46: Cannot link to 'How to Create Qt Plugins' in QDeclarativeExtensionPlugin
/var/tmp/portage/x11-libs/qt-assistant-4.7.0/work/qt-everywhere-opensource-src-4.7.0/src/declarative/qml/qdeclarativeproperty.cpp:576: Cannot link to 'QMetaProperty' in QDeclarativeProperty::property()
/var/tmp/portage/x11-libs/qt-assistant-4.7.0/work/qt-everywhere-opensource-src-4.7.0/src/declarative/graphicsitems/qdeclarativeitem.h:79: No documentation for 'QDeclarativeItem::anchors'
/var/tmp/portage/x11-libs/qt-assistant-4.7.0/work/qt-everywhere-opensource-src-4.7.0/src/declarative/graphicsitems/qdeclarativeitem.h:86: No documentation for 'QDeclarativeItem::baseline'
/var/tmp/portage/x11-libs/qt-assistant-4.7.0/work/qt-everywhere-opensource-src-4.7.0/src/declarative/graphicsitems/qdeclarativeitem.h:84: No documentation for 'QDeclarativeItem::bottom'
/var/tmp/portage/x11-libs/qt-assistant-4.7.0/work/qt-everywhere-opensource-src-4.7.0/src/declarative/graphicsitems/qdeclarativeitem.h:73: No documentation for 'QDeclarativeItem::data'
/var/tmp/portage/x11-libs/qt-assistant-4.7.0/work/qt-everywhere-opensource-src-4.7.0/src/declarative/graphicsitems/qdeclarativeitem.h:82: No documentation for 'QDeclarativeItem::horizontalCenter'
/var/tmp/portage/x11-libs/qt-assistant-4.7.0/work/qt-everywhere-opensource-src-4.7.0/src/declarative/graphicsitems/qdeclarativeitem.h:80: No documentation for 'QDeclarativeItem::left'
/var/tmp/portage/x11-libs/qt-assistant-4.7.0/work/qt-everywhere-opensource-src-4.7.0/src/declarative/graphicsitems/qdeclarativeitem.h:74: No documentation for 'QDeclarativeItem::resources'
/var/tmp/portage/x11-libs/qt-assistant-4.7.0/work/qt-everywhere-opensource-src-4.7.0/src/declarative/graphicsitems/qdeclarativeitem.h:81: No documentation for 'QDeclarativeItem::right'
/var/tmp/portage/x11-libs/qt-assistant-4.7.0/work/qt-everywhere-opensource-src-4.7.0/src/declarative/graphicsitems/qdeclarativeitem.h:77: No documentation for 'QDeclarativeItem::state'
/var/tmp/portage/x11-libs/qt-assistant-4.7.0/work/qt-everywhere-opensource-src-4.7.0/src/declarative/graphicsitems/qdeclarativeitem.h:75: No documentation for 'QDeclarativeItem::states'
/var/tmp/portage/x11-libs/qt-assistant-4.7.0/work/qt-everywhere-opensource-src-4.7.0/src/declarative/graphicsitems/qdeclarativeitem.h:83: No documentation for 'QDeclarativeItem::top'
/var/tmp/portage/x11-libs/qt-assistant-4.7.0/work/qt-everywhere-opensource-src-4.7.0/src/declarative/graphicsitems/qdeclarativeitem.h:93: No documentation for 'QDeclarativeItem::transformOriginPoint'
/var/tmp/portage/x11-libs/qt-assistant-4.7.0/work/qt-everywhere-opensource-src-4.7.0/src/declarative/graphicsitems/qdeclarativeitem.h:76: No documentation for 'QDeclarativeItem::transitions'
/var/tmp/portage/x11-libs/qt-assistant-4.7.0/work/qt-everywhere-opensource-src-4.7.0/src/declarative/graphicsitems/qdeclarativeitem.h:85: No documentation for 'QDeclarativeItem::verticalCenter'
/var/tmp/portage/x11-libs/qt-assistant-4.7.0/work/qt-everywhere-opensource-src-4.7.0/src/declarative/util/qdeclarativeview.cpp:302: Cannot link to 'QUrl::fromLocalFile()' in QDeclarativeView::source
/var/tmp/portage/x11-libs/qt-assistant-4.7.0/work/qt-everywhere-opensource-src-4.7.0/src/declarative/util/qdeclarativeview.cpp:654: Cannot link to 'QGraphicsObject' in QDeclarativeView::rootObject()
/var/tmp/portage/x11-libs/qt-assistant-4.7.0/work/qt-everywhere-opensource-src-4.7.0/src/declarative/graphicsitems/qdeclarativeflipable.cpp:70: Cannot link to 'declarative/ui-components/flipable' in Flipable
/var/tmp/portage/x11-libs/qt-assistant-4.7.0/work/qt-everywhere-opensource-src-4.7.0/src/declarative/graphicsitems/qdeclarativegridview.cpp:1056: Cannot link to 'declarative/modelviews/gridview' in GridView
/var/tmp/portage/x11-libs/qt-assistant-4.7.0/work/qt-everywhere-opensource-src-4.7.0/src/declarative/qml/qdeclarativeworkerscript.cpp:515: Cannot link to 'declarative/threading/workerscript' in WorkerScript
/var/tmp/portage/x11-libs/qt-assistant-4.7.0/work/qt-everywhere-opensource-src-4.7.0/src/declarative/qml/qdeclarativeworkerscript.cpp:515: Cannot link to 'declarative/threading/threadedlistmodel' in WorkerScript
/var/tmp/portage/x11-libs/qt-assistant-4.7.0/work/qt-everywhere-opensource-src-4.7.0/src/declarative/graphicsitems/qdeclarativetext.cpp:163: Cannot link to 'Supported HTML Subset' in Text
/var/tmp/portage/x11-libs/qt-assistant-4.7.0/work/qt-everywhere-opensource-src-4.7.0/src/declarative/graphicsitems/qdeclarativetext.cpp:163: Cannot link to 'declarative/text/fonts' in Text
qdoc: Can't determine read-only status of QML property font.bold; writable assumed.
qdoc: Can't determine read-only status of QML property font.capitalization; writable assumed.
qdoc: Can't determine read-only status of QML property font.family; writable assumed.
qdoc: Can't determine read-only status of QML property font.italic; writable assumed.
qdoc: Can't determine read-only status of QML property font.letterSpacing; writable assumed.
qdoc: Can't determine read-only status of QML property font.pixelSize; writable assumed.
qdoc: Can't determine read-only status of QML property font.pointSize; writable assumed.
qdoc: Can't determine read-only status of QML property font.strikeout; writable assumed.
qdoc: Can't determine read-only status of QML property font.underline; writable assumed.
qdoc: Can't determine read-only status of QML property font.weight; writable assumed.
qdoc: Can't determine read-only status of QML property font.wordSpacing; writable assumed.
qdoc: Can't determine read-only status of QML property origin.x; writable assumed.
qdoc: Can't determine read-only status of QML property origin.y; writable assumed.
qdoc: Can't determine read-only status of QML property xScale; writable assumed.
qdoc: Can't determine read-only status of QML property yScale; writable assumed.
/var/tmp/portage/x11-libs/qt-assistant-4.7.0/work/qt-everywhere-opensource-src-4.7.0/src/declarative/graphicsitems/qdeclarativeitem.cpp:173: Cannot link to 'declarative/ui-components/dialcontrol' in Rotation
/var/tmp/portage/x11-libs/qt-assistant-4.7.0/work/qt-everywhere-opensource-src-4.7.0/src/declarative/graphicsitems/qdeclarativeitem.cpp:173: Cannot link to 'declarative/toys/clocks' in Rotation
qdoc: Can't determine read-only status of QML property angle; writable assumed.
qdoc: Can't determine read-only status of QML property axis.x; writable assumed.
qdoc: Can't determine read-only status of QML property axis.y; writable assumed.
qdoc: Can't determine read-only status of QML property axis.z; writable assumed.
qdoc: Can't determine read-only status of QML property origin.x; writable assumed.
qdoc: Can't determine read-only status of QML property origin.y; writable assumed.
/var/tmp/portage/x11-libs/qt-assistant-4.7.0/work/qt-everywhere-opensource-src-4.7.0/src/declarative/graphicsitems/qdeclarativeitem.cpp:726: Cannot link to 'Qt::Key' in Keys
qdoc: Can't determine read-only status of QML property children; writable assumed.
qdoc: Can't determine read-only status of QML property childrenRect.x; writable assumed.
qdoc: Can't determine read-only status of QML property childrenRect.y; writable assumed.
qdoc: Can't determine read-only status of QML property childrenRect.width; writable assumed.
qdoc: Can't determine read-only status of QML property childrenRect.height; writable assumed.
qdoc: Can't determine read-only status of QML property opacity; writable assumed.
qdoc: Can't determine read-only status of QML property rotation; writable assumed.
qdoc: Can't determine read-only status of QML property scale; writable assumed.
/var/tmp/portage/x11-libs/qt-assistant-4.7.0/work/qt-everywhere-opensource-src-4.7.0/src/declarative/graphicsitems/qdeclarativeitem.cpp:2459: Cannot link to 'state-transitions' in Item::transitions
qdoc: Can't determine read-only status of QML property visible; writable assumed.
qdoc: Can't determine read-only status of QML property x; writable assumed.
qdoc: Can't determine read-only status of QML property y; writable assumed.
qdoc: Can't determine read-only status of QML property width; writable assumed.
qdoc: Can't determine read-only status of QML property height; writable assumed.
qdoc: Can't determine read-only status of QML property z; writable assumed.
/var/tmp/portage/x11-libs/qt-assistant-4.7.0/work/qt-everywhere-opensource-src-4.7.0/src/declarative/graphicsitems/qdeclarativeimage.cpp:51: Cannot link to 'declarative/imageelements/image' in Image
/var/tmp/portage/x11-libs/qt-assistant-4.7.0/work/qt-everywhere-opensource-src-4.7.0/src/declarative/graphicsitems/qdeclarativeimage.cpp:146: Cannot link to 'declarative/imageelements/image' in Image::fillMode
/var/tmp/portage/x11-libs/qt-assistant-4.7.0/work/qt-everywhere-opensource-src-4.7.0/doc/src/declarative/advtutorial.qdoc:297: Cannot link to 'Particles' in declarative/tutorials/samegame/samegame4
/var/tmp/portage/x11-libs/qt-assistant-4.7.0/work/qt-everywhere-opensource-src-4.7.0/doc/src/declarative/advtutorial.qdoc:297: Cannot link to 'Particles' in declarative/tutorials/samegame/samegame4
/var/tmp/portage/x11-libs/qt-assistant-4.7.0/work/qt-everywhere-opensource-src-4.7.0/doc/src/declarative/integrating.qdoc:28: Cannot link to 'QWidget' in qml-integration.html
/var/tmp/portage/x11-libs/qt-assistant-4.7.0/work/qt-everywhere-opensource-src-4.7.0/doc/src/declarative/integrating.qdoc:28: Cannot link to 'QWidget' in qml-integration.html
/var/tmp/portage/x11-libs/qt-assistant-4.7.0/work/qt-everywhere-opensource-src-4.7.0/doc/src/declarative/integrating.qdoc:28: Cannot link to 'Graphics View Framework' in qml-integration.html
/var/tmp/portage/x11-libs/qt-assistant-4.7.0/work/qt-everywhere-opensource-src-4.7.0/doc/src/declarative/integrating.qdoc:28: Cannot link to 'QGraphicsScene::addItem()' in qml-integration.html
/var/tmp/portage/x11-libs/qt-assistant-4.7.0/work/qt-everywhere-opensource-src-4.7.0/doc/src/declarative/integrating.qdoc:28: Cannot link to 'QGraphicsScene' in qml-integration.html
/var/tmp/portage/x11-libs/qt-assistant-4.7.0/work/qt-everywhere-opensource-src-4.7.0/doc/src/declarative/integrating.qdoc:28: Cannot link to 'declarative-cppextensions-qgraphicslayouts.html' in qml-integration.html
/var/tmp/portage/x11-libs/qt-assistant-4.7.0/work/qt-everywhere-opensource-src-4.7.0/src/declarative/graphicsitems/qdeclarativetextedit.cpp:62: Cannot link to 'declarative/text/textselection' in TextEdit
qdoc: Can't determine read-only status of QML property font.bold; writable assumed.
qdoc: Can't determine read-only status of QML property font.capitalization; writable assumed.
qdoc: Can't determine read-only status of QML property font.family; writable assumed.
qdoc: Can't determine read-only status of QML property font.italic; writable assumed.
qdoc: Can't determine read-only status of QML property font.letterSpacing; writable assumed.
qdoc: Can't determine read-only status of QML property font.pixelSize; writable assumed.
qdoc: Can't determine read-only status of QML property font.pointSize; writable assumed.
qdoc: Can't determine read-only status of QML property font.strikeout; writable assumed.
qdoc: Can't determine read-only status of QML property font.underline; writable assumed.
qdoc: Can't determine read-only status of QML property font.weight; writable assumed.
qdoc: Can't determine read-only status of QML property font.wordSpacing; writable assumed.
/var/tmp/portage/x11-libs/qt-assistant-4.7.0/work/qt-everywhere-opensource-src-4.7.0/doc/src/declarative/example-slideswitch.qdoc:28: Cannot link to 'state-transitions' in qdeclarativeexampletoggleswitch.html
/var/tmp/portage/x11-libs/qt-assistant-4.7.0/work/qt-everywhere-opensource-src-4.7.0/doc/src/declarative/qmlviewer.qdoc:28: Cannot link to 'declarative/cppextensions/plugins' in qmlviewer.html
/var/tmp/portage/x11-libs/qt-assistant-4.7.0/work/qt-everywhere-opensource-src-4.7.0/doc/src/declarative/qmlviewer.qdoc:28: Cannot link to 'Qt Linguist' in qmlviewer.html
/var/tmp/portage/x11-libs/qt-assistant-4.7.0/work/qt-everywhere-opensource-src-4.7.0/doc/src/declarative/qmlviewer.qdoc:28: Cannot link to 'declarative/i18n' in qmlviewer.html
/var/tmp/portage/x11-libs/qt-assistant-4.7.0/work/qt-everywhere-opensource-src-4.7.0/doc/src/declarative/qmlviewer.qdoc:28: Cannot link to 'scripting.html#internationalization' in qmlviewer.html
/var/tmp/portage/x11-libs/qt-assistant-4.7.0/work/qt-everywhere-opensource-src-4.7.0/src/declarative/util/qdeclarativelistmodel.cpp:69: Cannot link to 'declarative/threading/threadedlistmodel' in ListModel
/var/tmp/portage/x11-libs/qt-assistant-4.7.0/work/qt-everywhere-opensource-src-4.7.0/src/declarative/util/qdeclarativepackage.cpp:49: Cannot link to 'declarative/modelviews/package' in Package
/var/tmp/portage/x11-libs/qt-assistant-4.7.0/work/qt-everywhere-opensource-src-4.7.0/src/declarative/util/qdeclarativepackage.cpp:49: Cannot link to 'demos/declarative/photoviewer' in Package
/var/tmp/portage/x11-libs/qt-assistant-4.7.0/work/qt-everywhere-opensource-src-4.7.0/doc/src/declarative/modules.qdoc:28: Cannot link to 'declarative/cppextensions/plugins' in qdeclarativemodules.html
/var/tmp/portage/x11-libs/qt-assistant-4.7.0/work/qt-everywhere-opensource-src-4.7.0/doc/src/declarative/globalobject.qdoc:28: Cannot link to 'declarative/xml/xmlhttprequest' in qdeclarativeglobalobject.html
/var/tmp/portage/x11-libs/qt-assistant-4.7.0/work/qt-everywhere-opensource-src-4.7.0/doc/src/declarative/globalobject.qdoc:28: Cannot link to 'declarative/sqllocalstorage' in qdeclarativeglobalobject.html
/var/tmp/portage/x11-libs/qt-assistant-4.7.0/work/qt-everywhere-opensource-src-4.7.0/src/declarative/util/qdeclarativetimer.cpp:71: Cannot link to 'declarative/toys/clocks' in Timer
/var/tmp/portage/x11-libs/qt-assistant-4.7.0/work/qt-everywhere-opensource-src-4.7.0/src/declarative/util/qdeclarativespringanimation.cpp:229: Cannot link to 'declarative/animation/basics' in SpringAnimation
/var/tmp/portage/x11-libs/qt-assistant-4.7.0/work/qt-everywhere-opensource-src-4.7.0/src/declarative/util/qdeclarativespringanimation.cpp:229: Cannot link to 'declarative/toys/clocks' in SpringAnimation
/var/tmp/portage/x11-libs/qt-assistant-4.7.0/work/qt-everywhere-opensource-src-4.7.0/doc/src/declarative/examples.qdoc:28: Cannot link to 'demos/declarative/calculator' in qdeclarativeexamples.html
/var/tmp/portage/x11-libs/qt-assistant-4.7.0/work/qt-everywhere-opensource-src-4.7.0/doc/src/declarative/examples.qdoc:28: Cannot link to 'demos/declarative/flickr' in qdeclarativeexamples.html
/var/tmp/portage/x11-libs/qt-assistant-4.7.0/work/qt-everywhere-opensource-src-4.7.0/doc/src/declarative/examples.qdoc:28: Cannot link to 'demos/declarative/minehunt' in qdeclarativeexamples.html
/var/tmp/portage/x11-libs/qt-assistant-4.7.0/work/qt-everywhere-opensource-src-4.7.0/doc/src/declarative/examples.qdoc:28: Cannot link to 'demos/declarative/photoviewer' in qdeclarativeexamples.html
/var/tmp/portage/x11-libs/qt-assistant-4.7.0/work/qt-everywhere-opensource-src-4.7.0/doc/src/declarative/examples.qdoc:28: Cannot link to 'demos/declarative/rssnews' in qdeclarativeexamples.html
/var/tmp/portage/x11-libs/qt-assistant-4.7.0/work/qt-everywhere-opensource-src-4.7.0/doc/src/declarative/examples.qdoc:28: Cannot link to 'demos/declarative/samegame' in qdeclarativeexamples.html
/var/tmp/portage/x11-libs/qt-assistant-4.7.0/work/qt-everywhere-opensource-src-4.7.0/doc/src/declarative/examples.qdoc:28: Cannot link to 'demos/declarative/snake' in qdeclarativeexamples.html
/var/tmp/portage/x11-libs/qt-assistant-4.7.0/work/qt-everywhere-opensource-src-4.7.0/doc/src/declarative/examples.qdoc:28: Cannot link to 'demos/declarative/twitter' in qdeclarativeexamples.html
/var/tmp/portage/x11-libs/qt-assistant-4.7.0/work/qt-everywhere-opensource-src-4.7.0/doc/src/declarative/examples.qdoc:28: Cannot link to 'demos/declarative/webbrowser' in qdeclarativeexamples.html
/var/tmp/portage/x11-libs/qt-assistant-4.7.0/work/qt-everywhere-opensource-src-4.7.0/doc/src/declarative/examples.qdoc:28: Cannot link to 'declarative/animation/basics' in qdeclarativeexamples.html
/var/tmp/portage/x11-libs/qt-assistant-4.7.0/work/qt-everywhere-opensource-src-4.7.0/doc/src/declarative/examples.qdoc:28: Cannot link to 'declarative/animation/behaviors' in qdeclarativeexamples.html
/var/tmp/portage/x11-libs/qt-assistant-4.7.0/work/qt-everywhere-opensource-src-4.7.0/doc/src/declarative/examples.qdoc:28: Cannot link to 'declarative/animation/easing' in qdeclarativeexamples.html
/var/tmp/portage/x11-libs/qt-assistant-4.7.0/work/qt-everywhere-opensource-src-4.7.0/doc/src/declarative/examples.qdoc:28: Cannot link to 'declarative/animation/states' in qdeclarativeexamples.html
/var/tmp/portage/x11-libs/qt-assistant-4.7.0/work/qt-everywhere-opensource-src-4.7.0/doc/src/declarative/examples.qdoc:28: Cannot link to 'declarative/imageelements/borderimage' in qdeclarativeexamples.html
/var/tmp/portage/x11-libs/qt-assistant-4.7.0/work/qt-everywhere-opensource-src-4.7.0/doc/src/declarative/examples.qdoc:28: Cannot link to 'declarative/imageelements/image' in qdeclarativeexamples.html
/var/tmp/portage/x11-libs/qt-assistant-4.7.0/work/qt-everywhere-opensource-src-4.7.0/doc/src/declarative/examples.qdoc:28: Cannot link to 'declarative/text/fonts' in qdeclarativeexamples.html
/var/tmp/portage/x11-libs/qt-assistant-4.7.0/work/qt-everywhere-opensource-src-4.7.0/doc/src/declarative/examples.qdoc:28: Cannot link to 'declarative/text/textselection' in qdeclarativeexamples.html
/var/tmp/portage/x11-libs/qt-assistant-4.7.0/work/qt-everywhere-opensource-src-4.7.0/doc/src/declarative/examples.qdoc:28: Cannot link to 'declarative/positioners' in qdeclarativeexamples.html
/var/tmp/portage/x11-libs/qt-assistant-4.7.0/work/qt-everywhere-opensource-src-4.7.0/doc/src/declarative/examples.qdoc:28: Cannot link to 'declarative/keyinteraction/focus' in qdeclarativeexamples.html
/var/tmp/portage/x11-libs/qt-assistant-4.7.0/work/qt-everywhere-opensource-src-4.7.0/doc/src/declarative/examples.qdoc:28: Cannot link to 'declarative/touchinteraction/gestures' in qdeclarativeexamples.html
/var/tmp/portage/x11-libs/qt-assistant-4.7.0/work/qt-everywhere-opensource-src-4.7.0/doc/src/declarative/examples.qdoc:28: Cannot link to 'declarative/touchinteraction/mousearea' in qdeclarativeexamples.html
/var/tmp/portage/x11-libs/qt-assistant-4.7.0/work/qt-everywhere-opensource-src-4.7.0/doc/src/declarative/examples.qdoc:28: Cannot link to 'declarative/ui-components/dialcontrol' in qdeclarativeexamples.html
/var/tmp/portage/x11-libs/qt-assistant-4.7.0/work/qt-everywhere-opensource-src-4.7.0/doc/src/declarative/examples.qdoc:28: Cannot link to 'declarative/ui-components/flipable' in qdeclarativeexamples.html
/var/tmp/portage/x11-libs/qt-assistant-4.7.0/work/qt-everywhere-opensource-src-4.7.0/doc/src/declarative/examples.qdoc:28: Cannot link to 'declarative/ui-components/progressbar' in qdeclarativeexamples.html
/var/tmp/portage/x11-libs/qt-assistant-4.7.0/work/qt-everywhere-opensource-src-4.7.0/doc/src/declarative/examples.qdoc:28: Cannot link to 'declarative/ui-components/scrollbar' in qdeclarativeexamples.html
/var/tmp/portage/x11-libs/qt-assistant-4.7.0/work/qt-everywhere-opensource-src-4.7.0/doc/src/declarative/examples.qdoc:28: Cannot link to 'declarative/ui-components/searchbox' in qdeclarativeexamples.html
/var/tmp/portage/x11-libs/qt-assistant-4.7.0/work/qt-everywhere-opensource-src-4.7.0/doc/src/declarative/examples.qdoc:28: Cannot link to 'declarative/ui-components/slideswitch' in qdeclarativeexamples.html
/var/tmp/portage/x11-libs/qt-assistant-4.7.0/work/qt-everywhere-opensource-src-4.7.0/doc/src/declarative/examples.qdoc:28: Cannot link to 'declarative/ui-components/spinner' in qdeclarativeexamples.html
/var/tmp/portage/x11-libs/qt-assistant-4.7.0/work/qt-everywhere-opensource-src-4.7.0/doc/src/declarative/examples.qdoc:28: Cannot link to 'declarative/ui-components/tabwidget' in qdeclarativeexamples.html
/var/tmp/portage/x11-libs/qt-assistant-4.7.0/work/qt-everywhere-opensource-src-4.7.0/doc/src/declarative/examples.qdoc:28: Cannot link to 'declarative/toys/clocks' in qdeclarativeexamples.html
/var/tmp/portage/x11-libs/qt-assistant-4.7.0/work/qt-everywhere-opensource-src-4.7.0/doc/src/declarative/examples.qdoc:28: Cannot link to 'declarative/toys/corkboards' in qdeclarativeexamples.html
/var/tmp/portage/x11-libs/qt-assistant-4.7.0/work/qt-everywhere-opensource-src-4.7.0/doc/src/declarative/examples.qdoc:28: Cannot link to 'declarative/toys/dynamicscene' in qdeclarativeexamples.html
/var/tmp/portage/x11-libs/qt-assistant-4.7.0/work/qt-everywhere-opensource-src-4.7.0/doc/src/declarative/examples.qdoc:28: Cannot link to 'declarative/toys/tic-tac-toe' in qdeclarativeexamples.html
/var/tmp/portage/x11-libs/qt-assistant-4.7.0/work/qt-everywhere-opensource-src-4.7.0/doc/src/declarative/examples.qdoc:28: Cannot link to 'declarative/toys/tvtennis' in qdeclarativeexamples.html
/var/tmp/portage/x11-libs/qt-assistant-4.7.0/work/qt-everywhere-opensource-src-4.7.0/doc/src/declarative/examples.qdoc:28: Cannot link to 'declarative/modelviews/gridview' in qdeclarativeexamples.html
/var/tmp/portage/x11-libs/qt-assistant-4.7.0/work/qt-everywhere-opensource-src-4.7.0/doc/src/declarative/examples.qdoc:28: Cannot link to 'declarative/modelviews/listview' in qdeclarativeexamples.html
/var/tmp/portage/x11-libs/qt-assistant-4.7.0/work/qt-everywhere-opensource-src-4.7.0/doc/src/declarative/examples.qdoc:28: Cannot link to 'declarative/modelviews/pathview' in qdeclarativeexamples.html
/var/tmp/portage/x11-libs/qt-assistant-4.7.0/work/qt-everywhere-opensource-src-4.7.0/doc/src/declarative/examples.qdoc:28: Cannot link to 'declarative/modelviews/package' in qdeclarativeexamples.html
/var/tmp/portage/x11-libs/qt-assistant-4.7.0/work/qt-everywhere-opensource-src-4.7.0/doc/src/declarative/examples.qdoc:28: Cannot link to 'declarative/modelviews/parallax' in qdeclarativeexamples.html
/var/tmp/portage/x11-libs/qt-assistant-4.7.0/work/qt-everywhere-opensource-src-4.7.0/doc/src/declarative/examples.qdoc:28: Cannot link to 'declarative/modelviews/visualitemmodel' in qdeclarativeexamples.html
/var/tmp/portage/x11-libs/qt-assistant-4.7.0/work/qt-everywhere-opensource-src-4.7.0/doc/src/declarative/examples.qdoc:28: Cannot link to 'declarative/modelviews/stringlistmodel' in qdeclarativeexamples.html
/var/tmp/portage/x11-libs/qt-assistant-4.7.0/work/qt-everywhere-opensource-src-4.7.0/doc/src/declarative/examples.qdoc:28: Cannot link to 'declarative/modelviews/objectlistmodel' in qdeclarativeexamples.html
/var/tmp/portage/x11-libs/qt-assistant-4.7.0/work/qt-everywhere-opensource-src-4.7.0/doc/src/declarative/examples.qdoc:28: Cannot link to 'declarative/modelviews/abstractitemmodel' in qdeclarativeexamples.html
/var/tmp/portage/x11-libs/qt-assistant-4.7.0/work/qt-everywhere-opensource-src-4.7.0/doc/src/declarative/examples.qdoc:28: Cannot link to 'declarative/modelviews/webview' in qdeclarativeexamples.html
/var/tmp/portage/x11-libs/qt-assistant-4.7.0/work/qt-everywhere-opensource-src-4.7.0/doc/src/declarative/examples.qdoc:28: Cannot link to 'declarative/xml/xmlhttprequest' in qdeclarativeexamples.html
/var/tmp/portage/x11-libs/qt-assistant-4.7.0/work/qt-everywhere-opensource-src-4.7.0/doc/src/declarative/examples.qdoc:28: Cannot link to 'declarative/i18n' in qdeclarativeexamples.html
/var/tmp/portage/x11-libs/qt-assistant-4.7.0/work/qt-everywhere-opensource-src-4.7.0/doc/src/declarative/examples.qdoc:28: Cannot link to 'declarative/threading/threadedlistmodel' in qdeclarativeexamples.html
/var/tmp/portage/x11-libs/qt-assistant-4.7.0/work/qt-everywhere-opensource-src-4.7.0/doc/src/declarative/examples.qdoc:28: Cannot link to 'declarative/threading/workerscript' in qdeclarativeexamples.html
/var/tmp/portage/x11-libs/qt-assistant-4.7.0/work/qt-everywhere-opensource-src-4.7.0/doc/src/declarative/examples.qdoc:28: Cannot link to 'declarative/screenorientation' in qdeclarativeexamples.html
/var/tmp/portage/x11-libs/qt-assistant-4.7.0/work/qt-everywhere-opensource-src-4.7.0/doc/src/declarative/examples.qdoc:28: Cannot link to 'declarative/sqllocalstorage' in qdeclarativeexamples.html
/var/tmp/portage/x11-libs/qt-assistant-4.7.0/work/qt-everywhere-opensource-src-4.7.0/doc/src/declarative/examples.qdoc:28: Cannot link to 'declarative-cppextensions-reference.html' in qdeclarativeexamples.html
/var/tmp/portage/x11-libs/qt-assistant-4.7.0/work/qt-everywhere-opensource-src-4.7.0/doc/src/declarative/examples.qdoc:28: Cannot link to 'declarative/cppextensions/plugins' in qdeclarativeexamples.html
/var/tmp/portage/x11-libs/qt-assistant-4.7.0/work/qt-everywhere-opensource-src-4.7.0/doc/src/declarative/examples.qdoc:28: Cannot link to 'declarative-cppextensions-qgraphicslayouts.html' in qdeclarativeexamples.html
/var/tmp/portage/x11-libs/qt-assistant-4.7.0/work/qt-everywhere-opensource-src-4.7.0/doc/src/declarative/examples.qdoc:28: Cannot link to 'declarative/cppextensions/qwidgets' in qdeclarativeexamples.html
/var/tmp/portage/x11-libs/qt-assistant-4.7.0/work/qt-everywhere-opensource-src-4.7.0/doc/src/declarative/examples.qdoc:28: Cannot link to 'declarative/cppextensions/imageprovider' in qdeclarativeexamples.html
/var/tmp/portage/x11-libs/qt-assistant-4.7.0/work/qt-everywhere-opensource-src-4.7.0/doc/src/declarative/examples.qdoc:28: Cannot link to 'declarative/cppextensions/networkaccessmanagerfactory' in qdeclarativeexamples.html
/var/tmp/portage/x11-libs/qt-assistant-4.7.0/work/qt-everywhere-opensource-src-4.7.0/doc/src/declarative/examples.qdoc:28: Cannot link to 'src/imports/folderlistmodel' in qdeclarativeexamples.html
/var/tmp/portage/x11-libs/qt-assistant-4.7.0/work/qt-everywhere-opensource-src-4.7.0/doc/src/declarative/declarativeui.qdoc:28: Cannot link to 'About JavaScript' in qtquick.html
/var/tmp/portage/x11-libs/qt-assistant-4.7.0/work/qt-everywhere-opensource-src-4.7.0/doc/src/declarative/declarativeui.qdoc:28: Cannot link to 'Getting Started Programming with QML' in qtquick.html
/var/tmp/portage/x11-libs/qt-assistant-4.7.0/work/qt-everywhere-opensource-src-4.7.0/src/declarative/graphicsitems/qdeclarativepathview.cpp:327: Cannot link to 'declarative/modelviews/pathview' in PathView
/var/tmp/portage/x11-libs/qt-assistant-4.7.0/work/qt-everywhere-opensource-src-4.7.0/src/declarative/util/qdeclarativesmoothedanimation.cpp:250: Cannot link to 'declarative/animation/basics' in SmoothedAnimation
/var/tmp/portage/x11-libs/qt-assistant-4.7.0/work/qt-everywhere-opensource-src-4.7.0/doc/src/declarative/qdeclarativestates.qdoc:28: Cannot link to 'declarative/animation/states' in qdeclarativestates.html
/var/tmp/portage/x11-libs/qt-assistant-4.7.0/work/qt-everywhere-opensource-src-4.7.0/doc/src/declarative/qmlruntime.qdoc:28: Cannot link to 'qmake Project Files' in qmlruntime.html
/var/tmp/portage/x11-libs/qt-assistant-4.7.0/work/qt-everywhere-opensource-src-4.7.0/doc/src/declarative/qmlruntime.qdoc:28: Cannot link to 'The Qt Resource System' in qmlruntime.html
/var/tmp/portage/x11-libs/qt-assistant-4.7.0/work/qt-everywhere-opensource-src-4.7.0/src/declarative/graphicsitems/qdeclarativemousearea.cpp:181: Cannot link to 'declarative/touchinteraction/mousearea' in MouseArea
/var/tmp/portage/x11-libs/qt-assistant-4.7.0/work/qt-everywhere-opensource-src-4.7.0/src/declarative/graphicsitems/qdeclarativeevents.cpp:65: Cannot link to 'Qt::Key' in KeyEvent::key
/var/tmp/portage/x11-libs/qt-assistant-4.7.0/work/qt-everywhere-opensource-src-4.7.0/src/declarative/graphicsitems/qdeclarativeevents.cpp:65: Cannot link to 'Qt::Key_unknown' in KeyEvent::key
/var/tmp/portage/x11-libs/qt-assistant-4.7.0/work/qt-everywhere-opensource-src-4.7.0/doc/src/declarative/qml-intro.qdoc:30: Cannot link to 'Signals & Slots' in qml-intro.html
/var/tmp/portage/x11-libs/qt-assistant-4.7.0/work/qt-everywhere-opensource-src-4.7.0/doc/src/declarative/qml-intro.qdoc:30: Cannot link to 'Audio' in qml-intro.html
/var/tmp/portage/x11-libs/qt-assistant-4.7.0/work/qt-everywhere-opensource-src-4.7.0/doc/src/declarative/qml-intro.qdoc:30: Cannot link to 'Audio' in qml-intro.html
/var/tmp/portage/x11-libs/qt-assistant-4.7.0/work/qt-everywhere-opensource-src-4.7.0/doc/src/declarative/extending.qdoc:28: Cannot link to 'Qt's Property System' in qml-extending.html
/var/tmp/portage/x11-libs/qt-assistant-4.7.0/work/qt-everywhere-opensource-src-4.7.0/doc/src/declarative/extending.qdoc:28: Cannot link to 'Extending QML - Adding Types Example' in qml-extending.html
/var/tmp/portage/x11-libs/qt-assistant-4.7.0/work/qt-everywhere-opensource-src-4.7.0/doc/src/declarative/extending.qdoc:28: Cannot link to 'Extending QML - Object and List Property Types Example' in qml-extending.html
/var/tmp/portage/x11-libs/qt-assistant-4.7.0/work/qt-everywhere-opensource-src-4.7.0/doc/src/declarative/extending.qdoc:28: Cannot link to 'Extending QML - Inheritance and Coercion Example' in qml-extending.html
/var/tmp/portage/x11-libs/qt-assistant-4.7.0/work/qt-everywhere-opensource-src-4.7.0/doc/src/declarative/extending.qdoc:28: Cannot link to 'Extending QML - Default Property Example' in qml-extending.html
/var/tmp/portage/x11-libs/qt-assistant-4.7.0/work/qt-everywhere-opensource-src-4.7.0/doc/src/declarative/extending.qdoc:28: Cannot link to 'Extending QML - Grouped Properties Example' in qml-extending.html
/var/tmp/portage/x11-libs/qt-assistant-4.7.0/work/qt-everywhere-opensource-src-4.7.0/doc/src/declarative/extending.qdoc:28: Cannot link to 'Extending QML - Attached Properties Example' in qml-extending.html
/var/tmp/portage/x11-libs/qt-assistant-4.7.0/work/qt-everywhere-opensource-src-4.7.0/doc/src/declarative/extending.qdoc:28: Cannot link to 'Extending QML - Signal Support Example' in qml-extending.html
/var/tmp/portage/x11-libs/qt-assistant-4.7.0/work/qt-everywhere-opensource-src-4.7.0/doc/src/declarative/extending.qdoc:28: Cannot link to 'Extending QML - Property Value Source Example' in qml-extending.html
/var/tmp/portage/x11-libs/qt-assistant-4.7.0/work/qt-everywhere-opensource-src-4.7.0/doc/src/declarative/extending.qdoc:28: Cannot link to 'Qt's Property System' in qml-extending.html
/var/tmp/portage/x11-libs/qt-assistant-4.7.0/work/qt-everywhere-opensource-src-4.7.0/doc/src/declarative/extending.qdoc:28: Cannot link to 'Extending QML - Binding Example' in qml-extending.html
/var/tmp/portage/x11-libs/qt-assistant-4.7.0/work/qt-everywhere-opensource-src-4.7.0/doc/src/declarative/extending.qdoc:624: Cannot link to 'declarative/ui-components/tabwidget' in qml-extending-types.html
/var/tmp/portage/x11-libs/qt-assistant-4.7.0/work/qt-everywhere-opensource-src-4.7.0/src/declarative/graphicsitems/qdeclarativeborderimage.cpp:54: Cannot link to 'declarative/imageelements/borderimage' in BorderImage
/var/tmp/portage/x11-libs/qt-assistant-4.7.0/work/qt-everywhere-opensource-src-4.7.0/src/declarative/util/qdeclarativebehavior.cpp:73: Cannot link to 'declarative/animation/behaviors' in Behavior
/var/tmp/portage/x11-libs/qt-assistant-4.7.0/work/qt-everywhere-opensource-src-4.7.0/src/declarative/util/qdeclarativestate.cpp:134: Cannot link to 'declarative/animation/states' in State
/var/tmp/portage/x11-libs/qt-assistant-4.7.0/work/qt-everywhere-opensource-src-4.7.0/src/declarative/util/qdeclarativestate.cpp:134: Cannot link to 'state-transitions' in State
/var/tmp/portage/x11-libs/qt-assistant-4.7.0/work/qt-everywhere-opensource-src-4.7.0/src/declarative/graphicsitems/qdeclarativefocusscope.cpp:48: Cannot link to 'declarative/keyinteraction/focus' in FocusScope
/var/tmp/portage/x11-libs/qt-assistant-4.7.0/work/qt-everywhere-opensource-src-4.7.0/doc/src/declarative/focus.qdoc:28: Cannot link to 'QEvent::ignore()' in qdeclarativefocus.html
/var/tmp/portage/x11-libs/qt-assistant-4.7.0/work/qt-everywhere-opensource-src-4.7.0/doc/src/declarative/focus.qdoc:28: Cannot link to 'QEvent::ignore()' in qdeclarativefocus.html
/var/tmp/portage/x11-libs/qt-assistant-4.7.0/work/qt-everywhere-opensource-src-4.7.0/doc/src/declarative/focus.qdoc:28: Cannot link to 'QEvent::ignore()' in qdeclarativefocus.html
/var/tmp/portage/x11-libs/qt-assistant-4.7.0/work/qt-everywhere-opensource-src-4.7.0/doc/src/declarative/focus.qdoc:28: Cannot link to 'declarative/keyinteraction/focus' in qdeclarativefocus.html
/var/tmp/portage/x11-libs/qt-assistant-4.7.0/work/qt-everywhere-opensource-src-4.7.0/src/declarative/util/qdeclarativesystempalette.cpp:59: Cannot link to 'QPalette' in SystemPalette
/var/tmp/portage/x11-libs/qt-assistant-4.7.0/work/qt-everywhere-opensource-src-4.7.0/src/declarative/util/qdeclarativesystempalette.cpp:143: Cannot link to 'QPalette::ColorRole' in SystemPalette::alternateBase
/var/tmp/portage/x11-libs/qt-assistant-4.7.0/work/qt-everywhere-opensource-src-4.7.0/src/declarative/util/qdeclarativesystempalette.cpp:119: Cannot link to 'QPalette::ColorRole' in SystemPalette::base
/var/tmp/portage/x11-libs/qt-assistant-4.7.0/work/qt-everywhere-opensource-src-4.7.0/src/declarative/util/qdeclarativesystempalette.cpp:155: Cannot link to 'QPalette::ColorRole' in SystemPalette::button
/var/tmp/portage/x11-libs/qt-assistant-4.7.0/work/qt-everywhere-opensource-src-4.7.0/src/declarative/util/qdeclarativesystempalette.cpp:167: Cannot link to 'QPalette::ColorRole' in SystemPalette::buttonText
/var/tmp/portage/x11-libs/qt-assistant-4.7.0/work/qt-everywhere-opensource-src-4.7.0/src/declarative/util/qdeclarativesystempalette.cpp:263: Cannot link to 'QPalette::ColorGroup' in SystemPalette::colorGroup
/var/tmp/portage/x11-libs/qt-assistant-4.7.0/work/qt-everywhere-opensource-src-4.7.0/src/declarative/util/qdeclarativesystempalette.cpp:203: Cannot link to 'QPalette::ColorRole' in SystemPalette::dark
/var/tmp/portage/x11-libs/qt-assistant-4.7.0/work/qt-everywhere-opensource-src-4.7.0/src/declarative/util/qdeclarativesystempalette.cpp:239: Cannot link to 'QPalette::ColorRole' in SystemPalette::highlight
/var/tmp/portage/x11-libs/qt-assistant-4.7.0/work/qt-everywhere-opensource-src-4.7.0/src/declarative/util/qdeclarativesystempalette.cpp:251: Cannot link to 'QPalette::ColorRole' in SystemPalette::highlightedText
/var/tmp/portage/x11-libs/qt-assistant-4.7.0/work/qt-everywhere-opensource-src-4.7.0/src/declarative/util/qdeclarativesystempalette.cpp:179: Cannot link to 'QPalette::ColorRole' in SystemPalette::light
/var/tmp/portage/x11-libs/qt-assistant-4.7.0/work/qt-everywhere-opensource-src-4.7.0/src/declarative/util/qdeclarativesystempalette.cpp:215: Cannot link to 'QPalette::ColorRole' in SystemPalette::mid
/var/tmp/portage/x11-libs/qt-assistant-4.7.0/work/qt-everywhere-opensource-src-4.7.0/src/declarative/util/qdeclarativesystempalette.cpp:191: Cannot link to 'QPalette::ColorRole' in SystemPalette::midlight
/var/tmp/portage/x11-libs/qt-assistant-4.7.0/work/qt-everywhere-opensource-src-4.7.0/src/declarative/util/qdeclarativesystempalette.cpp:227: Cannot link to 'QPalette::ColorRole' in SystemPalette::shadow
/var/tmp/portage/x11-libs/qt-assistant-4.7.0/work/qt-everywhere-opensource-src-4.7.0/src/declarative/util/qdeclarativesystempalette.cpp:131: Cannot link to 'QPalette::ColorRole' in SystemPalette::text
/var/tmp/portage/x11-libs/qt-assistant-4.7.0/work/qt-everywhere-opensource-src-4.7.0/src/declarative/util/qdeclarativesystempalette.cpp:95: Cannot link to 'QPalette::ColorRole' in SystemPalette::window
/var/tmp/portage/x11-libs/qt-assistant-4.7.0/work/qt-everywhere-opensource-src-4.7.0/src/declarative/util/qdeclarativesystempalette.cpp:107: Cannot link to 'QPalette::ColorRole' in SystemPalette::windowText
/var/tmp/portage/x11-libs/qt-assistant-4.7.0/work/qt-everywhere-opensource-src-4.7.0/doc/src/declarative/qtdeclarative.qdoc:28: Cannot link to 'qmake' in QtDeclarative
/var/tmp/portage/x11-libs/qt-assistant-4.7.0/work/qt-everywhere-opensource-src-4.7.0/doc/src/declarative/qdeclarativemodels.qdoc:28: Cannot link to 'demos/declarative/rssnews' in qdeclarativemodels.html
/var/tmp/portage/x11-libs/qt-assistant-4.7.0/work/qt-everywhere-opensource-src-4.7.0/doc/src/declarative/qdeclarativemodels.qdoc:28: Cannot link to 'declarative/modelviews/stringlistmodel' in qdeclarativemodels.html
/var/tmp/portage/x11-libs/qt-assistant-4.7.0/work/qt-everywhere-opensource-src-4.7.0/doc/src/declarative/qdeclarativemodels.qdoc:28: Cannot link to 'declarative/modelviews/objectlistmodel' in qdeclarativemodels.html
/var/tmp/portage/x11-libs/qt-assistant-4.7.0/work/qt-everywhere-opensource-src-4.7.0/doc/src/declarative/qdeclarativemodels.qdoc:28: Cannot link to 'Model subclassing reference' in qdeclarativemodels.html
/var/tmp/portage/x11-libs/qt-assistant-4.7.0/work/qt-everywhere-opensource-src-4.7.0/doc/src/declarative/qdeclarativemodels.qdoc:28: Cannot link to 'declarative/modelviews/abstractitemmodel' in qdeclarativemodels.html
/var/tmp/portage/x11-libs/qt-assistant-4.7.0/work/qt-everywhere-opensource-src-4.7.0/doc/src/declarative/dynamicobjects.qdoc:28: Cannot link to 'declarative/toys/dynamicscene' in qdeclarativedynamicobjects.html
/var/tmp/portage/x11-libs/qt-assistant-4.7.0/work/qt-everywhere-opensource-src-4.7.0/src/declarative/util/qdeclarativeanimation.cpp:555: Cannot link to 'declarative/animation/basics' in PauseAnimation
/var/tmp/portage/x11-libs/qt-assistant-4.7.0/work/qt-everywhere-opensource-src-4.7.0/src/declarative/util/qdeclarativeanimation.cpp:631: Cannot link to 'declarative/animation/basics' in ColorAnimation
/var/tmp/portage/x11-libs/qt-assistant-4.7.0/work/qt-everywhere-opensource-src-4.7.0/src/declarative/util/qdeclarativeanimation.cpp:1130: Cannot link to 'declarative/animation/basics' in NumberAnimation
/var/tmp/portage/x11-libs/qt-assistant-4.7.0/work/qt-everywhere-opensource-src-4.7.0/src/declarative/util/qdeclarativeanimation.cpp:1239: Cannot link to 'declarative/animation/basics' in Vector3dAnimation
/var/tmp/portage/x11-libs/qt-assistant-4.7.0/work/qt-everywhere-opensource-src-4.7.0/src/declarative/util/qdeclarativeanimation.cpp:1312: Cannot link to 'target' in RotationAnimation
/var/tmp/portage/x11-libs/qt-assistant-4.7.0/work/qt-everywhere-opensource-src-4.7.0/src/declarative/util/qdeclarativeanimation.cpp:1312: Cannot link to 'declarative/animation/basics' in RotationAnimation
/var/tmp/portage/x11-libs/qt-assistant-4.7.0/work/qt-everywhere-opensource-src-4.7.0/src/declarative/util/qdeclarativeanimation.cpp:1541: Cannot link to 'declarative/animation/basics' in SequentialAnimation
/var/tmp/portage/x11-libs/qt-assistant-4.7.0/work/qt-everywhere-opensource-src-4.7.0/src/declarative/util/qdeclarativeanimation.cpp:1614: Cannot link to 'declarative/animation/basics' in ParallelAnimation
/var/tmp/portage/x11-libs/qt-assistant-4.7.0/work/qt-everywhere-opensource-src-4.7.0/src/declarative/util/qdeclarativeanimation.cpp:1732: Cannot link to 'declarative/animation/basics' in PropertyAnimation
qdoc: Can't determine read-only status of QML property easing.type; writable assumed.
qdoc: Can't determine read-only status of QML property easing.amplitude; writable assumed.
qdoc: Can't determine read-only status of QML property easing.overshoot; writable assumed.
qdoc: Can't determine read-only status of QML property easing.period; writable assumed.
/var/tmp/portage/x11-libs/qt-assistant-4.7.0/work/qt-everywhere-opensource-src-4.7.0/src/declarative/util/qdeclarativeanimation.cpp:1886: Cannot link to 'declarative/animation/easing' in PropertyAnimation::easing.type
/var/tmp/portage/x11-libs/qt-assistant-4.7.0/work/qt-everywhere-opensource-src-4.7.0/src/declarative/util/qdeclarativeanimation.cpp:2399: Cannot link to 'declarative/animation/basics' in ParentAnimation
/var/tmp/portage/x11-libs/qt-assistant-4.7.0/work/qt-everywhere-opensource-src-4.7.0/src/declarative/util/qdeclarativeanimation.cpp:2758: Cannot link to 'target' in AnchorAnimation
qdoc: Can't determine read-only status of QML property easing.type; writable assumed.
qdoc: Can't determine read-only status of QML property easing.amplitude; writable assumed.
qdoc: Can't determine read-only status of QML property easing.overshoot; writable assumed.
qdoc: Can't determine read-only status of QML property easing.period; writable assumed.
/var/tmp/portage/x11-libs/qt-assistant-4.7.0/work/qt-everywhere-opensource-src-4.7.0/src/declarative/util/qdeclarativexmllistmodel.cpp:506: Cannot link to 'RSS News' in XmlListModel
/var/tmp/portage/x11-libs/qt-assistant-4.7.0/work/qt-everywhere-opensource-src-4.7.0/src/declarative/graphicsitems/qdeclarativevisualitemmodel.cpp:129: Cannot link to 'declarative/modelviews/visualitemmodel' in VisualItemModel
/var/tmp/portage/x11-libs/qt-assistant-4.7.0/work/qt-everywhere-opensource-src-4.7.0/doc/src/declarative/elements.qdoc:28: Cannot link to 'GestureArea' in qdeclarativeelements.html
/var/tmp/portage/x11-libs/qt-assistant-4.7.0/work/qt-everywhere-opensource-src-4.7.0/doc/src/declarative/elements.qdoc:28: Cannot link to 'WebView' in qdeclarativeelements.html
/var/tmp/portage/x11-libs/qt-assistant-4.7.0/work/qt-everywhere-opensource-src-4.7.0/doc/src/declarative/elements.qdoc:28: Cannot link to 'Particles' in qdeclarativeelements.html
/var/tmp/portage/x11-libs/qt-assistant-4.7.0/work/qt-everywhere-opensource-src-4.7.0/doc/src/declarative/elements.qdoc:28: Cannot link to 'ParticleMotionLinear' in qdeclarativeelements.html
/var/tmp/portage/x11-libs/qt-assistant-4.7.0/work/qt-everywhere-opensource-src-4.7.0/doc/src/declarative/elements.qdoc:28: Cannot link to 'Particles' in qdeclarativeelements.html
/var/tmp/portage/x11-libs/qt-assistant-4.7.0/work/qt-everywhere-opensource-src-4.7.0/doc/src/declarative/elements.qdoc:28: Cannot link to 'ParticleMotionGravity' in qdeclarativeelements.html
/var/tmp/portage/x11-libs/qt-assistant-4.7.0/work/qt-everywhere-opensource-src-4.7.0/doc/src/declarative/elements.qdoc:28: Cannot link to 'Particles' in qdeclarativeelements.html
/var/tmp/portage/x11-libs/qt-assistant-4.7.0/work/qt-everywhere-opensource-src-4.7.0/doc/src/declarative/elements.qdoc:28: Cannot link to 'ParticleMotionWander' in qdeclarativeelements.html
/var/tmp/portage/x11-libs/qt-assistant-4.7.0/work/qt-everywhere-opensource-src-4.7.0/doc/src/declarative/elements.qdoc:28: Cannot link to 'Particles' in qdeclarativeelements.html
/var/tmp/portage/x11-libs/qt-assistant-4.7.0/work/qt-everywhere-opensource-src-4.7.0/doc/src/declarative/qtbinding.qdoc:28: Cannot link to 'The Qt Resource System' in qtbinding.html
/var/tmp/portage/x11-libs/qt-assistant-4.7.0/work/qt-everywhere-opensource-src-4.7.0/src/declarative/util/qdeclarativefontloader.cpp:79: Cannot link to 'declarative/text/fonts' in FontLoader
/var/tmp/portage/x11-libs/qt-assistant-4.7.0/work/qt-everywhere-opensource-src-4.7.0/src/declarative/graphicsitems/qdeclarativelayoutitem.cpp:50: Cannot link to 'Graphics View Framework' in LayoutItem
/var/tmp/portage/x11-libs/qt-assistant-4.7.0/work/qt-everywhere-opensource-src-4.7.0/src/declarative/graphicsitems/qdeclarativelayoutitem.cpp:50: Cannot link to 'declarative/cppextensions/qgraphicslayouts/layoutitem' in LayoutItem
/var/tmp/portage/x11-libs/qt-assistant-4.7.0/work/qt-everywhere-opensource-src-4.7.0/src/declarative/graphicsitems/qdeclarativelayoutitem.cpp:50: Cannot link to 'Graphics View Framework' in LayoutItem
qdoc: Can't determine read-only status of QML property objectName; writable assumed.
/var/tmp/portage/x11-libs/qt-assistant-4.7.0/work/qt-everywhere-opensource-src-4.7.0/doc/src/declarative/tutorial.qdoc:183: Cannot link to 'declarative/animation/states' in qml-tutorial3.html
/var/tmp/portage/x11-libs/qt-assistant-4.7.0/work/qt-everywhere-opensource-src-4.7.0/src/declarative/graphicsitems/qdeclarativeflickable.cpp:405: Cannot link to 'declarative/ui-components/scrollbar' in Flickable::visibleArea.xPosition
/var/tmp/portage/x11-libs/qt-assistant-4.7.0/work/qt-everywhere-opensource-src-4.7.0/doc/src/declarative/qdeclarativei18n.qdoc:28: Cannot link to 'Internationalization with Qt' in qdeclarativei18n.html
/var/tmp/portage/x11-libs/qt-assistant-4.7.0/work/qt-everywhere-opensource-src-4.7.0/doc/src/declarative/qdeclarativei18n.qdoc:28: Cannot link to 'Qt Linguist Manual' in qdeclarativei18n.html
/var/tmp/portage/x11-libs/qt-assistant-4.7.0/work/qt-everywhere-opensource-src-4.7.0/doc/src/declarative/qdeclarativei18n.qdoc:28: Cannot link to 'Qt Linguist Manual' in qdeclarativei18n.html
/var/tmp/portage/x11-libs/qt-assistant-4.7.0/work/qt-everywhere-opensource-src-4.7.0/doc/src/declarative/qdeclarativei18n.qdoc:28: Cannot link to 'declarative/i18n' in qdeclarativei18n.html
/var/tmp/portage/x11-libs/qt-assistant-4.7.0/work/qt-everywhere-opensource-src-4.7.0/doc/src/declarative/network.qdoc:28: Cannot link to 'The Qt Resource System' in qdeclarativenetwork.html
/var/tmp/portage/x11-libs/qt-assistant-4.7.0/work/qt-everywhere-opensource-src-4.7.0/doc/src/declarative/extending-tutorial.qdoc:58: Cannot link to 'Meta-Object System' in declarative/tutorials/extending/chapter1-basics
/var/tmp/portage/x11-libs/qt-assistant-4.7.0/work/qt-everywhere-opensource-src-4.7.0/doc/src/declarative/extending-tutorial.qdoc:205: Cannot link to 'Qt's Property System' in declarative/tutorials/extending/chapter3-bindings
/var/tmp/portage/x11-libs/qt-assistant-4.7.0/work/qt-everywhere-opensource-src-4.7.0/doc/src/declarative/extending-tutorial.qdoc:407: Cannot link to 'How to Create Qt Plugins' in declarative/tutorials/extending/chapter6-plugins
/var/tmp/portage/x11-libs/qt-assistant-4.7.0/work/qt-everywhere-opensource-src-4.7.0/doc/src/declarative/extending-tutorial.qdoc:466: Cannot link to 'Qt's Property System' in qml-extending-tutorial7.html
/var/tmp/portage/x11-libs/qt-assistant-4.7.0/work/qt-everywhere-opensource-src-4.7.0/doc/src/declarative/qdeclarativeintro.qdoc:28: Cannot link to 'JavaScript: The Definitive Guide' in qdeclarativeintroduction.html
/var/tmp/portage/x11-libs/qt-assistant-4.7.0/work/qt-everywhere-opensource-src-4.7.0/src/declarative/util/qdeclarativetransition.cpp:54: Cannot link to 'declarative/animation/states' in Transition
/var/tmp/portage/x11-libs/qt-assistant-4.7.0/work/qt-everywhere-opensource-src-4.7.0/src/declarative/graphicsitems/qdeclarativetextinput.cpp:56: Cannot link to 'declarative/text/textselection' in TextInput
qdoc: Can't determine read-only status of QML property font.bold; writable assumed.
qdoc: Can't determine read-only status of QML property font.capitalization; writable assumed.
qdoc: Can't determine read-only status of QML property font.family; writable assumed.
qdoc: Can't determine read-only status of QML property font.italic; writable assumed.
qdoc: Can't determine read-only status of QML property font.letterSpacing; writable assumed.
qdoc: Can't determine read-only status of QML property font.pixelSize; writable assumed.
qdoc: Can't determine read-only status of QML property font.pointSize; writable assumed.
qdoc: Can't determine read-only status of QML property font.strikeout; writable assumed.
qdoc: Can't determine read-only status of QML property font.underline; writable assumed.
qdoc: Can't determine read-only status of QML property font.weight; writable assumed.
qdoc: Can't determine read-only status of QML property font.wordSpacing; writable assumed.
qdoc: Can't determine read-only status of QML property bottom; writable assumed.
qdoc: Can't determine read-only status of QML property top; writable assumed.
qdoc: Can't determine read-only status of QML property bottom; writable assumed.
qdoc: Can't determine read-only status of QML property decimals; writable assumed.
qdoc: Can't determine read-only status of QML property notation; writable assumed.
qdoc: Can't determine read-only status of QML property top; writable assumed.
qdoc: Can't determine read-only status of QML property regExp; writable assumed.
/var/tmp/portage/x11-libs/qt-assistant-4.7.0/work/qt-everywhere-opensource-src-4.7.0/src/declarative/util/qdeclarativepropertychanges.cpp:62: Cannot link to 'declarative/animation/states' in PropertyChanges
qdoc: Can't determine read-only status of QML property explicit; writable assumed.
/var/tmp/portage/x11-libs/qt-assistant-4.7.0/work/qt-everywhere-opensource-src-4.7.0/doc/src/declarative/animation.qdoc:28: Cannot link to 'declarative/animation/behaviors' in qdeclarativeanimation.html
/var/tmp/portage/x11-libs/qt-assistant-4.7.0/work/qt-everywhere-opensource-src-4.7.0/doc/src/declarative/animation.qdoc:28: Cannot link to 'declarative/animation/easing' in qdeclarativeanimation.html
/var/tmp/portage/x11-libs/qt-assistant-4.7.0/work/qt-everywhere-opensource-src-4.7.0/doc/src/declarative/animation.qdoc:28: Cannot link to 'declarative/animation/basics' in qdeclarativeanimation.html
/var/tmp/portage/x11-libs/qt-assistant-4.7.0/work/qt-everywhere-opensource-src-4.7.0/src/declarative/graphicsitems/qdeclarativelistview.cpp:1358: Cannot link to 'declarative/modelviews/listview' in ListView
/var/tmp/portage/x11-libs/qt-assistant-4.7.0/work/qt-everywhere-opensource-src-4.7.0/src/declarative/graphicsitems/qdeclarativelistview.cpp:1709: Cannot link to 'declarative/modelviews/listview' in ListView::highlight
/var/tmp/portage/x11-libs/qt-assistant-4.7.0/work/qt-everywhere-opensource-src-4.7.0/src/declarative/graphicsitems/qdeclarativelistview.cpp:1992: Cannot link to 'declarative/modelviews/listview' in ListView::section.property
/var/tmp/portage/x11-libs/qt-assistant-4.7.0/work/qt-everywhere-opensource-src-4.7.0/src/declarative/graphicsitems/qdeclarativepositioners.cpp:311: Cannot link to 'declarative/positioners' in Column
/var/tmp/portage/x11-libs/qt-assistant-4.7.0/work/qt-everywhere-opensource-src-4.7.0/src/declarative/graphicsitems/qdeclarativepositioners.cpp:476: Cannot link to 'declarative/positioners' in Row
/var/tmp/portage/x11-libs/qt-assistant-4.7.0/work/qt-everywhere-opensource-src-4.7.0/src/declarative/graphicsitems/qdeclarativepositioners.cpp:614: Cannot link to 'declarative/positioners' in Grid
/var/tmp/portage/x11-libs/qt-assistant-4.7.0/work/qt-everywhere-opensource-src-4.7.0/src/declarative/graphicsitems/qdeclarativepositioners.cpp:906: Cannot link to 'declarative/positioners' in Flow
/var/tmp/portage/x11-libs/qt-assistant-4.7.0/work/qt-everywhere-opensource-src-4.7.0/bin/qhelpgenerator: symbol lookup error: /usr/lib64/qt4/libQtNetwork.so.4: undefined symbol: _ZN11QDataStreamC1EP10QByteArrayi
make: *** [qch_docs] Error 127

emake failed
* ERROR: x11-libs/qt-assistant-4.7.0 failed:
* emake qch_docs failed
*
* Call stack:
* ebuild.sh, line 56: Called src_compile
* environment, line 3484: Called die
* The specific snippet of code:
* emake qch_docs || die "emake qch_docs failed";
*
* If you need support, post the output of 'emerge --info =x11-libs/qt-assistant-4.7.0',
* the complete build log and the output of 'emerge -pqv =x11-libs/qt-assistant-4.7.0'.
* The complete build log is located at '/var/log/portage/x11-libs:qt-assistant-4.7.0:20100923-154806.log'.
* The ebuild environment file is located at '/var/tmp/portage/x11-libs/qt-assistant-4.7.0/temp/environment'.
* S: '/var/tmp/portage/x11-libs/qt-assistant-4.7.0/work/qt-everywhere-opensource-src-4.7.0'


Quote:
gcc-config -l
[1] x86_64-pc-linux-gnu-4.3.5
[2] x86_64-pc-linux-gnu-4.3.5-hardenednopie
[3] x86_64-pc-linux-gnu-4.3.5-vanilla
[4] x86_64-pc-linux-gnu-4.4.4
[5] x86_64-pc-linux-gnu-4.4.4-hardenednopie
[6] x86_64-pc-linux-gnu-4.4.4-hardenednopiessp
[7] x86_64-pc-linux-gnu-4.4.4-hardenednossp
[8] x86_64-pc-linux-gnu-4.4.4-vanilla
[9] x86_64-pc-linux-gnu-4.5.1 *
[10] x86_64-pc-linux-gnu-4.5.1-hardenednopie
[11] x86_64-pc-linux-gnu-4.5.1-hardenednopiessp
[12] x86_64-pc-linux-gnu-4.5.1-hardenednossp
[13] x86_64-pc-linux-gnu-4.5.1-vanilla


any known issues with the binutils-version I'm using ?
_________________
Unofficial minimal livecd x86/amd64 w/reiser4+truecrypt (by Neo2)
2.6.37.2_plus_v1: BFS, CFS,THP,compaction, zcache or TOI
Hardcore Linux user since 2004 :D
Back to top
View user's profile Send private message
kernelOfTruth
Watchman
Watchman


Joined: 20 Dec 2005
Posts: 5681
Location: Vienna, Austria; Germany; hello world :)

PostPosted: Thu Sep 23, 2010 4:27 pm    Post subject: Reply with quote

emerge --info wrote:

Portage 2.2_rc83 (default/linux/amd64/10.0/desktop, gcc-4.5.1, glibc-2.12.1-r1, 2.6.36-rc4_plus_v3+ x86_64)
=================================================================
System uname: Linux-2.6.36-rc4_plus_v3+-x86_64-Intel-R-_Core-TM-_i7_CPU_860_@_2.80GHz-with-gentoo-2.0.1
Timestamp of tree: Wed, 22 Sep 2010 18:15:01 +0000
app-shells/bash: 4.1_p7
dev-java/java-config: 2.1.11
dev-lang/python: 2.6.5-r3, 3.1.2-r4
dev-util/cmake: 2.8.1-r2
sys-apps/baselayout: 2.0.1
sys-apps/openrc: 0.6.3
sys-apps/sandbox: 2.3-r1
sys-devel/autoconf: 2.13, 2.67
sys-devel/automake: 1.4_p6-r1, 1.5-r1, 1.6.3-r1, 1.7.9-r2, 1.8.5-r4, 1.9.6-r3, 1.10.3, 1.11.1
sys-devel/binutils: 2.20.1, 2.20.51.0.8, 2.20.51.0.9, 2.20.51.0.10, 2.20.51.0.11
sys-devel/gcc: 4.3.5, 4.4.4-r1, 4.5.1
sys-devel/gcc-config: 1.4.1
sys-devel/libtool: 2.2.10
sys-devel/make: 3.81-r2
virtual/os-headers: 2.6.35 (sys-kernel/linux-headers)
ACCEPT_KEYWORDS="amd64 ~amd64"
ACCEPT_LICENSE="* @EULA skype-eula PUEL dlj-1.1 sun-bcla-java-vm googleearth AdobeFlash-10"
CBUILD="x86_64-pc-linux-gnu"
CFLAGS="-O2 -march=core2 -mtune=core2 -pipe"
CHOST="x86_64-pc-linux-gnu"
CONFIG_PROTECT="/etc /usr/kde/3.5/env /usr/kde/3.5/share/config /usr/kde/3.5/shutdown /usr/share/X11/xkb /usr/share/config /var/lib/hsqldb"
CONFIG_PROTECT_MASK="/etc/X11/xorg.conf /etc/ca-certificates.conf /etc/env.d /etc/env.d/java/ /etc/eselect/postgresql /etc/fonts/fonts.conf /etc/gconf /etc/gentoo-release /etc/php/apache2-php5/ext-active/ /etc/php/cgi-php5/ext-active/ /etc/php/cli-php5/ext-active/ /etc/revdep-rebuild /etc/sandbox.d /etc/terminfo /etc/texmf/language.dat.d /etc/texmf/language.def.d /etc/texmf/updmap.d /etc/texmf/web2c /usr/X11R6/bin/startx"
CXXFLAGS="-O2 -march=core2 -mtune=core2 -pipe"
DISTDIR="/usr/portage/distfiles"
EMERGE_DEFAULT_OPTS="--keep-going"
FEATURES="assume-digests candy distlocks fixlafiles fixpackages metadata-transfer news parallel-fetch preserve-libs protect-owned sandbox sfperms strict unknown-features-warn unmerge-logs unmerge-orphans userfetch usersandbox"
GENTOO_MIRRORS="ftp://ftp.join.uni-muenster.de/pub/linux/distributions/gentoo ftp://ftp.join.uni-muenster.de/pub/linux/distributions/gentoo"
LANG="en_US.utf8"
LDFLAGS="-Wl,-O1 -Wl,--as-needed"
LINGUAS="de en"
MAKEOPTS="-j9"
PKGDIR="/usr/portage/packages"
PORTAGE_CONFIGROOT="/"
PORTAGE_RSYNC_OPTS="--recursive --links --safe-links --perms --times --compress --force --whole-file --delete --stats --timeout=180 --exclude=/distfiles --exclude=/local --exclude=/packages"
PORTAGE_TMPDIR="/var/tmp"
PORTDIR="/usr/portage"
PORTDIR_OVERLAY="/usr/local/portage/layman/openoffice-geki /usr/local/portage/layman/kist-overlay /usr/local/portage/layman/piczu /usr/local/portage/layman/jasiu /usr/local/portage/layman/gentoo-quebec /usr/gentoo/overlays /usr/gentoo/overlays/kde-testing /usr/gentoo/overlays/kde-sunset /usr/gentoo/overlays/qting-edge /usr/gentoo/overlays/desktop-effects /usr/gentoo/overlays/java /usr/gentoo/overlays/java-experimental /usr/gentoo/overlays/gnome /usr/gentoo/overlays/sunrise /usr/gentoo/overlays/voip /usr/gentoo/overlays/jokey /usr/gentoo/overlays/virtualbox /usr/gentoo/overlays/vmware /usr/gentoo/overlays/suka /usr/gentoo/overlays/hardened-dev /usr/gentoo/overlays/tallica /usr/gentoo/overlays/mozilla"
SYNC="rsync://rsync.europe.gentoo.org/gentoo-portage"
USE="X a52 aac aalib acl acpi akonadi alsa amd64 aspell audio avahi berkdb bluetooth branding bsf bzip2 cairo cdda cddb cdr cjk cleartype cli consolekit contrast cracklib crypt cups curl cxx dbus device-mapper djvu dmraid dri dts dvd dvdr dvi ebook eds emboss encode exif extensions extras faac faad fam fat fax fbcon ffmpeg fftw firefox flac fontconfig fortran fuse gd gdbm gdu gif gimp glade gmp gnome gnome-vfs gnutls gpm gsf gstreamer gtk guile hal handbook hardened hashstyle hfs html iconv id3tag idn imagemagick imlib inotify ipv6 ithreads java javascript jfs jpeg jpeg2k kde kdehiddenvisibility kipi lame latex lcms ldap libnotify lm_sensors logrotate lzma lzo mad mdadm mikmod mjpeg mmap mmx mng mode-paranoid modplug modules mp3 mp4 mpeg mudflap multilib multislot musepack musicbrainz mysql mysqli ncurses network networking networkmanager nis nls nptl nptlonly nss ntfs ogg openexr opengl openmp pam pango pcre pdf perl pg-intdatetime phonon pic pie pkcs11 plasma pmu png policykit postproc postscript ppds pppd pulseaudio python qimageblitz qscintilla qt3support qt4 quicktime qwt raster readline reflection reiser4 reiserfs resolvconf samba sasl scanner sdl semantic-desktop session shout slang smp sndfile sound soup spell sqlite sse sse2 sse3 sse4 ssl ssse3 startup-notification svg sysfs t1lib tcl tcpd theora threads thumbnail tiff tk toolbar truetype twolame unicode urandom usb utils v4l v4l2 vcd video vorbis wav wavpack webkit wmf x264 xcb xcomposite xfs xft xinerama xml xmp xorg xulrunner xv xvid xvmc zip zlib" ALSA_CARDS="hda-intel" ALSA_PCM_PLUGINS="adpcm alaw asym copy dmix dshare dsnoop empty extplug file hooks iec958 ioplug ladspa lfloat linear meter mmap_emul mulaw multi null plug rate route share shm softvol" APACHE2_MODULES="alias autoindex auth_basic authn_alias authn_anon authn_dbm authn_default authn_file authz_default authz_groupfile authz_host authz_owner authz_user authz_dbm cache dav dav_fs dav_lock deflate dir disk_cache env expires ext_filter file_cache filter headers include info mime mime_magic negotiation setenvif speling status unique_id vhost_alias" APACHE2_MPMS="worker" CAMERAS="canon casio kodak konica minolta mustek panasonic polaroid ricoh samsung sonix sonydscf1 sonydscf55 soundvision toshiba" ELIBC="glibc" INPUT_DEVICES="keyboard mouse linuxinput ps2mouse serialmouse evdev" KERNEL="linux" LCD_DEVICES="bayrad cfontz cfontz633 glk hd44780 lb216 lcdm001 mtxorb ncurses text" LINGUAS="de en" LIRC_DEVICES="asusdh" RUBY_TARGETS="ruby18" USERLAND="GNU" VIDEO_CARDS="ati vesa vga radeon r600" XTABLES_ADDONS="quota2 psd pknock lscan length2 ipv4options ipset ipp2p iface geoip fuzzy condition tee tarpit sysrq steal rawnat logmark ipmark dhcpmac delude chaos account"
Unset: CPPFLAGS, CTARGET, FFLAGS, INSTALL_MASK, LC_ALL, PORTAGE_BUNZIP2_COMMAND, PORTAGE_COMPRESS, PORTAGE_COMPRESS_FLAGS, PORTAGE_RSYNC_EXTRA_OPTS

_________________
Unofficial minimal livecd x86/amd64 w/reiser4+truecrypt (by Neo2)
2.6.37.2_plus_v1: BFS, CFS,THP,compaction, zcache or TOI
Hardcore Linux user since 2004 :D
Back to top
View user's profile Send private message
Display posts from previous:   
Reply to topic    Gentoo Forums Forum Index Unsupported Software All times are GMT
Goto page Previous  1, 2, 3 ... 12, 13, 14, 15, 16  Next
Page 13 of 16

 
Jump to:  
You cannot post new topics in this forum
You cannot reply to topics in this forum
You cannot edit your posts in this forum
You cannot delete your posts in this forum
You cannot vote in polls in this forum