Gentoo Forums
Gentoo Forums
Gentoo Forums
Quick Search: in
[EBUILD] Kadu 0.12.0 (modularne) - roslin
View unanswered posts
View posts from last 24 hours
View posts from last 7 days

Goto page 1, 2, 3, 4, 5, 6, 7, 8, 9  Next  
Reply to topic    Gentoo Forums Forum Index Polskie forum (Polish)
View previous topic :: View next topic  
Author Message
mziab
l33t
l33t


Joined: 01 Oct 2004
Posts: 637

PostPosted: Wed Dec 10, 2008 4:57 pm    Post subject: [EBUILD] Kadu 0.12.0 (modularne) - roslin Reply with quote

Niniejszy melduję, że do roslin uberlay zawitał komplet modularnych ebuildów do najnowszej wersji Kadu. Ebuildy były co prawda od jakiegoś czasu, ale przed chwilą je odmaskowałem, żeby oszczędzić kłopotu użytkownikom.

1. Jak to się je?
Krok 1:
Dodajemy repozytorium roslin.
Krok 2:
Przystępujemy do właściwej instalacji :)
Code:
emerge kadu

Krok 3 (opcjonalny):
Doinstalowujemy dodatkowe wtyczki, których listę można uzyskać za pomocą (wymaga pakietu eix):
Code:
eix kadu-


2. Nowe Kadu koliduje ze starym! Co robić?
Przede wszystkim warto zacząć od usunięcia poprzedniej wersji pakietu kadu (jeśli używaliśmy monolitu) lub kadu-core (jeśli używaliśmy modularnych ebuildów). Jeśli to nie pomogło, problem leży najpewniej w starej wtyczce, której nie dostosowano do najnowszego Kadu. Wtyczki takie należy odinstalować.

3. Kogo męczyć?
Wszelkie prośby, zapytania i bugreporty co do ebuildów zgłaszajcie w tym wątku, do mnie na PM, bądź na adres <mziab at o2 pl>. W miarę czasu i możliwości będę starał się usuwać usterki i dodawać nowe wersje Kadu i modułów.
_________________
Gentoo Linux 13.0 | 3.8.0 | glibc 2.15 | gcc 4.7.3

mteam | mziab's blog | roslin


Last edited by mziab on Mon Jul 09, 2012 5:17 pm; edited 10 times in total
Back to top
View user's profile Send private message
quosek
Apprentice
Apprentice


Joined: 07 Mar 2006
Posts: 270

PostPosted: Wed Dec 10, 2008 7:28 pm    Post subject: Reply with quote

mucios gracias ;)
ja mam tylko pytanie - czy nadal ktos rozwija 2 ebuildowa wersje kadu ?
Back to top
View user's profile Send private message
mziab
l33t
l33t


Joined: 01 Oct 2004
Posts: 637

PostPosted: Sun Jan 25, 2009 7:38 pm    Post subject: Reply with quote

Kadu 0.6.5.1 dostępne do konsumpcji.
_________________
Gentoo Linux 13.0 | 3.8.0 | glibc 2.15 | gcc 4.7.3

mteam | mziab's blog | roslin
Back to top
View user's profile Send private message
reavertm
Developer
Developer


Joined: 05 Feb 2004
Posts: 264
Location: Wrocław

PostPosted: Tue Jan 27, 2009 3:57 am    Post subject: Reply with quote

Szkoda, że modularne - monolityczne miałyby większe szanse na to, że jakiś developer się nimi zaopiekuje.
_________________
Maciek
Back to top
View user's profile Send private message
mziab
l33t
l33t


Joined: 01 Oct 2004
Posts: 637

PostPosted: Tue Jan 27, 2009 2:03 pm    Post subject: Reply with quote

Zdaję sobie sprawę, że szanse na wejście 50+ ebuildów i dwóch eclass do portage są nikłe. Ale trudno też zaprzeczyć, że modularne ebuildy dają większą kontrolę nad tym, co jest instalowane. Może i żaden deweloper się tym nie zaopiekuje, ale póki co ja sprawuję nad tym pieczę i jakoś nikt nie narzeka :)
_________________
Gentoo Linux 13.0 | 3.8.0 | glibc 2.15 | gcc 4.7.3

mteam | mziab's blog | roslin
Back to top
View user's profile Send private message
Belliash
Advocate
Advocate


Joined: 24 Nov 2004
Posts: 2402
Location: Legnica, Poland

PostPosted: Tue Jan 27, 2009 7:33 pm    Post subject: Reply with quote

mziab wrote:
i jakoś nikt nie narzeka :)


a mamy zaczac? :P
_________________
Asio Software Technologies
Belliash IT Weblog
Back to top
View user's profile Send private message
mziab
l33t
l33t


Joined: 01 Oct 2004
Posts: 637

PostPosted: Tue Jan 27, 2009 7:40 pm    Post subject: Reply with quote

Jeżeli ma ci od tego być lżej na wątrobie... U mnie konstruktywna krytyka jest zawsze mile widziana. Wszelka inna trafia do /dev/null :P
_________________
Gentoo Linux 13.0 | 3.8.0 | glibc 2.15 | gcc 4.7.3

mteam | mziab's blog | roslin
Back to top
View user's profile Send private message
darc
n00b
n00b


Joined: 03 Sep 2006
Posts: 14

PostPosted: Sun Feb 08, 2009 6:54 pm    Post subject: Reply with quote

dziala kadu-core-0.6.0.3? bo dostaje error:

Code:
configure: error: Module agent selected as shared. It depends on notify, however notify was not selected at all!


i zamiast instalowac same core to robi sie monolit.

EDIT:
chyba flaga --disable-autodownload jest ignorowana przez configure; poki co zrobilem sobie -r1 w local overlay z wylaczonym autodownloadem tak jak w portage:)
Back to top
View user's profile Send private message
mziab
l33t
l33t


Joined: 01 Oct 2004
Posts: 637

PostPosted: Sun Feb 08, 2009 7:15 pm    Post subject: Reply with quote

Naprawione. Przy ostatnich porządkach niepotrzebnie dodałem EAPI=2. Korzystając z okazji zrobiłem ebuildowi mały lifting. Po najbliższej synchronizacji repo będzie już ok.
_________________
Gentoo Linux 13.0 | 3.8.0 | glibc 2.15 | gcc 4.7.3

mteam | mziab's blog | roslin
Back to top
View user's profile Send private message
reavertm
Developer
Developer


Joined: 05 Feb 2004
Posts: 264
Location: Wrocław

PostPosted: Thu Feb 26, 2009 6:45 am    Post subject: Reply with quote

Jeśli jest ktoś chętny do testowania kandydata do portage...
_________________
Maciek
Back to top
View user's profile Send private message
acei
Tux's lil' helper
Tux's lil' helper


Joined: 16 Sep 2007
Posts: 90

PostPosted: Thu Feb 26, 2009 4:29 pm    Post subject: Reply with quote

reavertm wrote:
Jeśli jest ktoś chętny do testowania kandydata do portage...


Właśnie testuje. Flaga amarok ciągnie za sobą amaroka 1.4 i kde 3.5. Trochę paskudnie jak dla mnie.
EDIT: doczytałem się, że jest też amarok2 :oops:

Poza tym:
Code:
Scanning dependencies of target account_management                                   
[ 27%] Building CXX object modules/advanced_userlist/CMakeFiles/advanced_userlist.dir/advanced_userlist.cpp.o                                                             
[ 27%] In file included from /var/tmp/portage/net-im/kadu-0.6.5.1/work/kadu/modules/qt4_sound/qt4_sound.cpp:15:                                                           
/var/tmp/portage/net-im/kadu-0.6.5.1/work/kadu/modules/qt4_sound/../sound/sound.h:40: warning: ‘typedef’ was ignored in this declaration                                 
Building CXX object modules/account_management/CMakeFiles/account_management.dir/account_management.cpp.o                                                                 
Linking CXX shared module libqt4_sound.so                                           
[ 27%] Built target qt4_sound                                                       
[ 27%] Building CXX object modules/advanced_userlist/CMakeFiles/advanced_userlist.dir/main.cpp.o                                                                         
/var/tmp/portage/net-im/kadu-0.6.5.1/work/kadu/modules/account_management/account_management.cpp: In constructor ‘AccountManagement::AccountManagement()’:               
/var/tmp/portage/net-im/kadu-0.6.5.1/work/kadu/modules/account_management/account_management.cpp:53: error: invalid conversion from ‘const char*’ to ‘char*’             
/var/tmp/portage/net-im/kadu-0.6.5.1/work/kadu/modules/account_management/account_management.cpp:53: error:   initializing argument 4 of ‘ActionDescription::ActionDescription(ActionDescription::ActionType, const QString&, QObject*, char*, const QString&, const QString&, bool, const QString&, void (*)(KaduAction*))’                       
/var/tmp/portage/net-im/kadu-0.6.5.1/work/kadu/modules/account_management/account_management.cpp:60: error: invalid conversion from ‘const char*’ to ‘char*’             
/var/tmp/portage/net-im/kadu-0.6.5.1/work/kadu/modules/account_management/account_management.cpp:60: error:   initializing argument 4 of ‘ActionDescription::ActionDescription(ActionDescription::ActionType, const QString&, QObject*, char*, const QString&, const QString&, bool, const QString&, void (*)(KaduAction*))’                       
/var/tmp/portage/net-im/kadu-0.6.5.1/work/kadu/modules/account_management/account_management.cpp:67: error: invalid conversion from ‘const char*’ to ‘char*’             
/var/tmp/portage/net-im/kadu-0.6.5.1/work/kadu/modules/account_management/account_management.cpp:67: error:   initializing argument 4 of ‘ActionDescription::ActionDescription(ActionDescription::ActionType, const QString&, QObject*, char*, const QString&, const QString&, bool, const QString&, void (*)(KaduAction*))’                       
/var/tmp/portage/net-im/kadu-0.6.5.1/work/kadu/modules/account_management/account_management.cpp:74: error: invalid conversion from ‘const char*’ to ‘char*’             
/var/tmp/portage/net-im/kadu-0.6.5.1/work/kadu/modules/account_management/account_management.cpp:74: error:   initializing argument 4 of ‘ActionDescription::ActionDescription(ActionDescription::ActionType, const QString&, QObject*, char*, const QString&, const QString&, bool, const QString&, void (*)(KaduAction*))’                       
make[2]: *** [modules/account_management/CMakeFiles/account_management.dir/account_management.cpp.o] Błąd 1                                                               
make[1]: *** [modules/account_management/CMakeFiles/account_management.dir/all] Błąd 2                                                                                   
[ 27%] make[1]: *** Oczekiwanie na niezakończone zadania....                         
Building CXX object modules/advanced_userlist/CMakeFiles/advanced_userlist.dir/moc_advanced_userlist.cxx.o                                                               
Linking CXX shared module libadvanced_userlist.so                                   
[ 27%] Built target advanced_userlist                                               
make: *** [all] Błąd 2                                                               
 *                                                                                   
 * ERROR: net-im/kadu-0.6.5.1 failed.   
 * Call stack:                                                                       
 *               ebuild.sh, line   49:  Called src_compile                           
 *             environment, line 2747:  Called cmake-utils_src_compile               
 *             environment, line  739:  Called cmake-utils_src_make                 
 *             environment, line  782:  Called die                                   
 * The specific snippet of code:                                                     
 *           emake "$@" || die "Make failed!";                                       
 *  The die message:                                                                 
 *   Make failed!       

_________________
GA965P+E6320+Geil 2*1GB CL4+ATI HD6570 ~amd64
Back to top
View user's profile Send private message
mziab
l33t
l33t


Joined: 01 Oct 2004
Posts: 637

PostPosted: Thu Feb 26, 2009 4:35 pm    Post subject: Reply with quote

No właśnie, bo są dwa moduły do amaroka - amarok1_mediaplayer i amarok2_mediaplayer.

acei: Ktoś zgłaszał podobny bug na forum Kadu. Rzekomo to wina Qt 4.5_rc1. Sęk w tym, że lazy_bum wczoraj próbował i buduje mu się bez problemów na GCC 4.3.3 i Qt 4.5_rc1. Nie wiem od czego to zależy. Pokaż emerge --info.
_________________
Gentoo Linux 13.0 | 3.8.0 | glibc 2.15 | gcc 4.7.3

mteam | mziab's blog | roslin
Back to top
View user's profile Send private message
acei
Tux's lil' helper
Tux's lil' helper


Joined: 16 Sep 2007
Posts: 90

PostPosted: Thu Feb 26, 2009 4:39 pm    Post subject: Reply with quote

emerge --info

Code:
Portage 2.2_rc23 (default/linux/amd64/2008.0, gcc-4.3.3, glibc-2.9_p20081201-r2, 2.6.28-gentoo-r1 x86_64)                                                                 
=================================================================                   
System uname: Linux-2.6.28-gentoo-r1-x86_64-Intel-R-_Core-TM-2_CPU_6320_@_1.86GHz-with-glibc2.2.5                                                                         
Timestamp of tree: Thu, 26 Feb 2009 15:30:16 +0000                                   
ccache version 2.4 [disabled]                                                       
app-shells/bash:     3.2_p48-r1                                                     
dev-java/java-config: 1.3.7-r1, 2.1.7                                               
dev-lang/python:     2.5.4-r2                                                       
dev-util/ccache:     2.4-r8                                                         
dev-util/cmake:      2.6.2-r1                                                       
sys-apps/baselayout: 2.0.0                                                           
sys-apps/openrc:     0.4.3-r1                                                       
sys-apps/sandbox:    1.3.8                                                           
sys-devel/autoconf:  2.13, 2.63                                                     
sys-devel/automake:  1.5, 1.7.9-r1, 1.8.5-r3, 1.9.6-r2, 1.10.2                       
sys-devel/binutils:  2.19.1                                                         
sys-devel/gcc-config: 1.4.1                                                         
sys-devel/libtool:   2.2.6a                                                         
virtual/os-headers:  2.6.28-r1                                                       
ACCEPT_KEYWORDS="amd64 ~amd64"                                                       
CBUILD="x86_64-pc-linux-gnu"                                                         
CFLAGS="-march=core2 -O2 -pipe"                                                     
CHOST="x86_64-pc-linux-gnu"                                                         
CONFIG_PROTECT="/etc /usr/kde/3.5/env /usr/kde/3.5/share/config /usr/kde/3.5/shutdown /usr/kde/4.2/env /usr/kde/4.2/share/config /usr/kde/4.2/shutdown /usr/share/config"
CONFIG_PROTECT_MASK="/etc/ca-certificates.conf /etc/env.d /etc/env.d/java/ /etc/eselect/postgresql /etc/fonts/fonts.conf /etc/gconf /etc/gentoo-release /etc/php/apache2-php5/ext-active/ /etc/php/cgi-php5/ext-active/ /etc/php/cli-php5/ext-active/ /etc/revdep-rebuild /etc/sandbox.d /etc/terminfo /etc/udev/rules.d"                           
CXXFLAGS="-march=core2 -O2 -pipe"                                                   
DISTDIR="/usr/portage/distfiles"                                                     
FEATURES="distlocks fixpackages parallel-fetch preserve-libs protect-owned sandbox sfperms strict unmerge-orphans userfetch"                                             
GENTOO_MIRRORS="http://gentoo.po.opole.pl"                                           
LANG="pl_PL.UTF-8"                                                                   
LC_ALL="pl_PL.UTF-8"                                                                 
LDFLAGS="-Wl,-O1"                                                                   
LINGUAS="en pl"                                                                     
MAKEOPTS="-j3"
PKGDIR="/usr/portage/packages"
PORTAGE_RSYNC_OPTS="--recursive --links --safe-links --perms --times --compress --force --whole-file --delete --stats --timeout=180 --exclude=/distfiles --exclude=/local--exclude=/packages"
PORTAGE_TMPDIR="/var/tmp"
PORTDIR="/usr/portage"
PORTDIR_OVERLAY="/usr/local/portage-java /usr/local/portage/layman/desktop-effects /usr/local/portage/layman/kde-testing /usr/local/portage/layman/java-overlay"
SYNC="rsync://rsync.gentoo.org/gentoo-portage"
USE="X acl alsa amd64 apache2 arts atm berkdb bzip2 cli cracklib crypt cups dri fortran gdbm gpm hal iconv ipv6 isdnlog kde kdeprefix lm_sensors midi mmx mudflap multilib mysql mysqli ncurses nls nptl nptlonly opengl openmp pam pcre perl pppd python readline reflection samba session spl sse sse2 ssl sysfs tcpd unicode xcomposite xorg zlib" ALSA_CARDS="ali5451 als4000 atiixp atiixp-modem bt87x ca0106 cmipci emu10k1x ens1370 ens1371 es1938 es1968 fm801 hda-intel intel8x0 intel8x0m maestro3 trident usb-audio via82xx via82xx-modem ymfpci" ALSA_PCM_PLUGINS="adpcm alaw asym copy dmix dshare dsnoop empty extplug file hooks iec958 ioplug ladspa lfloat linear meter mmap_emul mulaw multi null plug rate route share shm softvol" APACHE2_MODULES="actions alias auth_basic auth_digest authn_anon authn_dbd authn_dbm authn_default authn_file authz_dbm authz_default authz_groupfile authz_host authz_owner authz_user autoindex cache dav dav_fs dav_lock dbd deflate dir disk_cache env expires ext_filter file_cache filter headers ident imagemap include info log_config logio mem_cache mime mime_magic negotiation proxy proxy_ajp proxy_balancer proxy_connect proxy_ftp proxy_http rewrite setenvif so speling status unique_id userdir usertrack vhost_alias" ELIBC="glibc" INPUT_DEVICES="keyboard mouse" KERNEL="linux" LCD_DEVICES="bayrad cfontz cfontz633 glk hd44780 lb216 lcdm001 mtxorb ncurses text" LINGUAS="en pl" USERLAND="GNU" VIDEO_CARDS="fglrx"
Unset:  CPPFLAGS, CTARGET, EMERGE_DEFAULT_OPTS, FFLAGS, INSTALL_MASK, PORTAGE_COMPRESS, PORTAGE_COMPRESS_FLAGS, PORTAGE_RSYNC_EXTRA_OPTS

_________________
GA965P+E6320+Geil 2*1GB CL4+ATI HD6570 ~amd64
Back to top
View user's profile Send private message
mziab
l33t
l33t


Joined: 01 Oct 2004
Posts: 637

PostPosted: Thu Feb 26, 2009 4:42 pm    Post subject: Reply with quote

Jak na razie główna różnica taka, że ty masz amd64, a lazy_bum sprawdzał na x86. Być może to właściwy trop.
_________________
Gentoo Linux 13.0 | 3.8.0 | glibc 2.15 | gcc 4.7.3

mteam | mziab's blog | roslin
Back to top
View user's profile Send private message
reavertm
Developer
Developer


Joined: 05 Feb 2004
Posts: 264
Location: Wrocław

PostPosted: Fri Feb 27, 2009 7:01 pm    Post subject: Reply with quote

Hmm, chyba trzeba będzie backportować z trunk jakieś łaty, damned...
_________________
Maciek
Back to top
View user's profile Send private message
acei
Tux's lil' helper
Tux's lil' helper


Joined: 16 Sep 2007
Posts: 90

PostPosted: Fri Feb 27, 2009 7:02 pm    Post subject: Reply with quote

mziab wrote:
Ktoś zgłaszał podobny bug na forum Kadu. Rzekomo to wina Qt 4.5_rc1. Sęk w tym, że lazy_bum wczoraj próbował i buduje mu się bez problemów na GCC 4.3.3 i Qt 4.5_rc1.


Gdy próbuję ebuild-a z roslin-a, dostaję ten sam błąd co na forum kadu. Podobno downgrade qt do 4.4.2 pomaga.

Tyle, że do tej pory kadu bez problemu budowało się na qt-4.5 i .... nadal się buduje, o ile nie używam ebuildów. :?
_________________
GA965P+E6320+Geil 2*1GB CL4+ATI HD6570 ~amd64
Back to top
View user's profile Send private message
mziab
l33t
l33t


Joined: 01 Oct 2004
Posts: 637

PostPosted: Fri Feb 27, 2009 7:15 pm    Post subject: Reply with quote

acei: Jedną łatę na Qt 4.5_rc1 już dodałem. Co więcej, shade'owi wszystko się kompiluje pod amd64, gcc 4.3.3 i Qt 4.5_rc1 (przynajmniej z tego, co mówił lazy_bum). Nie wiem czemu u ciebie jest inaczej. Wydaje mi się, że całą sprawę rozwiązałoby dopisanie paru const przy deklaracjach zmiennych.
_________________
Gentoo Linux 13.0 | 3.8.0 | glibc 2.15 | gcc 4.7.3

mteam | mziab's blog | roslin
Back to top
View user's profile Send private message
szachy
n00b
n00b


Joined: 14 Feb 2005
Posts: 31
Location: Tarnów, Poland

PostPosted: Fri Feb 27, 2009 8:18 pm    Post subject: Reply with quote

Code:
[ 41%] Building CXX object kadu-core/CMakeFiles/kadu.dir/chat_message.cpp.o                                                                                                                                                       
/var/tmp/portage/net-im/kadu-core-0.6.5.1-r1/work/kadu/kadu-core/chat_manager.cpp: In constructor ‘ChatManager::ChatManager(QObject*)’:                                                                                           
/var/tmp/portage/net-im/kadu-core-0.6.5.1-r1/work/kadu/kadu-core/chat_manager.cpp:82: error: invalid conversion from ‘const char*’ to ‘char*’                                                                                     
/var/tmp/portage/net-im/kadu-core-0.6.5.1-r1/work/kadu/kadu-core/chat_manager.cpp:82: error:   initializing argument 4 of ‘ActionDescription::ActionDescription(ActionDescription::ActionType, const QString&, QObject*, char*, const QString&, const QString&, bool, const QString&, void (*)(KaduAction*))’                                                                                                                                                       
/var/tmp/portage/net-im/kadu-core-0.6.5.1-r1/work/kadu/kadu-core/chat_manager.cpp:89: error: invalid conversion from ‘const char*’ to ‘char*’                                                                                     
/var/tmp/portage/net-im/kadu-core-0.6.5.1-r1/work/kadu/kadu-core/chat_manager.cpp:89: error:   initializing argument 4 of ‘ActionDescription::ActionDescription(ActionDescription::ActionType, const QString&, QObject*, char*, const QString&, const QString&, bool, const QString&, void (*)(KaduAction*))’                                                                                                                                                       
/var/tmp/portage/net-im/kadu-core-0.6.5.1-r1/work/kadu/kadu-core/chat_manager.cpp:95: error: invalid conversion from ‘const char*’ to ‘char*’                                                                                     
/var/tmp/portage/net-im/kadu-core-0.6.5.1-r1/work/kadu/kadu-core/chat_manager.cpp:95: error:   initializing argument 4 of ‘ActionDescription::ActionDescription(ActionDescription::ActionType, const QString&, QObject*, char*, const QString&, const QString&, bool, const QString&, void (*)(KaduAction*))’                                                                                                                                                       
/var/tmp/portage/net-im/kadu-core-0.6.5.1-r1/work/kadu/kadu-core/chat_manager.cpp:101: error: invalid conversion from ‘const char*’ to ‘char*’                                                                                   
/var/tmp/portage/net-im/kadu-core-0.6.5.1-r1/work/kadu/kadu-core/chat_manager.cpp:101: error:   initializing argument 4 of ‘ActionDescription::ActionDescription(ActionDescription::ActionType, const QString&, QObject*, char*, const QString&, const QString&, bool, const QString&, void (*)(KaduAction*))’                                                                                                                                                     
/var/tmp/portage/net-im/kadu-core-0.6.5.1-r1/work/kadu/kadu-core/chat_manager.cpp:107: error: invalid conversion from ‘const char*’ to ‘char*’                                                                                   
/var/tmp/portage/net-im/kadu-core-0.6.5.1-r1/work/kadu/kadu-core/chat_manager.cpp:107: error:   initializing argument 4 of ‘ActionDescription::ActionDescription(ActionDescription::ActionType, const QString&, QObject*, char*, const QString&, const QString&, bool, const QString&, void (*)(KaduAction*))’                                                                                                                                                     
/var/tmp/portage/net-im/kadu-core-0.6.5.1-r1/work/kadu/kadu-core/chat_manager.cpp:113: error: invalid conversion from ‘const char*’ to ‘char*’                                                                                   
/var/tmp/portage/net-im/kadu-core-0.6.5.1-r1/work/kadu/kadu-core/chat_manager.cpp:113: error:   initializing argument 4 of ‘ActionDescription::ActionDescription(ActionDescription::ActionType, const QString&, QObject*, char*, const QString&, const QString&, bool, const QString&, void (*)(KaduAction*))’                                                                                                                                                     
/var/tmp/portage/net-im/kadu-core-0.6.5.1-r1/work/kadu/kadu-core/chat_manager.cpp:120: error: invalid conversion from ‘const char*’ to ‘char*’                                                                                   
/var/tmp/portage/net-im/kadu-core-0.6.5.1-r1/work/kadu/kadu-core/chat_manager.cpp:120: error:   initializing argument 4 of ‘ActionDescription::ActionDescription(ActionDescription::ActionType, const QString&, QObject*, char*, const QString&, const QString&, bool, const QString&, void (*)(KaduAction*))’                                                                                                                                                     
/var/tmp/portage/net-im/kadu-core-0.6.5.1-r1/work/kadu/kadu-core/chat_manager.cpp:128: error: invalid conversion from ‘const char*’ to ‘char*’                                                                                   
/var/tmp/portage/net-im/kadu-core-0.6.5.1-r1/work/kadu/kadu-core/chat_manager.cpp:128: error:   initializing argument 4 of ‘ActionDescription::ActionDescription(ActionDescription::ActionType, const QString&, QObject*, char*, const QString&, const QString&, bool, const QString&, void (*)(KaduAction*))’                                                                                                                                                     
/var/tmp/portage/net-im/kadu-core-0.6.5.1-r1/work/kadu/kadu-core/chat_manager.cpp:135: error: invalid conversion from ‘const char*’ to ‘char*’                                                                                   
/var/tmp/portage/net-im/kadu-core-0.6.5.1-r1/work/kadu/kadu-core/chat_manager.cpp:135: error:   initializing argument 4 of ‘ActionDescription::ActionDescription(ActionDescription::ActionType, const QString&, QObject*, char*, const QString&, const QString&, bool, const QString&, void (*)(KaduAction*))’
/var/tmp/portage/net-im/kadu-core-0.6.5.1-r1/work/kadu/kadu-core/chat_manager.cpp:142: error: invalid conversion from ‘const char*’ to ‘char*’
/var/tmp/portage/net-im/kadu-core-0.6.5.1-r1/work/kadu/kadu-core/chat_manager.cpp:142: error:   initializing argument 4 of ‘ActionDescription::ActionDescription(ActionDescription::ActionType, const QString&, QObject*, char*, const QString&, const QString&, bool, const QString&, void (*)(KaduAction*))’
/var/tmp/portage/net-im/kadu-core-0.6.5.1-r1/work/kadu/kadu-core/chat_manager.cpp:149: error: invalid conversion from ‘const char*’ to ‘char*’
/var/tmp/portage/net-im/kadu-core-0.6.5.1-r1/work/kadu/kadu-core/chat_manager.cpp:149: error:   initializing argument 4 of ‘ActionDescription::ActionDescription(ActionDescription::ActionType, const QString&, QObject*, char*, const QString&, const QString&, bool, const QString&, void (*)(KaduAction*))’
/var/tmp/portage/net-im/kadu-core-0.6.5.1-r1/work/kadu/kadu-core/chat_manager.cpp:155: error: invalid conversion from ‘const char*’ to ‘char*’
/var/tmp/portage/net-im/kadu-core-0.6.5.1-r1/work/kadu/kadu-core/chat_manager.cpp:155: error:   initializing argument 4 of ‘ActionDescription::ActionDescription(ActionDescription::ActionType, const QString&, QObject*, char*, const QString&, const QString&, bool, const QString&, void (*)(KaduAction*))’
/var/tmp/portage/net-im/kadu-core-0.6.5.1-r1/work/kadu/kadu-core/chat_manager.cpp:162: error: invalid conversion from ‘const char*’ to ‘char*’
/var/tmp/portage/net-im/kadu-core-0.6.5.1-r1/work/kadu/kadu-core/chat_manager.cpp:162: error:   initializing argument 4 of ‘ActionDescription::ActionDescription(ActionDescription::ActionType, const QString&, QObject*, char*, const QString&, const QString&, bool, const QString&, void (*)(KaduAction*))’
/var/tmp/portage/net-im/kadu-core-0.6.5.1-r1/work/kadu/kadu-core/chat_manager.cpp:169: error: invalid conversion from ‘const char*’ to ‘char*’
/var/tmp/portage/net-im/kadu-core-0.6.5.1-r1/work/kadu/kadu-core/chat_manager.cpp:169: error:   initializing argument 4 of ‘ActionDescription::ActionDescription(ActionDescription::ActionType, const QString&, QObject*, char*, const QString&, const QString&, bool, const QString&, void (*)(KaduAction*))’
make[2]: *** [kadu-core/CMakeFiles/kadu.dir/chat_manager.cpp.o] Błąd 1
make[2]: *** Oczekiwanie na niezakończone zadania....
make[1]: *** [kadu-core/CMakeFiles/kadu.dir/all] Błąd 2
make: *** [all] Błąd 2
 *
 * ERROR: net-im/kadu-core-0.6.5.1-r1 failed.
 * Call stack:
 *               ebuild.sh, line   49:  Called src_compile
 *             environment, line 2631:  Called kadu-base_src_compile
 *             environment, line 1956:  Called cmake-utils_src_compile
 *             environment, line  618:  Called cmake-utils_src_make
 *             environment, line  661:  Called die
 * The specific snippet of code:
 *           emake "$@" || die "Make failed!";
 *  The die message:
 *   Make failed!
 *
 * If you need support, post the topmost build error, and the call stack if relevant.
 * A complete build log is located at '/var/tmp/portage/net-im/kadu-core-0.6.5.1-r1/temp/build.log'.
 * The ebuild environment file is located at '/var/tmp/portage/net-im/kadu-core-0.6.5.1-r1/temp/environment'.
 * This ebuild is from an overlay: '/usr/local/portage/layman/roslin/'
 *

Code:

Portage 2.2_rc20 (default/linux/x86/2008.0, gcc-4.3.3, glibc-2.9_p20081201-r2, 2.6.28-gentoo-r1 i686)
=================================================================
System uname: Linux-2.6.28-gentoo-r1-i686-AMD_Athlon-tm-_XP_3200+-with-glibc2.0
Timestamp of tree: Fri, 27 Feb 2009 18:35:01 +0000
app-shells/bash:     3.2_p48-r1
dev-java/java-config: 2.1.7
dev-lang/python:     2.5.4-r2
dev-util/cmake:      2.6.2-r1
sys-apps/baselayout: 2.0.0
sys-apps/openrc:     0.4.3-r1
sys-apps/sandbox:    1.3.8
sys-devel/autoconf:  2.13, 2.63
sys-devel/automake:  1.5, 1.7.9-r1, 1.9.6-r2, 1.10.2
sys-devel/binutils:  2.19.1
sys-devel/gcc-config: 1.4.1
sys-devel/libtool:   2.2.6a
virtual/os-headers:  2.6.28-r1
ACCEPT_KEYWORDS="x86 ~x86"
CBUILD="i686-pc-linux-gnu"
CFLAGS="-march=native -O2 -fomit-frame-pointer -pipe -falign-functions=64"
CHOST="i686-pc-linux-gnu"
CONFIG_PROTECT="/etc /usr/kde/4.2/env /usr/kde/4.2/share/config /usr/kde/4.2/shutdown /usr/share/config"
CONFIG_PROTECT_MASK="/etc/ca-certificates.conf /etc/env.d /etc/env.d/java/ /etc/fonts/fonts.conf /etc/gconf /etc/gentoo-release /etc/revdep-rebuild /etc/sandbox.d /etc/terminfo /etc/udev/rules.d"
CXXFLAGS="-march=native -O2 -fomit-frame-pointer -pipe -falign-functions=64 -fvisibility-inlines-hidden"
DISTDIR="/usr/portage/distfiles"
FEATURES="diggest distlocks fixpackages parallel-fetch preserve-libs protect-owned sandbox sfperms strict unmerge-orphans userfetch"
GENTOO_MIRRORS="http://gentoo.prz.rzeszow.pl http://gentoo.po.opole.pl http://mirrors.sec.informatik.tu-darmstadt.de/gentoo/"
LANG="pl_PL.UTF-8"
LC_ALL="pl_PL.UTF-8"
LDFLAGS="-Wl,-O1 -Wl,--sort-common -Wl,--as-needed -Wl,--hash-style=gnu"
LINGUAS="pl"
MAKEOPTS="-s -j2"
PKGDIR="/usr/portage/packages"
PORTAGE_RSYNC_OPTS="--recursive --links --safe-links --perms --times --compress --force --whole-file --delete --stats --timeout=180 --exclude=/distfiles --exclude=/local --exclude=/packages"
PORTAGE_TMPDIR="/var/tmp"
PORTDIR="/usr/portage"
PORTDIR_OVERLAY="/usr/local/portage/layman/zen-overlay /usr/local/portage/layman/roslin /usr/local/portage/layman/kde-testing /usr/local/portage/layman/devnull /usr/local/portage/moj"
SYNC="rsync://rsync.gentoo.org/gentoo-portage"
USE="3dnow 3dnowext X acl alsa bash-completion berkdb bzip2 cli cracklib crypt dbus dri fortran gdbm gpm iconv isdnlog kdeprefix midi mmx mmxext mudflap ncurses nls nptl nptlonly nvidia opengl openmp oss pam pcre perl pic pppd python qt4 readline reflection session spl sse ssl sysfs tcpd threads unicode x86 xorg zlib" ALSA_CARDS="ali5451 als4000 atiixp atiixp-modem bt87x ca0106 cmipci emu10k1 emu10k1x ens1370 ens1371 es1938 es1968 fm801 hda-intel intel8x0 intel8x0m maestro3 trident usb-audio via82xx via82xx-modem ymfpci" ALSA_PCM_PLUGINS="adpcm alaw asym copy dmix dshare dsnoop empty extplug file hooks iec958 ioplug ladspa lfloat linear meter mmap_emul mulaw multi nullplug rate route share shm softvol" APACHE2_MODULES="actions alias auth_basic authn_alias authn_anon authn_dbm authn_default authn_file authz_dbm authz_default authz_groupfile authz_host authz_owner authz_user autoindex cache dav dav_fs dav_lock deflate dir disk_cache env expires ext_filter file_cache filter headers include info log_config logio mem_cache mime mime_magic negotiation rewrite setenvif speling status unique_id userdir usertrack vhost_alias" ELIBC="glibc" INPUT_DEVICES="evdev keyboard mouse" KERNEL="linux" LCD_DEVICES="bayrad cfontz cfontz633 glk hd44780 lb216 lcdm001 mtxorb ncurses text" LINGUAS="pl" NETBEANS_MODULES="apisupport harness ide java nb websvccommon" USERLAND="GNU" VIDEO_CARDS="nvidia"
Unset:  CPPFLAGS, CTARGET, EMERGE_DEFAULT_OPTS, FFLAGS, INSTALL_MASK, PORTAGE_COMPRESS, PORTAGE_COMPRESS_FLAGS, PORTAGE_RSYNC_EXTRA_OPTS

do tego qt 4.5_rc1 z portage
Back to top
View user's profile Send private message
mziab
l33t
l33t


Joined: 01 Oct 2004
Posts: 637

PostPosted: Fri Feb 27, 2009 8:53 pm    Post subject: Reply with quote

Spróbujcie czy ta łatka pomaga. Być może w ogóle nic nie zmienia. Nie mam możliwości sprawdzenia u siebie.
_________________
Gentoo Linux 13.0 | 3.8.0 | glibc 2.15 | gcc 4.7.3

mteam | mziab's blog | roslin
Back to top
View user's profile Send private message
szachy
n00b
n00b


Joined: 14 Feb 2005
Posts: 31
Location: Tarnów, Poland

PostPosted: Fri Feb 27, 2009 9:25 pm    Post subject: Reply with quote

Z łatką kadu-core się kompiluje u mnie.
Za to poleciało teraz kadu-history:
Code:

[ 68%] Building CXX object modules/history/CMakeFiles/history.dir/history_module.cpp.o
/var/tmp/portage/net-im/kadu-history-0.6.5.1/work/kadu/modules/history/history_module.cpp: In constructor ‘HistoryModule::HistoryModule(bool)’:
/var/tmp/portage/net-im/kadu-history-0.6.5.1/work/kadu/modules/history/history_module.cpp:116: error: invalid conversion from ‘const char*’ to ‘char*’
/var/tmp/portage/net-im/kadu-history-0.6.5.1/work/kadu/modules/history/history_module.cpp:116: error:   initializing argument 4 of ‘ActionDescription::ActionDescription(ActionDescription::ActionType, const QString&, QObject*,char*, const QString&, const QString&, bool, const QString&, void (*)(KaduAction*))’
/var/tmp/portage/net-im/kadu-history-0.6.5.1/work/kadu/modules/history/history_module.cpp:125: error: invalid conversion from ‘const char*’ to ‘char*’
/var/tmp/portage/net-im/kadu-history-0.6.5.1/work/kadu/modules/history/history_module.cpp:125: error:   initializing argument 4 of ‘ActionDescription::ActionDescription(ActionDescription::ActionType, const QString&, QObject*,char*, const QString&, const QString&, bool, const QString&, void (*)(KaduAction*))’
make[2]: *** [modules/history/CMakeFiles/history.dir/history_module.cpp.o] Błąd 1
make[2]: *** Oczekiwanie na niezakończone zadania....
make[1]: *** [modules/history/CMakeFiles/history.dir/all] Błąd 2
make: *** [all] Błąd 2
 *
 * ERROR: net-im/kadu-history-0.6.5.1 failed.
 * Call stack:
 *               ebuild.sh, line   49:  Called src_compile
 *             environment, line 2635:  Called kadu-base_src_compile
 *             environment, line 1941:  Called cmake-utils_src_compile
 *             environment, line  603:  Called cmake-utils_src_make
 *             environment, line  646:  Called die
 * The specific snippet of code:
 *           emake "$@" || die "Make failed!";
 *  The die message:
 *   Make failed!

ale widzę, ze błedy podobne do tych co u acei
Back to top
View user's profile Send private message
mziab
l33t
l33t


Joined: 01 Oct 2004
Posts: 637

PostPosted: Fri Feb 27, 2009 9:33 pm    Post subject: Reply with quote

Hmm, będę musiał do kadu.eclass dorzucić patchowanie w takim razie. A mógłbyś rozpakować źródła Kadu, nałożyć łatkę i spróbować czy z palca się kompiluje? Z góry dzięki.
_________________
Gentoo Linux 13.0 | 3.8.0 | glibc 2.15 | gcc 4.7.3

mteam | mziab's blog | roslin
Back to top
View user's profile Send private message
acei
Tux's lil' helper
Tux's lil' helper


Joined: 16 Sep 2007
Posts: 90

PostPosted: Fri Feb 27, 2009 9:36 pm    Post subject: Reply with quote

Z palca kompiluje się bez problemów, łatki na źródła chyba nie są potrzebne(może oprócz pierwszej - do polskich ogonków).
_________________
GA965P+E6320+Geil 2*1GB CL4+ATI HD6570 ~amd64
Back to top
View user's profile Send private message
mziab
l33t
l33t


Joined: 01 Oct 2004
Posts: 637

PostPosted: Fri Feb 27, 2009 9:44 pm    Post subject: Reply with quote

Hmm, w ogóle bez łatek poszło? Stawiam w takim razie na coś z flagami.

Spróbuj:
Code:
CFLAGS="" CXXFLAGS="" emerge -1 kadu-core

_________________
Gentoo Linux 13.0 | 3.8.0 | glibc 2.15 | gcc 4.7.3

mteam | mziab's blog | roslin
Back to top
View user's profile Send private message
acei
Tux's lil' helper
Tux's lil' helper


Joined: 16 Sep 2007
Posts: 90

PostPosted: Fri Feb 27, 2009 9:48 pm    Post subject: Reply with quote

mziab wrote:
Hmm, w ogóle bez łatek poszło? Stawiam w takim razie na coś z flagami.

Spróbuj:
Code:
CFLAGS="" CXXFLAGS="" emerge -1 kadu-core


Sypie się. Log jak u @szachy.
_________________
GA965P+E6320+Geil 2*1GB CL4+ATI HD6570 ~amd64
Back to top
View user's profile Send private message
mziab
l33t
l33t


Joined: 01 Oct 2004
Posts: 637

PostPosted: Fri Feb 27, 2009 9:55 pm    Post subject: Reply with quote

Kolejny eksperyment: spróbuj tego ebuilda.
_________________
Gentoo Linux 13.0 | 3.8.0 | glibc 2.15 | gcc 4.7.3

mteam | mziab's blog | roslin
Back to top
View user's profile Send private message
Display posts from previous:   
Reply to topic    Gentoo Forums Forum Index Polskie forum (Polish) All times are GMT
Goto page 1, 2, 3, 4, 5, 6, 7, 8, 9  Next
Page 1 of 9

 
Jump to:  
You cannot post new topics in this forum
You cannot reply to topics in this forum
You cannot edit your posts in this forum
You cannot delete your posts in this forum
You cannot vote in polls in this forum