Gentoo Forums
Gentoo Forums
Gentoo Forums
Quick Search: in
libbonobo and other ebuilds fail.
View unanswered posts
View posts from last 24 hours

 
Reply to topic    Gentoo Forums Forum Index Portage & Programming
View previous topic :: View next topic  
Author Message
dolcraith
n00b
n00b


Joined: 08 Jun 2005
Posts: 56

PostPosted: Mon Dec 24, 2007 7:44 pm    Post subject: libbonobo and other ebuilds fail. Reply with quote

libbonobo (and others) fail with the error:

bonobo-property-bag-client.c: In function 'bonobo_pbclient_set_string':
bonobo-property-bag-client.c:729: error: expected expression before 'do'
make[3]: *** [bonobo-property-bag-client.lo] Error 1
make[3]: Leaving directory `/var/tmp/portage/gnome-base/libbonobo-2.20.2/work/libbonobo-2.20.2/bonobo'
make[2]: *** [all] Error 2
make[2]: Leaving directory `/var/tmp/portage/gnome-base/libbonobo-2.20.2/work/libbonobo-2.20.2/bonobo'
make[1]: *** [all-recursive] Error 1
make[1]: Leaving directory `/var/tmp/portage/gnome-base/libbonobo-2.20.2/work/libbonobo-2.20.2'
make: *** [all] Error 2

there are similar errors earlier in the build output.

emerge --info: (i'vr trimmed out the use flags)
Code:

Portage 2.1.4_rc11 (default-linux/amd64/2007.0/desktop, gcc-4.2.2, glibc-2.7-r1, 2.6.23-suspend2-r2 x86_64)

=================================================================
System uname: 2.6.23-suspend2-r2 x86_64 Intel(R) Core(TM)2 Quad CPU @ 2.40GHz
Timestamp of tree: Fri, 21 Dec 2007 16:16:01 +0000
distcc 2.18.3 x86_64-pc-linux-gnu (protocols 1 and 2) (default port 3632) [disabled]
ccache version 2.4 [enabled]
app-shells/bash:     3.2_p17
dev-java/java-config: 1.3.7, 2.1.3
dev-lang/python:     2.5.1-r4
dev-python/pycrypto: 2.0.1-r6
dev-util/ccache:     2.4-r7
sys-apps/baselayout: 2.0.0_rc6
sys-apps/sandbox:    1.2.18.1-r2
sys-devel/autoconf:  2.13, 2.61-r1
sys-devel/automake:  1.4_p6, 1.5, 1.6.3, 1.7.9-r1, 1.8.5-r3, 1.9.6-r2, 1.10
sys-devel/binutils:  2.18-r1
sys-devel/gcc-config: 1.4.0-r4
sys-devel/libtool:   1.3.5, 1.5.24
virtual/os-headers:  2.6.23-r2
ACCEPT_KEYWORDS="amd64"
CBUILD="x86_64-pc-linux-gnu"
CFLAGS="-O2 -pipe -march=nocona -mmmx -m3dnow -msse -msse2 -msse3 -fomit-frame-pointer"
CHOST="x86_64-pc-linux-gnu"
CONFIG_PROTECT="/etc /usr/kde/3.5/env /usr/kde/3.5/share/config /usr/kde/3.5/shutdown /usr/share/X11/xkb /usr/share/config"
CONFIG_PROTECT_MASK="/etc/env.d /etc/env.d/java/ /etc/fonts/fonts.conf /etc/gconf /etc/gentoo-release /etc/php/apache2-php5/ext-active/ /etc/php/cgi-php5/ext-active/ /etc/php/cli-php5/ext-active/ /etc/revdep-rebuild /etc/splash /etc/terminfo /etc/texmf/web2c /etc/udev/rules.d"
CXXFLAGS="-O2 -pipe -march=nocona -mmmx -m3dnow -msse -msse2 -msse3 -fomit-frame-pointer"
DISTDIR="/usr/portage/distfiles"
EMERGE_DEFAULT_OPTS=" --nospinner --with-bdeps y"
FEATURES="autoaddcvs buildpkg ccache clean digest distlocks metadata-transfer metadata-transferparallel-fetch nostrip sandbox sfperms unmerge-orphans userfetch"
GENTOO_MIRRORS="ftp://ftp.ussg.iu.edu/pub/linux/gentoo http://ftp.ucsb.edu/pub/mirrors/linux/gentoo/"
LANG="C"
LINGUAS="en en_US"
MAKEOPTS="-j16"
PKGDIR="/usr/portage/packages"

I think its a gcc issue but i'm not 100% sure.


Last edited by dolcraith on Mon Dec 24, 2007 7:57 pm; edited 1 time in total
Back to top
View user's profile Send private message
Arfrever
Bodhisattva
Bodhisattva


Joined: 29 Apr 2006
Posts: 2462
Location: Polska / Lenkija

PostPosted: Mon Dec 24, 2007 7:51 pm    Post subject: Reply with quote

dolcraith wrote:
libbonobo (and others) fail with the error:
error: expected expression before 'do'


Post earlier and later lines of output.

dolcraith wrote:
emerge --info: (i'vr trimmed out the use flags)


You should also include the first line which contains the version of Portage, GCC and GLibC and your profile.

Perduodu linkėjimus
Arfrever
Back to top
View user's profile Send private message
pepj
n00b
n00b


Joined: 05 Jan 2008
Posts: 12

PostPosted: Sat Jan 05, 2008 8:34 am    Post subject: Reply with quote

i've have similar problem
Code:

emerge --info
Portage 2.1.3.19 (default-linux/x86/2007.0/desktop, gcc-4.1.2, glibc-2.6.1-r0, 2.6.23-gentoo-r3 i686)
=================================================================
System uname: 2.6.23-gentoo-r3 i686 Intel(R) Core(TM)2 CPU 4300 @ 1.80GHz
Timestamp of tree: Thu, 03 Jan 2008 15:46:01 +0000
app-shells/bash:     3.2_p17-r1
dev-lang/python:     2.4.4-r6
dev-python/pycrypto: 2.0.1-r6
sys-apps/baselayout: 1.12.10-r5
sys-apps/sandbox:    1.2.18.1-r2
sys-devel/autoconf:  2.13, 2.61-r1
sys-devel/automake:  1.7.9-r1, 1.8.5-r3, 1.9.6-r2, 1.10
sys-devel/binutils:  2.18-r1
sys-devel/gcc-config: 1.4.0-r4
sys-devel/libtool:   1.5.24
virtual/os-headers:  2.6.23-r3
ACCEPT_KEYWORDS="x86"
CBUILD="i686-pc-linux-gnu"
CFLAGS="-O2 -march=i686 -pipe"
CHOST="i686-pc-linux-gnu"
CONFIG_PROTECT="/etc"
CONFIG_PROTECT_MASK="/etc/env.d /etc/fonts/fonts.conf /etc/gconf /etc/revdep-rebuild /etc/terminfo /etc/udev/rules.d"
CXXFLAGS="-O2 -march=i686 -pipe"
DISTDIR="/usr/portage/distfiles"
FEATURES="distlocks metadata-transfer sandbox sfperms strict unmerge-orphans userfetch"
GENTOO_MIRRORS="ftp://ftp.unina.it/pub/linux/distributions/gentoo http://mirror.ing.unibo.it/gentoo/ ftp://mirror.ing.unibo.it/gentoo/ "
MAKEOPTS="-j 3"
PKGDIR="/usr/portage/packages"
PORTAGE_RSYNC_OPTS="--recursive --links --safe-links --perms --times --compress --force --whole-file --delete --delete-after --stats --timeout=180 --exclude=/distfiles --exclude=/local --exclude=/packages --filter=H_**/files/digest-*"
PORTAGE_TMPDIR="/var/tmp"
PORTDIR="/usr/portage"
SYNC="rsync://rsync.europe.gentoo.org/gentoo-portage"
USE="X acl acpi alsa arts avah berkdb bitmap-fonts cairo cdr cli cracklib crypt cups dbus dri dvd dvdr dvdread eds emboss encode esd evo fam firefox fortran gdbm gif gnome gpm gstreamer gtk hal iconv ipv6 isdnlog jpeg kde kerberos ldap mad midi mikmod mp3 mpeg mudflap ncurses nls nptl nptlonly nvidia ogg opengl openmp oss pam pcre pdf perl png pppd python qt2 qt3 qt3support qt4 quicktime readline reflection sdl session spell spl ssl svg tcpd tiff truetype truetype-fonts type1-fonts unicode vorbis win32codecs x86 xml xorg xv zlib" ALSA_CARDS="ali5451 als4000 atiixp atiixp-modem bt87x ca0106 cmipci emu10k1 emu10k1x ens1370 ens1371 es1938 es1968 fm801 hda-intel intel8x0 intel8x0m maestro3 trident usb-audio via82xx via82xx-modem ymfpci" ALSA_PCM_PLUGINS="adpcm alaw asym copy dmix dshare dsnoop empty extplug file hooks iec958 ioplug ladspa lfloat linear meter mulaw multi null plug rate route share shm softvol" APACHE2_MODULES="actions alias auth_basic authn_alias authn_anon authn_dbm authn_default authn_file authz_dbm authz_default authz_groupfile authz_host authz_owner authz_user autoindex cache dav dav_fs dav_lock deflate dir disk_cache env expires ext_filter file_cache filter headers include info log_config logio mem_cache mime mime_magic negotiation rewrite setenvif speling status unique_id userdir usertrack vhost_alias" ELIBC="glibc" INPUT_DEVICES="keyboard mouse" KERNEL="linux" LCD_DEVICES="bayrad cfontz cfontz633 glk hd44780 lb216 lcdm001 mtxorb ncurses text" USERLAND="GNU" VIDEO_CARDS="nvidia"
Unset:  CPPFLAGS, CTARGET, EMERGE_DEFAULT_OPTS, INSTALL_MASK, LANG, LC_ALL, LDFLAGS, LINGUAS, PORTAGE_COMPRESS, PORTAGE_COMPRESS_FLAGS, PORTAGE_RSYNC_EXTRA_OPTS, PORTDIR_OVERLAY


and make output
Code:

bonobo-arg.c: In function 'bonobo_arg_to_gvalue_alloc':
bonobo-arg.c:403: error: expected expression before 'do'
bonobo-arg.c:404: error: expected expression before 'do'
bonobo-arg.c:405: error: expected expression before 'do'
bonobo-arg.c:406: error: expected expression before 'do'
bonobo-arg.c:407: error: expected expression before 'do'
bonobo-arg.c:408: error: expected expression before 'do'
bonobo-arg.c:409: error: expected expression before 'do'
make[3]: *** [bonobo-arg.lo] Error 1
make[3]: *** Waiting for unfinished jobs....
 i686-pc-linux-gnu-gcc -DHAVE_CONFIG_H -I. -I.. -I.. -I.. -Wall -Wmissing-prototypes -DORBIT2=1 -pthrea
usr/include/orbit-2.0 -I/usr/include/glib-2.0 -I/usr/lib/glib-2.0/include -DPREFIX=\"/usr\" -DBONOBO_LI
\"/usr/lib\" -DBONOBO_DATADIR=\"/usr/share\" -DBONOBO_PIXMAPDIR=\"/usr/share/pixmaps\" -DBONOBO_BINDIR=
r/bin\" -DBONOBO_LOCALSTATEDIR=\"/var/lib\" -DBONOBO_LOCALEDIR=\"/usr/share/locale\" -DBONOBO_EXPLICIT_
LATION_DOMAIN=GETTEXT_PACKAGE -DG_DISABLE_DEPRECATED -DG_LOG_DOMAIN=\"Bonobo\" -DVERSION=\"2.20.1\" -O2
ch=i686 -pipe -MT bonobo-context.lo -MD -MP -MF .deps/bonobo-context.Tpo -c bonobo-context.c -o bonobo-
xt.o >/dev/null 2>&1
mv -f .deps/bonobo-context.Tpo .deps/bonobo-context.Plo
mv -f .deps/bonobo-moniker-context.Tpo .deps/bonobo-moniker-context.Plo
make[3]: Leaving directory `/var/tmp/portage/gnome-base/libbonobo-2.20.1/work/libbonobo-2.20.1/bonobo'
make[2]: *** [all] Error 2
make[2]: Leaving directory `/var/tmp/portage/gnome-base/libbonobo-2.20.1/work/libbonobo-2.20.1/bonobo'
make[1]: *** [all-recursive] Error 1
make[1]: Leaving directory `/var/tmp/portage/gnome-base/libbonobo-2.20.1/work/libbonobo-2.20.1'
make: *** [all] Error 2
 *
 * ERROR: gnome-base/libbonobo-2.20.1 failed.
 * Call stack:
 *       ebuild.sh, line 1701:  Called dyn_compile
 *       ebuild.sh, line 1039:  Called qa_call 'src_compile'
 *       ebuild.sh, line   44:  Called src_compile
 *       ebuild.sh, line 1383:  Called gnome2_src_compile
 *   gnome2.eclass, line   71:  Called die
 * The specific snippet of code:
 *      emake || die "compile failure"
 *  The die message:
 *   compile failure
 *
 * If you need support, post the topmost build error, and the call stack if relevant.
 * A complete build log is located at '/var/tmp/portage/gnome-base/libbonobo-2.20.1/temp/build.log'.
 *

 * Messages for package gnome-base/libbonobo-2.20.1:

 *
 * ERROR: gnome-base/libbonobo-2.20.1 failed.
 * Call stack:
 *       ebuild.sh, line 1701:  Called dyn_compile
 *       ebuild.sh, line 1039:  Called qa_call 'src_compile'
 *       ebuild.sh, line   44:  Called src_compile
 *       ebuild.sh, line 1383:  Called gnome2_src_compile
 *   gnome2.eclass, line   71:  Called die
 * The specific snippet of code:
 *      emake || die "compile failure"
 *  The die message:
 *   compile failure
 *
 * If you need support, post the topmost build error, and the call stack if relevant.
 * A complete build log is located at '/var/tmp/portage/gnome-base/libbonobo-2.20.1/temp/build.log'.


thank you for your help
excuse me for my bad english



I solved my problem with
Code:
i solved this problem with "emerge --oneshot libbonobo -ev"
Back to top
View user's profile Send private message
Display posts from previous:   
Reply to topic    Gentoo Forums Forum Index Portage & Programming All times are GMT
Page 1 of 1

 
Jump to:  
You cannot post new topics in this forum
You cannot reply to topics in this forum
You cannot edit your posts in this forum
You cannot delete your posts in this forum
You cannot vote in polls in this forum