Gentoo Forums
Gentoo Forums
Gentoo Forums
Quick Search: in
Wine amd64 ebuild
View unanswered posts
View posts from last 24 hours

Goto page Previous  1, 2, 3, 4, 5 ... 9, 10, 11  Next  
Reply to topic    Gentoo Forums Forum Index Gentoo on AMD64
View previous topic :: View next topic  
Author Message
brankob
Apprentice
Apprentice


Joined: 29 Apr 2004
Posts: 183

PostPosted: Fri Mar 18, 2005 10:59 am    Post subject: Reply with quote

Yeah !

Taht trick with EXTRA_ECONF apparently works !

How stupid of me ! I should have tried something so obvious a long time ago :wink:

Seriously, is there any chance that this might be incorporated in the next wine ebuild ?
Back to top
View user's profile Send private message
herbie
Guru
Guru


Joined: 09 Oct 2002
Posts: 319
Location: London UK

PostPosted: Fri Mar 18, 2005 11:07 am    Post subject: Reply with quote

brankob wrote:
Yeah !

Taht trick with EXTRA_ECONF apparently works !

How stupid of me ! I should have tried something so obvious a long time ago :wink:

Seriously, is there any chance that this might be incorporated in the next wine ebuild ?


No, not really. According to the wine maintainer: "your multilib schema is broken, not the package" (bug 85661). So no it does not look like this is going to get fixed in the wine ebuild. The problem will probably go away when we get to 2005.1 and all these emul-* packages can disapear. Until then you'll just have to use the EXTRA_ECONF workaround.
Back to top
View user's profile Send private message
andrew_j_w
Guru
Guru


Joined: 28 Jun 2003
Posts: 534
Location: York, UK

PostPosted: Fri Mar 18, 2005 11:47 am    Post subject: Reply with quote

herbie wrote:
No, not really. According to the wine maintainer: "your multilib schema is broken, not the package" (bug 85661). So no it does not look like this is going to get fixed in the wine ebuild. The problem will probably go away when we get to 2005.1 and all these emul-* packages can disapear. Until then you'll just have to use the EXTRA_ECONF workaround.


That's a shame, but at least it works for now. I managed to get Internet Explorer 6 installed and running on my AMD64 last night... why? Because I can...

Andrew
Back to top
View user's profile Send private message
tuxfan
Apprentice
Apprentice


Joined: 14 Feb 2003
Posts: 257

PostPosted: Fri Mar 18, 2005 5:17 pm    Post subject: Reply with quote

Quote:
That's a shame, but at least it works for now. I managed to get Internet Explorer 6 installed and running on my AMD64 last night... why? Because I can...


How did you installed the IE6? I've tried it and had no luck. Can you explain what you did?
Back to top
View user's profile Send private message
crazycat
l33t
l33t


Joined: 26 Aug 2003
Posts: 838
Location: Hamburg, Germany

PostPosted: Fri Mar 18, 2005 5:38 pm    Post subject: Reply with quote

I used the tipps in this thread but wine still failes with
Code:

cp ../../dlls/comctl32/tests/comctl32_test.exe.so comctl32_test.exe.so && x86_64-pc-linux-gnu-strip comctl32_test.exe.so
make[2]: *** No rule to make target `../../dlls/ddraw/tests/ddraw_test.exe.so', needed by `ddraw_test.exe.so'.  Stop.
make[2]: *** Waiting for unfinished jobs....
make[2]: Leaving directory `/tmp/portage/wine-20050310/work/wine-20050310/programs/winetest'
make[1]: *** [winetest] Error 2
make[1]: *** Waiting for unfinished jobs....
../../tools/winebuild/winebuild -DWINE_NO_DEBUG_MSGS -DWINE_NO_TRACE_MSGS  -o winevdm.exe.dbg.c --debug -C. winevdm.c
rm -f winevdm && ln -s ../../tools/winewrapper winevdm
gcc -m32 -c -I. -I. -I../../include -I../../include  -DWINE_NO_DEBUG_MSGS -DWINE_NO_TRACE_MSGS  -D_REENTRANT -fPIC -Wall -pipe -mpreferred-stack-boundary=2 -fno-strict-aliasing -gstabs+ -Wpointer-arith  -march=athlon64 -O2 -pipe -o winevdm.exe.dbg.o winevdm.exe.dbg.c
../../tools/winegcc/winegcc -B../../tools/winebuild -mconsole winevdm.o  winevdm.exe.dbg.o  -o winevdm.exe.so -L../../dlls  -lwinedos -luser32 -lkernel32 -L../../libs/wine -lwine  -L../../libs/port-lwine_port -Wl,-O1
make[2]: Leaving directory `/tmp/portage/wine-20050310/work/wine-20050310/programs/winevdm'
make[1]: Leaving directory `/tmp/portage/wine-20050310/work/wine-20050310/programs'
make: *** [programs] Error 2



I also tried to use DO_NOT_COMPILE="winedbg winetest" , but it didnt help.
Back to top
View user's profile Send private message
andrew_j_w
Guru
Guru


Joined: 28 Jun 2003
Posts: 534
Location: York, UK

PostPosted: Fri Mar 18, 2005 8:00 pm    Post subject: Reply with quote

tuxfan wrote:

How did you installed the IE6? I've tried it and had no luck. Can you explain what you did?


I used winetools to do the actual installation. All I needed to do was remove the Xdialog binary that came with it and emerge it by itself.

HTH,
Andrew
Back to top
View user's profile Send private message
dasalvagg
Apprentice
Apprentice


Joined: 26 Jun 2002
Posts: 183
Location: NY

PostPosted: Fri Mar 18, 2005 8:40 pm    Post subject: Reply with quote

I previously had wine-20050211 installed following all of the advice in this forum, thanks. Yesterday I tried to upgrade to wine-2005310 and have met some new problems. It looks like the same -lXext bug, but I have the necessary sym links from last time. Something else that might be causing trouble...i upgraded to glibc-2.3.4.20041102-r1

Another potential problem, I didn't apply the patch on bugzilla...different version of the ebuild. use it anyways?

Heres the error...
Quote:
usr/lib64 -lXext -lX11 -L../../libs/port -lwine_port
/usr/x86_64-pc-linux-gnu/gcc-bin/3.4.3/gcc: gcc-wrapper: -m32 detected on the command line overrides implicit -m64 added by the wrapper.
/usr/x86_64-pc-linux-gnu/gcc-bin/3.4.3/gcc: gcc-wrapper: -m32 detected on the command line overrides implicit -m64 added by the wrapper.
/usr/lib/gcc/x86_64-pc-linux-gnu/3.4.3/../../../../x86_64-pc-linux-gnu/bin/ld: skipping incompatible /usr/lib64/libXext.so when searching for -lXext
/usr/lib/gcc/x86_64-pc-linux-gnu/3.4.3/../../../../x86_64-pc-linux-gnu/bin/ld: skipping incompatible /usr/lib64/libXext.a when searching for -lXext
/usr/lib/gcc/x86_64-pc-linux-gnu/3.4.3/../../../../x86_64-pc-linux-gnu/bin/ld: skipping incompatible /usr/lib/gcc/x86_64-pc-linux-gnu/3.4.3/../../../libXext.so when searching for -lXext
/usr/lib/gcc/x86_64-pc-linux-gnu/3.4.3/../../../../x86_64-pc-linux-gnu/bin/ld: skipping incompatible /usr/lib/gcc/x86_64-pc-linux-gnu/3.4.3/../../../libXext.a when searching for -lXext
/usr/lib/gcc/x86_64-pc-linux-gnu/3.4.3/../../../../x86_64-pc-linux-gnu/bin/ld: skipping incompatible /usr/lib/libXext.so when searching for -lXext
/usr/lib/gcc/x86_64-pc-linux-gnu/3.4.3/../../../../x86_64-pc-linux-gnu/bin/ld: skipping incompatible /usr/lib/libXext.a when searching for -lXext
/usr/lib/gcc/x86_64-pc-linux-gnu/3.4.3/../../../../x86_64-pc-linux-gnu/bin/ld: cannot find -lXext
collect2: ld returned 1 exit status
winegcc: gcc failed.
make[2]: *** [x11drv.dll.so] Error 2
make[2]: Leaving directory `/var/tmp/portage/wine-20050310/work/wine-20050310/dlls/x11drv'
make[1]: *** [x11drv] Error 2
make[1]: Leaving directory `/var/tmp/portage/wine-20050310/work/wine-20050310/dlls'
make: *** [dlls] Error 2

!!! ERROR: app-emulation/wine-20050310 failed.
!!! Function src_compile, Line 102, Exitcode 2
!!! all
!!! If you need support, post the topmost build error, NOT this status message.


my sym links
Quote:

mike@Genny</emul/linux/x86/usr/lib> ls -al libXext* libX11*
lrwxrwxrwx 1 root root 13 Mar 12 14:06 libX11.so -> libX11.so.6.2
lrwxrwxrwx 1 root root 13 Mar 12 14:06 libX11.so.6 -> libX11.so.6.2
-rwxr-xr-x 1 root root 857552 Mar 12 14:06 libX11.so.6.2
lrwxrwxrwx 1 root root 14 Mar 12 14:06 libXext.so -> libXext.so.6.4
lrwxrwxrwx 1 root root 14 Mar 12 14:06 libXext.so.6 -> libXext.so.6.4
-rwxr-xr-x 1 root root 59304 Mar 12 14:06 libXext.so.6.4
Back to top
View user's profile Send private message
tuxfan
Apprentice
Apprentice


Joined: 14 Feb 2003
Posts: 257

PostPosted: Fri Mar 18, 2005 9:21 pm    Post subject: Reply with quote

You can use the patch for the wine-20050310 from the version before. That worked for me. That will solve this error message.
Back to top
View user's profile Send private message
dasalvagg
Apprentice
Apprentice


Joined: 26 Jun 2002
Posts: 183
Location: NY

PostPosted: Fri Mar 18, 2005 9:56 pm    Post subject: Reply with quote

It gave 2 erros when applying the patch, but everything still compiled. thanks.

too bad picasa still dies everytime i try to run it. has anyone seen this error when starting picasa?
Quote:

err:ole:CoInitializeEx Attempt to change threading model of this apartment from 0xa to 0x2
err:ole:CoInitializeEx Attempt to change threading model of this apartment from 0xa to 0x2
Back to top
View user's profile Send private message
Tuinslak
Tux's lil' helper
Tux's lil' helper


Joined: 26 Nov 2003
Posts: 129
Location: Belgium

PostPosted: Sat Mar 19, 2005 2:55 pm    Post subject: Reply with quote

Any idea why I get this:

Code:
[blocks B     ] <x11-base/xorg-x11-6.8.0-r4 (is blocking x11-base/opengl-update-2.1.1-r1)
[blocks B     ] <=app-emulation/emul-linux-x86-xlibs-1.2-r3 (is blocking x11-base/xorg-x11-6.8.2-r1)


When I tried to update my emul proggies.
Sorry if it's the wrong thread to post this.
_________________
Tuinslak
Back to top
View user's profile Send private message
NuKe-
n00b
n00b


Joined: 26 Jan 2005
Posts: 31

PostPosted: Thu Mar 24, 2005 11:25 am    Post subject: error Reply with quote

Code:
lgdi32 -ladvapi32 -lkernel32 -lntdll -L../../libs/wine -lwine -L../../libs/unicode -lwine_unicode  -L/usr/lib64  -lXext -lX11  -L../../libs/port -lwine_port
/usr/x86_64-pc-linux-gnu/gcc-bin/3.4.3/gcc: gcc-wrapper: -m32 detected on the command line overrides implicit -m64 added by the wrapper.
/usr/x86_64-pc-linux-gnu/gcc-bin/3.4.3/gcc: gcc-wrapper: -m32 detected on the command line overrides implicit -m64 added by the wrapper.
/usr/lib/gcc/x86_64-pc-linux-gnu/3.4.3/../../../../x86_64-pc-linux-gnu/bin/ld: skipping incompatible /usr/lib64/libXext.so when searching for -lXext
/usr/lib/gcc/x86_64-pc-linux-gnu/3.4.3/../../../../x86_64-pc-linux-gnu/bin/ld: skipping incompatible /usr/lib64/libXext.a when searching for -lXext
/usr/lib/gcc/x86_64-pc-linux-gnu/3.4.3/../../../../x86_64-pc-linux-gnu/bin/ld: skipping incompatible /usr/lib/gcc/x86_64-pc-linux-gnu/3.4.3/../../../libXext.so when searching for -lXext
/usr/lib/gcc/x86_64-pc-linux-gnu/3.4.3/../../../../x86_64-pc-linux-gnu/bin/ld: skipping incompatible /usr/lib/gcc/x86_64-pc-linux-gnu/3.4.3/../../../libXext.a when searching for -lXext
/usr/lib/gcc/x86_64-pc-linux-gnu/3.4.3/../../../../x86_64-pc-linux-gnu/bin/ld: skipping incompatible /usr/lib/libXext.so when searching for -lXext
/usr/lib/gcc/x86_64-pc-linux-gnu/3.4.3/../../../../x86_64-pc-linux-gnu/bin/ld: skipping incompatible /usr/lib/libXext.a when searching for -lXext
/usr/lib/gcc/x86_64-pc-linux-gnu/3.4.3/../../../../x86_64-pc-linux-gnu/bin/ld: cannot find -lXext
collect2: ld returned 1 exit status
winegcc: gcc failed.
make[2]: *** [x11drv.dll.so] Error 2
make[2]: Leaving directory `/var/tmp/portage/wine-20050310/work/wine-20050310/dlls/x11drv'
make[1]: *** [x11drv] Error 2
make[1]: Leaving directory `/var/tmp/portage/wine-20050310/work/wine-20050310/dlls'
make: *** [dlls] Error 2

!!! ERROR: app-emulation/wine-20050310 failed.
!!! Function src_compile, Line 103, Exitcode 2
!!! all
!!! If you need support, post the topmost build error, NOT this status message.

i have upgraded to 2005.0 but the error is the same of 2004.3
_________________
NuKe
Back to top
View user's profile Send private message
herbie
Guru
Guru


Joined: 09 Oct 2002
Posts: 319
Location: London UK

PostPosted: Thu Mar 24, 2005 11:59 am    Post subject: Reply with quote

Here's an updated patch for the current version:
Code:
cd /usr/portage/app-emulation/wine
wget http://fermat.ma.rhul.ac.uk/~herbie/wine-amd64-fixes.patch
patch -p0 < wine-amd64-fixes.patch
emerge wine


This should cure the -lXext issues as well as a couple of other things.

Tuinslak:
just emerge emul-linux-x86-xlibs first:
Code:
emerge emul-linux-x86-xlibs
emerge xorg-x11
Back to top
View user's profile Send private message
Pajarico
Guru
Guru


Joined: 01 May 2004
Posts: 493
Location: Madrid, España.

PostPosted: Thu Mar 24, 2005 2:10 pm    Post subject: Reply with quote

Thanks herbie, worked like a charm. No need now for EXTRA_CONFIG or custom USE flags:)
_________________
Gentoo: the only software worth paying that is free.
Back to top
View user's profile Send private message
urcindalo
Guru
Guru


Joined: 08 Feb 2005
Posts: 555
Location: Almeria, Spain

PostPosted: Thu Mar 31, 2005 4:00 pm    Post subject: Reply with quote

I use the AMD64 multilib 2005.0 profile. I also updated today to the new stable 2.6.11-gentoo-r3 kernel.

I've tried to emerge wine-20050310:
Code:
These are the packages that I would merge, in reverse order:

Calculating dependencies ...done!
[ebuild  N    ] app-emulation/wine-20050310  +X +alsa +arts +cups -debug -doc +gif +glut +jack +jpeg +lcms +nas +ncurses +opengl +oss 0 kB


But it fails this way:
Code:
/usr/lib/gcc/x86_64-pc-linux-gnu/3.4.3/../../../../x86_64-pc-linux-gnu/bin/ld: skipping incompatible /usr/lib/gcc/x86_64-pc-linux-gnu/3.4.3/../../../libXext.a when searching for -lXext
/usr/lib/gcc/x86_64-pc-linux-gnu/3.4.3/../../../../x86_64-pc-linux-gnu/bin/ld: skipping incompatible /usr/lib/libXext.so when searching for -lXext
/usr/lib/gcc/x86_64-pc-linux-gnu/3.4.3/../../../../x86_64-pc-linux-gnu/bin/ld: skipping incompatible /usr/lib/libXext.a when searching for -lXext
/usr/lib/gcc/x86_64-pc-linux-gnu/3.4.3/../../../../x86_64-pc-linux-gnu/bin/ld: cannot find -lXext
collect2: ld returned 1 exit status
winegcc: gcc failed.
make[2]: *** [glut32.dll.so] Error 2
make[2]: Leaving directory `/var/tmp/portage/wine-20050310/work/wine-20050310/dlls/glut32'
make[1]: *** [glut32] Error 2
make[1]: Leaving directory `/var/tmp/portage/wine-20050310/work/wine-20050310/dlls'
make: *** [dlls] Error 2
gcc -m32 -c -I. -I. -I../include -I../include  -D__WINESRC__  -Wall -pipe -mpreferred-stack-boundary=2 -fno-strict-aliasing -gstabs+ -Wpointer-arith  -march=k8 -O2 -I//usr/include/lcms -o timer.o timer.c
make: *** Waiting for unfinished jobs....
/usr/x86_64-pc-linux-gnu/gcc-bin/3.4.3/gcc: gcc-wrapper: -m32 detected on the command line overrides implicit -m64 added by the wrapper.
gcc -m32 -c -I. -I. -I../include -I../include  -D__WINESRC__  -Wall -pipe -mpreferred-stack-boundary=2 -fno-strict-aliasing -gstabs+ -Wpointer-arith  -march=k8 -O2 -I//usr/include/lcms -o token.o token.c
/usr/x86_64-pc-linux-gnu/gcc-bin/3.4.3/gcc: gcc-wrapper: -m32 detected on the command line overrides implicit -m64 added by the wrapper.
gcc -m32 -c -I. -I. -I../include -I../include  -D__WINESRC__  -Wall -pipe -mpreferred-stack-boundary=2 -fno-strict-aliasing -gstabs+ -Wpointer-arith  -march=k8 -O2 -I//usr/include/lcms -o trace.o trace.c
/usr/x86_64-pc-linux-gnu/gcc-bin/3.4.3/gcc: gcc-wrapper: -m32 detected on the command line overrides implicit -m64 added by the wrapper.
gcc -m32 -c -I. -I. -I../include -I../include  -D__WINESRC__  -Wall -pipe -mpreferred-stack-boundary=2 -fno-strict-aliasing -gstabs+ -Wpointer-arith  -march=k8 -O2 -I//usr/include/lcms -o unicode.o unicode.c
/usr/x86_64-pc-linux-gnu/gcc-bin/3.4.3/gcc: gcc-wrapper: -m32 detected on the command line overrides implicit -m64 added by the wrapper.
gcc -m32 -c -I. -I. -I../include -I../include  -D__WINESRC__  -Wall -pipe -mpreferred-stack-boundary=2 -fno-strict-aliasing -gstabs+ -Wpointer-arith  -march=k8 -O2 -I//usr/include/lcms -o user.o user.c
/usr/x86_64-pc-linux-gnu/gcc-bin/3.4.3/gcc: gcc-wrapper: -m32 detected on the command line overrides implicit -m64 added by the wrapper.
gcc -m32 -c -I. -I. -I../include -I../include  -D__WINESRC__  -Wall -pipe -mpreferred-stack-boundary=2 -fno-strict-aliasing -gstabs+ -Wpointer-arith  -march=k8 -O2 -I//usr/include/lcms -o window.o window.c
/usr/x86_64-pc-linux-gnu/gcc-bin/3.4.3/gcc: gcc-wrapper: -m32 detected on the command line overrides implicit -m64 added by the wrapper.
gcc -m32 -o wineserver atom.o change.o class.o clipboard.o console.o context_alpha.o context_i386.o context_powerpc.ocontext_sparc.o debugger.o event.o fd.o file.o handle.o hook.o main.o mapping.o mutex.o named_pipe.o object.o process.o ptrace.o queue.o region.o registry.o request.o semaphore.o serial.o signal.o snapshot.o sock.o thread.o timer.o token.o trace.o unicode.o user.o window.o  -L../libs/wine -lwine -L../libs/unicode -lwine_unicode -L../libs/port -lwine_port
/usr/x86_64-pc-linux-gnu/gcc-bin/3.4.3/gcc: gcc-wrapper: -m32 detected on the command line overrides implicit -m64 added by the wrapper.
make[1]: Leaving directory `/var/tmp/portage/wine-20050310/work/wine-20050310/server'

!!! ERROR: app-emulation/wine-20050310 failed.
!!! Function src_compile, Line 103, Exitcode 2
!!! all
!!! If you need support, post the topmost build error, NOT this status message.


Notice the errors about-lXext and glut32.dll.so at the beginning. Was somebody succesful at emerging this wine version?

Here is my info:
Code:
$ sudo emerge info
Portage 2.0.51.19 (default-linux/amd64/2005.0, gcc-3.4.3, glibc-2.3.4.20041102-r1, 2.6.11-gentoo-r3 x86_64)
=================================================================
System uname: 2.6.11-gentoo-r3 x86_64 AMD Athlon(tm) 64 Processor 3000+
Gentoo Base System version 1.4.16
Python:              dev-lang/python-2.3.4-r1 [2.3.4 (#1, Mar  9 2005, 15:45:12)]
dev-lang/python:     2.3.4-r1
sys-devel/autoconf:  2.59-r6, 2.13
sys-devel/automake:  1.7.9-r1, 1.8.5-r3, 1.5, 1.4_p6, 1.6.3, 1.9.4
sys-devel/binutils:  2.15.92.0.2-r1
sys-devel/libtool:   1.5.10-r4
virtual/os-headers:  2.6.8.1-r4
ACCEPT_KEYWORDS="amd64"
AUTOCLEAN="yes"
CFLAGS="-march=k8 -O2"
CHOST="x86_64-pc-linux-gnu"
CONFIG_PROTECT="/etc /usr/kde/2/share/config /usr/kde/3/share/config /usr/share/config /var/qmail/control"
CONFIG_PROTECT_MASK="/etc/gconf /etc/env.d"
CXXFLAGS="-march=k8 -O2"
DISTDIR="/usr/portage/distfiles"
FEATURES="autoaddcvs autoconfig ccache distlocks sandbox"
GENTOO_MIRRORS="http://distfiles.gentoo.org http://distro.ibiblio.org/pub/Linux/distributions/gentoo"
MAKEOPTS="-j2"
PKGDIR="/usr/portage/packages"
PORTAGE_TMPDIR="/var/tmp"
PORTDIR="/usr/portage"
SYNC="rsync://rsync.gentoo.org/gentoo-portage"
USE="amd64 X Xaw3d a52 aac aalib accessibility acl acpi aim alsa apache2 apm arts audiofile avi bash-completion bcmath berkdb bidi bitmap-fonts bzlib cdparanoia cdr crypt ctype cups curl curlwrappers db2 dba dbase dbm dbx dga dio directfb divx4linux dv dvb dvd dvdr dvdread encode esd ethereal evo exif fam fastcgi fbcon ffmpeg fftw flac flash flatfile font-server foomaticdb fortran freetds ftp gd gdbm geoip gif ginac glut gmp gnustep gnutls gphoto2 gpm gstreamer gtk gtk2 gtkhtml guile hyperwave-api iconv icq imagemagick imap imlib inifile innodb interbase iodbc ipv6 jabber jack java javascript jikes jp2 jpeg junit kde kerberos krb4 ladcca lcms ldap lesstif libcaca libwww lzw lzw-tiff mad maildir mailwrapper matroska mbox mcal mcve memlimit mhash mikmod milter mime mmap mng motif mozilla mp3 mpeg mpi msession msn msql mysql mysqli nas ncurses neXt netcdf nis nls nptl oci8 ogg oggvorbis openal opengl oracle oracle7 oscar oss ovrimospam pcntl pcre pdflib perl php pie plotutils png portaudio posix postgres ppds prelude python qdbm qt quicktime readline recode ruby samba sapdb sasl scanner sdl sharedext simplexml skey slang sndfile snmp soap sockets socks5 source sox speex spell spl ssl svg sysfs sysvipc szip tcltk tcpd tetex theora tidy tiff tokenizer truetype truetype-fonts type1-fonts unicode usb userlocales v4l vcd vhosts wddx wmf wxwindows xface xine xml xml2 xmlrpc xmms xpm xprint xrandr xslxv xvid yahoo yaz zeo zlib"
Unset:  ASFLAGS, CBUILD, CTARGET, LANG, LC_ALL, LDFLAGS, PORTDIR_OVERLAY


Thanks very much in advance.
Back to top
View user's profile Send private message
urcindalo
Guru
Guru


Joined: 08 Feb 2005
Posts: 555
Location: Almeria, Spain

PostPosted: Thu Mar 31, 2005 4:06 pm    Post subject: Reply with quote

Well. I don't know why, but I missed herbie's patch two post above :?
I'm just trying again after patching the wine-20050310 ebuild.
Let's see how it goes. I'll let you know.

-----------

A few seconds later... (if only!! :lol: ) it emerged successfully!!

Thanks herbie for the patch, and please accept my apologies for not having seen it in advance :oops:
Back to top
View user's profile Send private message
zaai
Apprentice
Apprentice


Joined: 24 Jul 2004
Posts: 175

PostPosted: Fri Apr 01, 2005 12:48 am    Post subject: Reply with quote

Herbie Rocks :lol:
His patch solved all my wine-20050310 emerge problems.
_________________
* most bugs can be reduced to either dependency or state *

Athlon64 X2 4800+ on Asus M2N SLI deluxe with 4GB Dual channel
video nVidia GForce 7300 GS 512MB (snail); xorg-7.2
kernel 2.6.24-gentoo-r3
Back to top
View user's profile Send private message
Lucky B
Apprentice
Apprentice


Joined: 01 Apr 2005
Posts: 235
Location: Florida

PostPosted: Fri Apr 01, 2005 7:10 am    Post subject: Reply with quote

herbie wrote:
Here's an updated patch for the current version:
Code:
cd /usr/portage/app-emulation/wine
wget http://fermat.ma.rhul.ac.uk/~herbie/wine-amd64-fixes.patch
patch -p0 < wine-amd64-fixes.patch
emerge wine



I have done this and tried building the CVS code but I have not succeeded.

Here's my error:
Code:

make[1]: Leaving directory `/var/tmp/portage/wine-20050310/work/wine-20050310/documentation'
make[1]: Entering directory `/var/tmp/portage/wine-20050310/work/wine-20050310/loader'
gcc -m32 -c -I. -I. -I../include -I../include    -Wall -pipe -mpreferred-stack-boundary=2 -fno-strict-aliasing -gstabs+ -Wpointer-arith  -march=athlon64 -O3 -pipe -L/emul/linux/x86/usr/lib -L/emul/linux/x86/lib -fno-pic -fno-stack-protector -o glibc.o glibc.c
/usr/x86_64-pc-linux-gnu/gcc-bin/3.4.3-20050110/gcc: gcc-wrapper: -m32 detected on the command line overrides implicit -m32 added by the wrapper.
/usr/x86_64-pc-linux-gnu/gcc-bin/3.4.3-20050110/gcc: gcc-wrapper: -m32 detected on the command line overrides implicit -m32 added by the wrapper.
gcc -m32 -o wine-glibc glibc.o -L../libs/wine -lwine -L../libs/port -lwine_port   -L/emul/linux/x86/usr/lib -L/emul/linux/x86/lib
/usr/x86_64-pc-linux-gnu/gcc-bin/3.4.3-20050110/gcc: gcc-wrapper: -m32 detected on the command line overrides implicit -m32 added by the wrapper.
glibc.o(.text+0x79): In function `main':
/var/tmp/portage/wine-20050310/work/wine-20050310/loader/glibc.c:65: undefined reference to `pthread_create'
glibc.o(.text+0x88):/var/tmp/portage/wine-20050310/work/wine-20050310/loader/glibc.c:66: undefined reference to `pthread_join'
collect2: ld returned 1 exit status
make[1]: *** [wine-glibc] Error 1
make[1]: Leaving directory `/var/tmp/portage/wine-20050310/work/wine-20050310/loader'
make: *** [loader] Error 2

!!! ERROR: app-emulation/wine-20050310 failed.
!!! Function src_compile, Line 126, Exitcode 2
!!! all
!!! If you need support, post the topmost build error, NOT this status message.


Here's my emerge info
Code:

Portage 2.0.51.19 (default-linux/amd64/2005.0, gcc-3.4.3-20050110, glibc-2.3.4.20050125-r1, 2.6.11-gentoo-r4 x86_64)
=================================================================
System uname: 2.6.11-gentoo-r4 x86_64 AMD Athlon(tm) 64 Processor 3000+
Gentoo Base System version 1.6.10
Python:              dev-lang/python-2.3.5 [2.3.5 (#1, Mar 13 2005, 16:12:14)]
distcc 2.18.3 x86_64-pc-linux-gnu (protocols 1 and 2) (default port 3632) [disabled]
ccache version 2.4 [enabled]
dev-lang/python:     2.3.5
sys-devel/autoconf:  2.59-r6, 2.13
sys-devel/automake:  1.7.9-r1, 1.8.5-r3, 1.5, 1.4_p6, 1.6.3, 1.9.5
sys-devel/binutils:  2.15.92.0.2-r7
sys-devel/libtool:   1.5.14
virtual/os-headers:  2.6.8.1-r4
ACCEPT_KEYWORDS="~amd64"
AUTOCLEAN="yes"
CFLAGS="-march=athlon64 -O3 -pipe"
CHOST="x86_64-pc-linux-gnu"
CONFIG_PROTECT="/etc /usr/kde/2/share/config /usr/kde/3.4/env /usr/kde/3.4/share/config /usr/kde/3.4/shutdown /usr/kde/3/share/config /usr/lib/X11/xkb /usr/lib/mozilla/defaults/pref /usr/share/config /var/qmail/control"
CONFIG_PROTECT_MASK="/etc/gconf /etc/terminfo /etc/texmf/web2c /etc/env.d"
CXXFLAGS="-march=athlon64 -O3 -pipe"
DISTDIR="/usr/portage/distfiles"
FEATURES="autoaddcvs autoconfig ccache distlocks sandbox"
GENTOO_MIRRORS="http://gentoo.osuosl.org/ ftp://ftp-stud.fht-esslingen.de/pub/Mirrors/gentoo/ http://194.117.143.69"
MAKEOPTS="-j1"
PKGDIR="/usr/portage/packages"
PORTAGE_TMPDIR="/var/tmp"
PORTDIR="/usr/portage"
PORTDIR_OVERLAY="/home/portage"
SYNC="rsync://rsync.gentoo.org/gentoo-portage"
USE="amd64 X a52 aac aalib acpi alsa apache2 apm arts avi bash-completion berkdb bitmap-fonts bluetooth bootsplash bzlib ccache cdr chroot codecs crypt css ctype curl directfb divx4linux doc dvd dvdr dvdread encode esd fam fame fastcgi fbcon ffmpeg flac flash font-server fortran freetype gatos gif glut gnome gpm gstreamer gtk icq imagemagick imlib jack java jp2 jpeg kde libwww lzw lzw-tiff mad maildir matroska mozilla mp3 mpeg mpeg4 mpi ncurses nls nptl offensive oggvorbis openal opengl oss pam pcntl pdflib perl php pic pie png python qt readline real samba sasl sdl ssl tcpd tetex theora tiff truetype truetype-fonts type1-fonts usb userlocales xine xml2 xmms xosd xpm xrandr xv xvid zlib"
Unset:  ASFLAGS, CBUILD, CTARGET, LANG, LC_ALL, LDFLAGS


I have tried compiling it with USE="-*" and it still gives the same error. I am using the 2005.0 profile and have a feeling that there's something amiss with my libraries. Also tried FEATURES="-sandbox".

Anyone have any ideas where I can begin looking for a solution on this?
Back to top
View user's profile Send private message
eje211
Tux's lil' helper
Tux's lil' helper


Joined: 09 Sep 2004
Posts: 128
Location: London, UK

PostPosted: Sat Apr 02, 2005 3:00 am    Post subject: Reply with quote

I did the same thing. I get something similar.

Code:
gcc -m32 -o wineserver atom.o change.o class.o clipboard.o console.o context_alpha.o context_i386.o context_powerpc.o context_sparc.o debugger.o event.o fd.o file.o handle.o hook.o main.o mapping.o mutex.o named_pipe.o object.o process.o ptrace.o queue.o region.o registry.o request.o semaphore.o serial.o signal.o snapshot.o sock.o thread.o timer.o token.o trace.o unicode.o user.o window.o  -L../libs/wine -lwine -L../libs/unicode -lwine_unicode -L../libs/port -lwine_port -L/emul/linux/x86/usr/lib -L/emul/linux/x86/lib
/usr/x86_64-pc-linux-gnu/gcc-bin/3.4.3-20050110/gcc: gcc-wrapper: -m32 detected on the command line overrides implicit -m32 added by the wrapper.
make[1]: Leaving directory `/var/tmp/portage/wine-20050310/work/wine-20050310/server'

!!! ERROR: app-emulation/wine-20050310 failed.
!!! Function src_compile, Line 126, Exitcode 2
!!! all
!!! If you need support, post the topmost build error, NOT this status message.


With the USE="-*" flag, I get:
Code:
/usr/x86_64-pc-linux-gnu/gcc-bin/3.4.3-20050110/gcc: gcc-wrapper: -m32 detected on the command line overrides implicit -m64 added by the wrapper.
/usr/x86_64-pc-linux-gnu/gcc-bin/3.4.3-20050110/gcc: gcc-wrapper: -m32 detected on the command line overrides implicit -m64 added by the wrapper.
make[3]: Leaving directory `/var/tmp/portage/wine-20050310/work/wine-20050310/dlls/wininet/tests'
make[2]: Leaving directory `/var/tmp/portage/wine-20050310/work/wine-20050310/dlls/wininet'
rm -f d3dim.dll.so && ln -s d3dim/d3dim.dll.so d3dim.dll.so
rm -f d3drm.dll.so && ln -s d3drm/d3drm.dll.so d3drm.dll.so
rm -f d3dxof.dll.so && ln -s d3dxof/d3dxof.dll.so d3dxof.dll.so
rm -f dbghelp.dll.so && ln -s dbghelp/dbghelp.dll.so dbghelp.dll.so
<snip-snip>
rm -f winaspi.dll.so && ln -s wnaspi32.dll.so winaspi.dll.so
rm -f wineps16.drv.so && ln -s wineps.dll.so wineps16.drv.so
rm -f winnls.dll.so && ln -s winnls32.dll.so winnls.dll.so
rm -f winsock.dll.so && ln -s ws2_32.dll.so winsock.dll.so
rm -f wintab.dll.so && ln -s wintab32.dll.so wintab.dll.so
rm -f wprocs.dll.so && ln -s winedos.dll.so wprocs.dll.so
make[1]: Leaving directory `/var/tmp/portage/wine-20050310/work/wine-20050310/dlls'

!!! ERROR: app-emulation/wine-20050310 failed.
!!! Function src_compile, Line 103, Exitcode 2
!!! all
!!! If you need support, post the topmost build error, NOT this status message.[/quote]


I've tried to look at it, but I have no idea what it means.


Last edited by eje211 on Tue Apr 05, 2005 4:13 pm; edited 1 time in total
Back to top
View user's profile Send private message
mahonri
n00b
n00b


Joined: 04 Apr 2005
Posts: 2

PostPosted: Mon Apr 04, 2005 3:39 am    Post subject: libc.so.6 ?? Reply with quote

OK, Followed directions above and applied the patch successfully, and this is the result of trying to build:
Code:
/usr/lib/gcc/x86_64-pc-linux-gnu/3.4.3/../../../../x86_64-pc-linux-gnu/bin/ld: cannot find /emul/linux/x86/lib/libc.so.6
collect2: ld returned 1 exit status
winegcc: gcc failed.
make[2]: *** [x11drv.dll.so] Error 2
make[2]: Leaving directory `/var/tmp/portage/wine-20050310/work/wine-20050310/dlls/x11drv'
make[1]: *** [x11drv] Error 2
make[1]: Leaving directory `/var/tmp/portage/wine-20050310/work/wine-20050310/dlls'
make: *** [dlls] Error 2

!!! ERROR: app-emulation/wine-20050310 failed.
!!! Function src_compile, Line 117, Exitcode 2
!!! all
!!! If you need support, post the topmost build error, NOT this status message.
:?
This was after remerging emul-linux-x86-xlibs and xorg-x11.

Using 2005.0 (after fighting with multilib on the upgrade.)

/etc/make.conf :
Code:
PORTDIR_OVERLAY="/usr/local/portage/"
PORTAGE_NICENESS="15"
USE="cups foomaticdb ppds nvidia x11 truetype gnome gtk dvd jikes joystick mbox mozilla alsa oss perl samba usb jack multilib sandbox"
ALSA_CARDS="via82xx"
CFLAGS="-march=k8 -O2 -pipe"
CHOST="x86_64-pc-linux-gnu"
MAKEOPTS="-j2"
CXXFLAGS="${CFLAGS}"
Back to top
View user's profile Send private message
localghost
Apprentice
Apprentice


Joined: 28 Oct 2004
Posts: 185
Location: Sint-Niklaas, Belgium

PostPosted: Mon Apr 04, 2005 6:08 am    Post subject: Reply with quote

Congratulations for all your errors, this is mine after disabling ALL use flags on wine:
Code:
make[2]: Entering directory `/var/tmp/portage/wine-20050310/work/wine-20050310/programs/winevdm'
gcc -m32 -c -I. -I. -I../../include -I../../include  -DWINE_NO_DEBUG_MSGS -DWINE_NO_TRACE_MSGS  -D_REENTRANT -fPIC -Wall -pipe -mpreferred-stack-boundary=2 -fno-strict-aliasing -gstabs+ -Wpointer-arith  -march=athlon64 -O2 -pipe -o winevdm.o winevdm.c
gcc -m32 -c -I. -I. -I../../include -I../../include  -DWINE_NO_DEBUG_MSGS -DWINE_NO_TRACE_MSGS  -D_REENTRANT -fPIC -Wall -pipe -mpreferred-stack-boundary=2 -fno-strict-aliasing -gstabs+ -Wpointer-arith  -march=athlon64 -O2 -pipe -o util.o util.c
../../tools/winebuild/winebuild -DWINE_NO_DEBUG_MSGS -DWINE_NO_TRACE_MSGS  -o winevdm.exe.dbg.c --debug -C. winevdm.c
rm -f winevdm && ln -s ../../tools/winewrapper winevdm
gcc -m32 -c -I. -I. -I../../include -I../../include  -DWINE_NO_DEBUG_MSGS -DWINE_NO_TRACE_MSGS  -D_REENTRANT -fPIC -Wall -pipe -mpreferred-stack-boundary=2 -fno-strict-aliasing -gstabs+ -Wpointer-arith  -march=athlon64 -O2 -pipe -o winevdm.exe.dbg.o winevdm.exe.dbg.c
../../tools/winegcc/winegcc -B../../tools/winebuild -mconsole winevdm.o  winevdm.exe.dbg.o  -o winevdm.exe.so -L../../dlls  -lwinedos -luser32 -lkernel32 -L../../libs/wine -lwine  -L../../libs/port -lwine_port
../../tools/winebuild/winebuild -DWINE_NO_DEBUG_MSGS -DWINE_NO_TRACE_MSGS  -o winetest.exe.dbg.c --debug -C. gui.c main.c send.c util.c
../../tools/bin2res -f -o wine.ico ./winetest.rc
cp ../../dlls/advpack/tests/advpack_test.exe.so advpack_test.exe.so && x86_64-pc-linux-gnu-strip advpack_test.exe.so
make[2]: Leaving directory `/var/tmp/portage/wine-20050310/work/wine-20050310/programs/winevdm'
cp ../../dlls/advapi32/tests/advapi32_test.exe.so advapi32_test.exe.so && x86_64-pc-linux-gnu-strip advapi32_test.exe.so
make[2]: Entering directory `/var/tmp/portage/wine-20050310/work/wine-20050310/programs/winhelp'
gcc -m32 -c -I. -I. -I../../include -I../../include  -DWINE_NO_DEBUG_MSGS -DWINE_NO_TRACE_MSGS  -D_REENTRANT -fPIC -Wall -pipe -mpreferred-stack-boundary=2 -fno-strict-aliasing -gstabs+ -Wpointer-arith  -march=athlon64 -O2 -pipe -o callback.o callback.c
cp ../../dlls/comctl32/tests/comctl32_test.exe.so comctl32_test.exe.so && x86_64-pc-linux-gnu-strip comctl32_test.exe.so
make[2]: *** No rule to make target `../../dlls/ddraw/tests/ddraw_test.exe.so', needed by `ddraw_test.exe.so'.  Stop.
make[2]: *** Waiting for unfinished jobs....
make[2]: Leaving directory `/var/tmp/portage/wine-20050310/work/wine-20050310/programs/winetest'
make[1]: *** [winetest] Error 2
make[1]: *** Waiting for unfinished jobs....
gcc -m32 -c -I. -I. -I../../include -I../../include  -DWINE_NO_DEBUG_MSGS -DWINE_NO_TRACE_MSGS  -D_REENTRANT -fPIC -Wall -pipe -mpreferred-stack-boundary=2 -fno-strict-aliasing -gstabs+ -Wpointer-arith  -march=athlon64 -O2 -pipe -o hlpfile.o hlpfile.c
gcc -m32 -c -I. -I. -I../../include -I../../include  -DWINE_NO_DEBUG_MSGS -DWINE_NO_TRACE_MSGS  -D_REENTRANT -fPIC -Wall -pipe -mpreferred-stack-boundary=2 -fno-strict-aliasing -gstabs+ -Wpointer-arith  -march=athlon64 -O2 -pipe -o macro.o macro.c
gcc -m32 -c -I. -I. -I../../include -I../../include  -DWINE_NO_DEBUG_MSGS -DWINE_NO_TRACE_MSGS  -D_REENTRANT -fPIC -Wall -pipe -mpreferred-stack-boundary=2 -fno-strict-aliasing -gstabs+ -Wpointer-arith  -march=athlon64 -O2 -pipe -o string.o string.c
gcc -m32 -c -I. -I. -I../../include -I../../include  -DWINE_NO_DEBUG_MSGS -DWINE_NO_TRACE_MSGS  -D_REENTRANT -fPIC -Wall -pipe -mpreferred-stack-boundary=2 -fno-strict-aliasing -gstabs+ -Wpointer-arith  -march=athlon64 -O2 -pipe -o winhelp.o winhelp.c
flex -8 -i ./macro.lex.l
../../tools/winebuild/winebuild -DWINE_NO_DEBUG_MSGS -DWINE_NO_TRACE_MSGS  -o winhelp.exe.dbg.c --debug -C. callback.c hlpfile.c macro.c string.c winhelp.c
LD_LIBRARY_PATH="../../libs/unicode:$LD_LIBRARY_PATH" ../../tools/wrc/wrc --nostdinc -I. -I. -I../../include -I../../include  -DWINE_NO_DEBUG_MSGS -DWINE_NO_TRACE_MSGS  -DWINELIB -forsrc.res rsrc.rc
rm -f winhelp && ln -s ../../tools/winewrapper winhelp
gcc -m32 -c -I. -I. -I../../include -I../../include  -DWINE_NO_DEBUG_MSGS -DWINE_NO_TRACE_MSGS  -D_REENTRANT -fPIC -Wall -pipe -mpreferred-stack-boundary=2 -fno-strict-aliasing -gstabs+ -Wpointer-arith  -march=athlon64 -O2 -pipe -o hlp2sgml.o hlp2sgml.c
gcc -m32 -c -I. -I. -I../../include -I../../include  -DWINE_NO_DEBUG_MSGS -DWINE_NO_TRACE_MSGS  -D_REENTRANT -fPIC -Wall -pipe -mpreferred-stack-boundary=2 -fno-strict-aliasing -gstabs+ -Wpointer-arith  -march=athlon64 -O2 -pipe -o lex.yy.o lex.yy.c
./macro.lex.l:120: let op: 'ts' defined but not used
gcc -m32 -c -I. -I. -I../../include -I../../include  -DWINE_NO_DEBUG_MSGS -DWINE_NO_TRACE_MSGS  -D_REENTRANT -fPIC -Wall -pipe -mpreferred-stack-boundary=2 -fno-strict-aliasing -gstabs+ -Wpointer-arith  -march=athlon64 -O2 -pipe -o winhelp.exe.dbg.o winhelp.exe.dbg.c
gcc -m32 -o hlp2sgml hlp2sgml.o hlpfile.o
../../tools/winegcc/winegcc -B../../tools/winebuild -mwindows callback.o hlpfile.o macro.o string.o winhelp.o lex.yy.o winhelp.exe.dbg.o rsrc.res -o winhelp.exe.so -L../../dlls  -lcomdlg32 -lshell32 -luser32 -lgdi32 -lkernel32 -L../../libs/wine -lwine  -L../../libs/port -lwine_port
make[2]: Leaving directory `/var/tmp/portage/wine-20050310/work/wine-20050310/programs/winhelp'
make[1]: Leaving directory `/var/tmp/portage/wine-20050310/work/wine-20050310/programs'
make: *** [programs] Error 2

!!! ERROR: app-emulation/wine-20050310 failed.
!!! Function src_compile, Line 103, Exitcode 2
!!! all
!!! If you need support, post the topmost build error, NOT this status message.


emerge info:
Code:
Portage 2.0.51.19 (default-linux/amd64/2005.0, gcc-3.4.3-20050110, glibc-2.3.4.20050125-r1, 2.6.11-mm4 x86_64)
=================================================================
System uname: 2.6.11-mm4 x86_64 AMD Athlon(tm) 64 Processor 3000+
Gentoo Base System version 1.6.10
Python:              dev-lang/python-2.3.5 [2.3.5 (#1, Mar  5 2005, 14:41:15)]
ccache version 2.4 [enabled]
dev-lang/python:     2.3.5
sys-devel/autoconf:  2.59-r6, 2.13
sys-devel/automake:  1.7.9-r1, 1.8.5-r3, 1.5, 1.4_p6, 1.6.3, 1.9.5
sys-devel/binutils:  2.15.92.0.2-r7
sys-devel/libtool:   1.5.14
virtual/os-headers:  2.6.8.1-r4
ACCEPT_KEYWORDS="amd64 ~amd64"
AUTOCLEAN="yes"
CFLAGS="-march=athlon64 -O2 -pipe"
CHOST="x86_64-pc-linux-gnu"
CONFIG_PROTECT="/etc /usr/kde/2/share/config /usr/kde/3.3/env /usr/kde/3.3/share/config /usr/kde/3.3/shutdown /usr/kde/3.4/env /usr/kde/3.4/share/config /usr/kde/3.4/shutdown /usr/kde/3/share/config /usr/lib/X11/xkb /usr/lib/mozilla/defaults/pref /usr/share/config /var/qmail/control"
CONFIG_PROTECT_MASK="/etc/gconf /etc/terminfo /etc/texmf/web2c /etc/env.d"
CXXFLAGS="-march=athlon64 -O2 -pipe"
DISTDIR="/usr/portage/distfiles"
FEATURES="autoaddcvs autoconfig ccache distlocks fixpackages"
GENTOO_MIRRORS="http://ftp.belnet.be/mirror/rsync.gentoo.org/gentoo/ http://ftp.snt.utwente.nl/pub/os/linux/gentoo ftp://ftp.belnet.be/mirror/rsync.gentoo.org/gentoo/ ftp://ftp.snt.utwente.nl/pub/os/linux/gentoo"
LANG="nl_BE@euro"
MAKEOPTS="-j2"
PKGDIR="/usr/portage/packages"
PORTAGE_TMPDIR="/var/tmp"
PORTDIR="/usr/portage"
PORTDIR_OVERLAY="/usr/local/portage"
SYNC="rsync://rsync.be.gentoo.org/gentoo-portage"
USE="amd64 X Xaw3d aalib acpi alsa apache2 arts avi bash-completion berkdb bitmap-fonts cdr crypt cups curl doc dvd dvdr esd fam flac flash font-server fortran gd gdbm geoip gif gnome gpm gstreamer gtk gtk2 gtkhtml guile hal imagemagick imlib innodb java javascript jp2 jpeg kde kdeenablefinal kdexdeltas libcaca libwww lm_sensors lzw lzw-tiff mad maildir motif mozilla mp3 mpeg mysql ncurses neXt nls nvidia offensive oggvorbis opengl oss pam pdflib perl php png python qt readline sasl scanner sdl slang snmp spell ssl svg symlink tcltk tcpd tetex tidy tiff truetype truetype-fonts type1-fonts usb userlocales wmf xine xml xml2 xmms xosd xpm xprint xrandr xv zlib linguas_nl"
Unset:  ASFLAGS, CBUILD, CTARGET, LC_ALL, LDFLAGS

_________________
411 /0µr 84$3 4r3 8310n9 70 µ$.
Back to top
View user's profile Send private message
localghost
Apprentice
Apprentice


Joined: 28 Oct 2004
Posts: 185
Location: Sint-Niklaas, Belgium

PostPosted: Mon Apr 04, 2005 10:24 pm    Post subject: Reply with quote

YESS!!! I finally solved it:
Code:
emerge -C wine

No more emerge errors. Finally!
_________________
411 /0µr 84$3 4r3 8310n9 70 µ$.
Back to top
View user's profile Send private message
GimpBrush
n00b
n00b


Joined: 25 Mar 2005
Posts: 25

PostPosted: Mon Apr 04, 2005 11:34 pm    Post subject: Reply with quote

fixme:ttydrv:TTYDRV_DC_StretchBlt (0xc0, 544, 0, 16, 16, 0x744, 0, 0, 16, 32, 13369376): stub
fixme:ttydrv:TTYDRV_DC_StretchBlt (0xc8, 544, 0, 16, 16, 0x744, 0, 0, 16, 32, 13369376): stub
fixme:ttydrv:TTYDRV_GetBitmapBits (0x750, 0x5594728c, 128): stub
fixme:ttydrv:TTYDRV_GetBitmapBits (0x74c, 0x5594730c, 128): stub
err:imagelist:ImageList_ReplaceIcon no color!
fixme:ttydrv:TTYDRV_DC_StretchBlt (0xe4, 1088, 0, 32, 32, 0x758, 0, 0, 32, 64, 13369376): stub
fixme:ttydrv:TTYDRV_DC_StretchBlt (0xec, 1088, 0, 32, 32, 0x758, 0, 0, 32, 64, 13369376): stub
fixme:ttydrv:TTYDRV_GetBitmapBits (0x764, 0x559472d4, 32): stub
fixme:ttydrv:TTYDRV_GetBitmapBits (0x760, 0x559472f4, 32): stub
err:imagelist:ImageList_ReplaceIcon no color!
i do sucefull compil but when i use i have this errors.
Back to top
View user's profile Send private message
localghost
Apprentice
Apprentice


Joined: 28 Oct 2004
Posts: 185
Location: Sint-Niklaas, Belgium

PostPosted: Fri Apr 08, 2005 5:45 pm    Post subject: Reply with quote

localghost wrote:
Congratulations for all your errors, this is mine after disabling ALL use flags on wine:
Code:
make[2]: Leaving directory `/var/tmp/portage/wine-20050310/work/wine-20050310/programs/winepath'
gcc -m32 -c -I. -I. -I../../include -I../../include  -DWINE_NO_DEBUG_MSGS -DWINE_NO_TRACE_MSGS  -D_REENTRANT -fPIC -Wall -pipe -mpreferred-stack-boundary=2 -fno-strict-aliasing -gstabs+ -Wpointer-arith  -march=athlon64 -O2 -pipe -o main.o main.c
make[2]: Entering directory `/var/tmp/portage/wine-20050310/work/wine-20050310/programs/winevdm'
gcc -m32 -c -I. -I. -I../../include -I../../include  -DWINE_NO_DEBUG_MSGS -DWINE_NO_TRACE_MSGS  -D_REENTRANT -fPIC -Wall -pipe -mpreferred-stack-boundary=2 -fno-strict-aliasing -gstabs+ -Wpointer-arith  -march=athlon64 -O2 -pipe -o winevdm.o winevdm.c
../../tools/winebuild/winebuild -DWINE_NO_DEBUG_MSGS -DWINE_NO_TRACE_MSGS  -o winevdm.exe.dbg.c --debug -C. winevdm.c
rm -f winevdm && ln -s ../../tools/winewrapper winevdm
gcc -m32 -c -I. -I. -I../../include -I../../include  -DWINE_NO_DEBUG_MSGS -DWINE_NO_TRACE_MSGS  -D_REENTRANT -fPIC -Wall -pipe -mpreferred-stack-boundary=2 -fno-strict-aliasing -gstabs+ -Wpointer-arith  -march=athlon64 -O2 -pipe -o winevdm.exe.dbg.o winevdm.exe.dbg.c
gcc -m32 -c -I. -I. -I../../include -I../../include  -DWINE_NO_DEBUG_MSGS -DWINE_NO_TRACE_MSGS  -D_REENTRANT -fPIC -Wall -pipe -mpreferred-stack-boundary=2 -fno-strict-aliasing -gstabs+ -Wpointer-arith  -march=athlon64 -O2 -pipe -o send.o send.c
../../tools/winegcc/winegcc -B../../tools/winebuild -mconsole winevdm.o  winevdm.exe.dbg.o  -o winevdm.exe.so -L../../dlls  -lwinedos -luser32 -lkernel32 -L../../libs/wine -lwine  -L../../libs/port -lwine_port -Wl,-O1
gcc -m32 -c -I. -I. -I../../include -I../../include  -DWINE_NO_DEBUG_MSGS -DWINE_NO_TRACE_MSGS  -D_REENTRANT -fPIC -Wall -pipe -mpreferred-stack-boundary=2 -fno-strict-aliasing -gstabs+ -Wpointer-arith  -march=athlon64 -O2 -pipe -o util.o util.c
make[2]: Leaving directory `/var/tmp/portage/wine-20050310/work/wine-20050310/programs/winevdm'
make[2]: Entering directory `/var/tmp/portage/wine-20050310/work/wine-20050310/programs/winhelp'
gcc -m32 -c -I. -I. -I../../include -I../../include  -DWINE_NO_DEBUG_MSGS -DWINE_NO_TRACE_MSGS  -D_REENTRANT -fPIC -Wall -pipe -mpreferred-stack-boundary=2 -fno-strict-aliasing -gstabs+ -Wpointer-arith  -march=athlon64 -O2 -pipe -o callback.o callback.c
../../tools/winebuild/winebuild -DWINE_NO_DEBUG_MSGS -DWINE_NO_TRACE_MSGS  -o winetest.exe.dbg.c --debug -C. gui.c main.c send.c util.c
../../tools/bin2res -f -o wine.ico ./winetest.rc
cp ../../dlls/advpack/tests/advpack_test.exe.so advpack_test.exe.so && x86_64-pc-linux-gnu-strip advpack_test.exe.so
cp ../../dlls/advapi32/tests/advapi32_test.exe.so advapi32_test.exe.so && x86_64-pc-linux-gnu-strip advapi32_test.exe.so
gcc -m32 -c -I. -I. -I../../include -I../../include  -DWINE_NO_DEBUG_MSGS -DWINE_NO_TRACE_MSGS  -D_REENTRANT -fPIC -Wall -pipe -mpreferred-stack-boundary=2 -fno-strict-aliasing -gstabs+ -Wpointer-arith  -march=athlon64 -O2 -pipe -o hlpfile.o hlpfile.c
cp ../../dlls/comctl32/tests/comctl32_test.exe.so comctl32_test.exe.so && x86_64-pc-linux-gnu-strip comctl32_test.exe.so
make[2]: *** No rule to make target `../../dlls/ddraw/tests/ddraw_test.exe.so', needed by `ddraw_test.exe.so'.  Stop.
make[2]: *** Waiting for unfinished jobs....
make[2]: Leaving directory `/var/tmp/portage/wine-20050310/work/wine-20050310/programs/winetest'
make[1]: *** [winetest] Error 2
make[1]: *** Waiting for unfinished jobs....
gcc -m32 -c -I. -I. -I../../include -I../../include  -DWINE_NO_DEBUG_MSGS -DWINE_NO_TRACE_MSGS  -D_REENTRANT -fPIC -Wall -pipe -mpreferred-stack-boundary=2 -fno-strict-aliasing -gstabs+ -Wpointer-arith  -march=athlon64 -O2 -pipe -o macro.o macro.c
gcc -m32 -c -I. -I. -I../../include -I../../include  -DWINE_NO_DEBUG_MSGS -DWINE_NO_TRACE_MSGS  -D_REENTRANT -fPIC -Wall -pipe -mpreferred-stack-boundary=2 -fno-strict-aliasing -gstabs+ -Wpointer-arith  -march=athlon64 -O2 -pipe -o string.o string.c
gcc -m32 -c -I. -I. -I../../include -I../../include  -DWINE_NO_DEBUG_MSGS -DWINE_NO_TRACE_MSGS  -D_REENTRANT -fPIC -Wall -pipe -mpreferred-stack-boundary=2 -fno-strict-aliasing -gstabs+ -Wpointer-arith  -march=athlon64 -O2 -pipe -o winhelp.o winhelp.c
flex -8 -i ./macro.lex.l
../../tools/winebuild/winebuild -DWINE_NO_DEBUG_MSGS -DWINE_NO_TRACE_MSGS  -o winhelp.exe.dbg.c --debug -C. callback.c hlpfile.c macro.c string.c winhelp.c
LD_LIBRARY_PATH="../../libs/unicode:$LD_LIBRARY_PATH" ../../tools/wrc/wrc --nostdinc -I. -I. -I../../include -I../../include  -DWINE_NO_DEBUG_MSGS -DWINE_NO_TRACE_MSGS  -DWINELIB -forsrc.res rsrc.rc
rm -f winhelp && ln -s ../../tools/winewrapper winhelp
gcc -m32 -c -I. -I. -I../../include -I../../include  -DWINE_NO_DEBUG_MSGS -DWINE_NO_TRACE_MSGS  -D_REENTRANT -fPIC -Wall -pipe -mpreferred-stack-boundary=2 -fno-strict-aliasing -gstabs+ -Wpointer-arith  -march=athlon64 -O2 -pipe -o hlp2sgml.o hlp2sgml.c
gcc -m32 -c -I. -I. -I../../include -I../../include  -DWINE_NO_DEBUG_MSGS -DWINE_NO_TRACE_MSGS  -D_REENTRANT -fPIC -Wall -pipe -mpreferred-stack-boundary=2 -fno-strict-aliasing -gstabs+ -Wpointer-arith  -march=athlon64 -O2 -pipe -o lex.yy.o lex.yy.c
./macro.lex.l:120: let op: 'ts' defined but not used
gcc -m32 -c -I. -I. -I../../include -I../../include  -DWINE_NO_DEBUG_MSGS -DWINE_NO_TRACE_MSGS  -D_REENTRANT -fPIC -Wall -pipe -mpreferred-stack-boundary=2 -fno-strict-aliasing -gstabs+ -Wpointer-arith  -march=athlon64 -O2 -pipe -o winhelp.exe.dbg.o winhelp.exe.dbg.c
gcc -m32 -o hlp2sgml hlp2sgml.o hlpfile.o -Wl,-O1
../../tools/winegcc/winegcc -B../../tools/winebuild -mwindows callback.o hlpfile.o macro.o string.o winhelp.o lex.yy.o winhelp.exe.dbg.o rsrc.res -o winhelp.exe.so -L../../dlls  -lcomdlg32 -lshell32 -luser32 -lgdi32 -lkernel32 -L../../libs/wine -lwine  -L../../libs/port -lwine_port -Wl,-O1
make[2]: Leaving directory `/var/tmp/portage/wine-20050310/work/wine-20050310/programs/winhelp'
make[1]: Leaving directory `/var/tmp/portage/wine-20050310/work/wine-20050310/programs'
make: *** [programs] Error 2

!!! ERROR: app-emulation/wine-20050310 failed.
!!! Function src_compile, Line 103, Exitcode 2
!!! all
!!! If you need support, post the topmost build error, NOT this status message.


emerge info:
Code:
ortage 2.0.51.19 (default-linux/amd64/2005.0, gcc-3.4.3-20050110, glibc-2.3.4.20050125-r1, 2.6.12-rc1-mm3 x86_64)
=================================================================
System uname: 2.6.12-rc1-mm3 x86_64 AMD Athlon(tm) 64 Processor 3000+
Gentoo Base System version 1.6.10
Python:              dev-lang/python-2.3.5 [2.3.5 (#1, Mar  5 2005, 14:41:15)]
ccache version 2.4 [enabled]
dev-lang/python:     2.3.5
sys-devel/autoconf:  2.59-r6, 2.13
sys-devel/automake:  1.7.9-r1, 1.8.5-r3, 1.5, 1.4_p6, 1.6.3, 1.9.5
sys-devel/binutils:  2.15.92.0.2-r8
sys-devel/libtool:   1.5.14
virtual/os-headers:  2.6.8.1-r4
ACCEPT_KEYWORDS="amd64 ~amd64"
AUTOCLEAN="yes"
CFLAGS="-march=athlon64 -O2 -pipe"
CHOST="x86_64-pc-linux-gnu"
CONFIG_PROTECT="/etc /usr/kde/2/share/config /usr/kde/3.3/env /usr/kde/3.3/share/config /usr/kde/3.3/shutdown /usr/kde/3.4/env /usr/kde/3.4/share/config /usr/kde/3.4/shutdown /usr/kde/3/share/config /usr/lib/X11/xkb /usr/lib/mozilla/defaults/pref /usr/share/config /var/qmail/control"
CONFIG_PROTECT_MASK="/etc/gconf /etc/terminfo /etc/texmf/web2c /etc/env.d"
CXXFLAGS="-march=athlon64 -O2 -pipe"
DISTDIR="/usr/portage/distfiles"
FEATURES="autoaddcvs autoconfig ccache distlocks fixpackages"
GENTOO_MIRRORS="http://ftp.belnet.be/mirror/rsync.gentoo.org/gentoo/ http://ftp.snt.utwente.nl/pub/os/linux/gentoo ftp://ftp.belnet.be/mirror/rsync.gentoo.org/gentoo/ ftp://ftp.snt.utwente.nl/pub/os/linux/gentoo"
LANG="nl_BE@euro"
LC_ALL="nl_BE@euro"
LDFLAGS="-Wl,-O1"
MAKEOPTS="-j2"
PKGDIR="/usr/portage/packages"
PORTAGE_TMPDIR="/var/tmp"
PORTDIR="/usr/portage"
PORTDIR_OVERLAY="/usr/local/portage"
SYNC="rsync://rsync.be.gentoo.org/gentoo-portage"
USE="amd64 X Xaw3d aalib acpi alsa apache2 arts avi bash-completion berkdb bitmap-fonts cdr crypt cups curl doc dvd dvdr esd fam flac flash font-server fortran gd gdbm geoip gif gnome gpm gstreamer gtk gtk2 gtkhtml guile hal imagemagick imlib innodb java javascript jp2 jpeg kde kdeenablefinal kdexdeltas libcaca libwww lm_sensors lzw lzw-tiff mad maildir motif mozilla mp3 mpeg mysql ncurses neXt nls nvidia offensive oggvorbis opengl oss pam pdflib perl php png python qt readline sasl scanner sdl slang snmp spell ssl svg symlink tcltk tcpd tetex tidy tiff truetype truetype-fonts type1-fonts usb userlocales wmf xine xml xml2 xmms xosd xpm xprint xrandr xv zlib linguas_nl"
Unset:  ASFLAGS, CBUILD, CTARGET

*bump*

It seems like there is no solution for this problem?
Should I report this in bugzilla?
_________________
411 /0µr 84$3 4r3 8310n9 70 µ$.
Back to top
View user's profile Send private message
localghost
Apprentice
Apprentice


Joined: 28 Oct 2004
Posts: 185
Location: Sint-Niklaas, Belgium

PostPosted: Sun Apr 10, 2005 5:10 pm    Post subject: Reply with quote

localghost wrote:
localghost wrote:
Congratulations for all your errors, this is mine after disabling ALL use flags on wine:
Code:
make[2]: Leaving directory `/var/tmp/portage/wine-20050310/work/wine-20050310/programs/winepath'
gcc -m32 -c -I. -I. -I../../include -I../../include  -DWINE_NO_DEBUG_MSGS -DWINE_NO_TRACE_MSGS  -D_REENTRANT -fPIC -Wall -pipe -mpreferred-stack-boundary=2 -fno-strict-aliasing -gstabs+ -Wpointer-arith  -march=athlon64 -O2 -pipe -o main.o main.c
make[2]: Entering directory `/var/tmp/portage/wine-20050310/work/wine-20050310/programs/winevdm'
gcc -m32 -c -I. -I. -I../../include -I../../include  -DWINE_NO_DEBUG_MSGS -DWINE_NO_TRACE_MSGS  -D_REENTRANT -fPIC -Wall -pipe -mpreferred-stack-boundary=2 -fno-strict-aliasing -gstabs+ -Wpointer-arith  -march=athlon64 -O2 -pipe -o winevdm.o winevdm.c
../../tools/winebuild/winebuild -DWINE_NO_DEBUG_MSGS -DWINE_NO_TRACE_MSGS  -o winevdm.exe.dbg.c --debug -C. winevdm.c
rm -f winevdm && ln -s ../../tools/winewrapper winevdm
gcc -m32 -c -I. -I. -I../../include -I../../include  -DWINE_NO_DEBUG_MSGS -DWINE_NO_TRACE_MSGS  -D_REENTRANT -fPIC -Wall -pipe -mpreferred-stack-boundary=2 -fno-strict-aliasing -gstabs+ -Wpointer-arith  -march=athlon64 -O2 -pipe -o winevdm.exe.dbg.o winevdm.exe.dbg.c
gcc -m32 -c -I. -I. -I../../include -I../../include  -DWINE_NO_DEBUG_MSGS -DWINE_NO_TRACE_MSGS  -D_REENTRANT -fPIC -Wall -pipe -mpreferred-stack-boundary=2 -fno-strict-aliasing -gstabs+ -Wpointer-arith  -march=athlon64 -O2 -pipe -o send.o send.c
../../tools/winegcc/winegcc -B../../tools/winebuild -mconsole winevdm.o  winevdm.exe.dbg.o  -o winevdm.exe.so -L../../dlls  -lwinedos -luser32 -lkernel32 -L../../libs/wine -lwine  -L../../libs/port -lwine_port -Wl,-O1
gcc -m32 -c -I. -I. -I../../include -I../../include  -DWINE_NO_DEBUG_MSGS -DWINE_NO_TRACE_MSGS  -D_REENTRANT -fPIC -Wall -pipe -mpreferred-stack-boundary=2 -fno-strict-aliasing -gstabs+ -Wpointer-arith  -march=athlon64 -O2 -pipe -o util.o util.c
make[2]: Leaving directory `/var/tmp/portage/wine-20050310/work/wine-20050310/programs/winevdm'
make[2]: Entering directory `/var/tmp/portage/wine-20050310/work/wine-20050310/programs/winhelp'
gcc -m32 -c -I. -I. -I../../include -I../../include  -DWINE_NO_DEBUG_MSGS -DWINE_NO_TRACE_MSGS  -D_REENTRANT -fPIC -Wall -pipe -mpreferred-stack-boundary=2 -fno-strict-aliasing -gstabs+ -Wpointer-arith  -march=athlon64 -O2 -pipe -o callback.o callback.c
../../tools/winebuild/winebuild -DWINE_NO_DEBUG_MSGS -DWINE_NO_TRACE_MSGS  -o winetest.exe.dbg.c --debug -C. gui.c main.c send.c util.c
../../tools/bin2res -f -o wine.ico ./winetest.rc
cp ../../dlls/advpack/tests/advpack_test.exe.so advpack_test.exe.so && x86_64-pc-linux-gnu-strip advpack_test.exe.so
cp ../../dlls/advapi32/tests/advapi32_test.exe.so advapi32_test.exe.so && x86_64-pc-linux-gnu-strip advapi32_test.exe.so
gcc -m32 -c -I. -I. -I../../include -I../../include  -DWINE_NO_DEBUG_MSGS -DWINE_NO_TRACE_MSGS  -D_REENTRANT -fPIC -Wall -pipe -mpreferred-stack-boundary=2 -fno-strict-aliasing -gstabs+ -Wpointer-arith  -march=athlon64 -O2 -pipe -o hlpfile.o hlpfile.c
cp ../../dlls/comctl32/tests/comctl32_test.exe.so comctl32_test.exe.so && x86_64-pc-linux-gnu-strip comctl32_test.exe.so
make[2]: *** No rule to make target `../../dlls/ddraw/tests/ddraw_test.exe.so', needed by `ddraw_test.exe.so'.  Stop.
make[2]: *** Waiting for unfinished jobs....
make[2]: Leaving directory `/var/tmp/portage/wine-20050310/work/wine-20050310/programs/winetest'
make[1]: *** [winetest] Error 2
make[1]: *** Waiting for unfinished jobs....
gcc -m32 -c -I. -I. -I../../include -I../../include  -DWINE_NO_DEBUG_MSGS -DWINE_NO_TRACE_MSGS  -D_REENTRANT -fPIC -Wall -pipe -mpreferred-stack-boundary=2 -fno-strict-aliasing -gstabs+ -Wpointer-arith  -march=athlon64 -O2 -pipe -o macro.o macro.c
gcc -m32 -c -I. -I. -I../../include -I../../include  -DWINE_NO_DEBUG_MSGS -DWINE_NO_TRACE_MSGS  -D_REENTRANT -fPIC -Wall -pipe -mpreferred-stack-boundary=2 -fno-strict-aliasing -gstabs+ -Wpointer-arith  -march=athlon64 -O2 -pipe -o string.o string.c
gcc -m32 -c -I. -I. -I../../include -I../../include  -DWINE_NO_DEBUG_MSGS -DWINE_NO_TRACE_MSGS  -D_REENTRANT -fPIC -Wall -pipe -mpreferred-stack-boundary=2 -fno-strict-aliasing -gstabs+ -Wpointer-arith  -march=athlon64 -O2 -pipe -o winhelp.o winhelp.c
flex -8 -i ./macro.lex.l
../../tools/winebuild/winebuild -DWINE_NO_DEBUG_MSGS -DWINE_NO_TRACE_MSGS  -o winhelp.exe.dbg.c --debug -C. callback.c hlpfile.c macro.c string.c winhelp.c
LD_LIBRARY_PATH="../../libs/unicode:$LD_LIBRARY_PATH" ../../tools/wrc/wrc --nostdinc -I. -I. -I../../include -I../../include  -DWINE_NO_DEBUG_MSGS -DWINE_NO_TRACE_MSGS  -DWINELIB -forsrc.res rsrc.rc
rm -f winhelp && ln -s ../../tools/winewrapper winhelp
gcc -m32 -c -I. -I. -I../../include -I../../include  -DWINE_NO_DEBUG_MSGS -DWINE_NO_TRACE_MSGS  -D_REENTRANT -fPIC -Wall -pipe -mpreferred-stack-boundary=2 -fno-strict-aliasing -gstabs+ -Wpointer-arith  -march=athlon64 -O2 -pipe -o hlp2sgml.o hlp2sgml.c
gcc -m32 -c -I. -I. -I../../include -I../../include  -DWINE_NO_DEBUG_MSGS -DWINE_NO_TRACE_MSGS  -D_REENTRANT -fPIC -Wall -pipe -mpreferred-stack-boundary=2 -fno-strict-aliasing -gstabs+ -Wpointer-arith  -march=athlon64 -O2 -pipe -o lex.yy.o lex.yy.c
./macro.lex.l:120: let op: 'ts' defined but not used
gcc -m32 -c -I. -I. -I../../include -I../../include  -DWINE_NO_DEBUG_MSGS -DWINE_NO_TRACE_MSGS  -D_REENTRANT -fPIC -Wall -pipe -mpreferred-stack-boundary=2 -fno-strict-aliasing -gstabs+ -Wpointer-arith  -march=athlon64 -O2 -pipe -o winhelp.exe.dbg.o winhelp.exe.dbg.c
gcc -m32 -o hlp2sgml hlp2sgml.o hlpfile.o -Wl,-O1
../../tools/winegcc/winegcc -B../../tools/winebuild -mwindows callback.o hlpfile.o macro.o string.o winhelp.o lex.yy.o winhelp.exe.dbg.o rsrc.res -o winhelp.exe.so -L../../dlls  -lcomdlg32 -lshell32 -luser32 -lgdi32 -lkernel32 -L../../libs/wine -lwine  -L../../libs/port -lwine_port -Wl,-O1
make[2]: Leaving directory `/var/tmp/portage/wine-20050310/work/wine-20050310/programs/winhelp'
make[1]: Leaving directory `/var/tmp/portage/wine-20050310/work/wine-20050310/programs'
make: *** [programs] Error 2

!!! ERROR: app-emulation/wine-20050310 failed.
!!! Function src_compile, Line 103, Exitcode 2
!!! all
!!! If you need support, post the topmost build error, NOT this status message.


emerge info:
Code:
ortage 2.0.51.19 (default-linux/amd64/2005.0, gcc-3.4.3-20050110, glibc-2.3.4.20050125-r1, 2.6.12-rc1-mm3 x86_64)
=================================================================
System uname: 2.6.12-rc1-mm3 x86_64 AMD Athlon(tm) 64 Processor 3000+
Gentoo Base System version 1.6.10
Python:              dev-lang/python-2.3.5 [2.3.5 (#1, Mar  5 2005, 14:41:15)]
ccache version 2.4 [enabled]
dev-lang/python:     2.3.5
sys-devel/autoconf:  2.59-r6, 2.13
sys-devel/automake:  1.7.9-r1, 1.8.5-r3, 1.5, 1.4_p6, 1.6.3, 1.9.5
sys-devel/binutils:  2.15.92.0.2-r8
sys-devel/libtool:   1.5.14
virtual/os-headers:  2.6.8.1-r4
ACCEPT_KEYWORDS="amd64 ~amd64"
AUTOCLEAN="yes"
CFLAGS="-march=athlon64 -O2 -pipe"
CHOST="x86_64-pc-linux-gnu"
CONFIG_PROTECT="/etc /usr/kde/2/share/config /usr/kde/3.3/env /usr/kde/3.3/share/config /usr/kde/3.3/shutdown /usr/kde/3.4/env /usr/kde/3.4/share/config /usr/kde/3.4/shutdown /usr/kde/3/share/config /usr/lib/X11/xkb /usr/lib/mozilla/defaults/pref /usr/share/config /var/qmail/control"
CONFIG_PROTECT_MASK="/etc/gconf /etc/terminfo /etc/texmf/web2c /etc/env.d"
CXXFLAGS="-march=athlon64 -O2 -pipe"
DISTDIR="/usr/portage/distfiles"
FEATURES="autoaddcvs autoconfig ccache distlocks fixpackages"
GENTOO_MIRRORS="http://ftp.belnet.be/mirror/rsync.gentoo.org/gentoo/ http://ftp.snt.utwente.nl/pub/os/linux/gentoo ftp://ftp.belnet.be/mirror/rsync.gentoo.org/gentoo/ ftp://ftp.snt.utwente.nl/pub/os/linux/gentoo"
LANG="nl_BE@euro"
LC_ALL="nl_BE@euro"
LDFLAGS="-Wl,-O1"
MAKEOPTS="-j2"
PKGDIR="/usr/portage/packages"
PORTAGE_TMPDIR="/var/tmp"
PORTDIR="/usr/portage"
PORTDIR_OVERLAY="/usr/local/portage"
SYNC="rsync://rsync.be.gentoo.org/gentoo-portage"
USE="amd64 X Xaw3d aalib acpi alsa apache2 arts avi bash-completion berkdb bitmap-fonts cdr crypt cups curl doc dvd dvdr esd fam flac flash font-server fortran gd gdbm geoip gif gnome gpm gstreamer gtk gtk2 gtkhtml guile hal imagemagick imlib innodb java javascript jp2 jpeg kde kdeenablefinal kdexdeltas libcaca libwww lm_sensors lzw lzw-tiff mad maildir motif mozilla mp3 mpeg mysql ncurses neXt nls nvidia offensive oggvorbis opengl oss pam pdflib perl php png python qt readline sasl scanner sdl slang snmp spell ssl svg symlink tcltk tcpd tetex tidy tiff truetype truetype-fonts type1-fonts usb userlocales wmf xine xml xml2 xmms xosd xpm xprint xrandr xv zlib linguas_nl"
Unset:  ASFLAGS, CBUILD, CTARGET

*bump*

It seems like there is no solution for this problem?
Should I report this in bugzilla?


I added my comments in bugzilla:
http://bugs.gentoo.org/show_bug.cgi?id=85661#c15
_________________
411 /0µr 84$3 4r3 8310n9 70 µ$.
Back to top
View user's profile Send private message
Lucky B
Apprentice
Apprentice


Joined: 01 Apr 2005
Posts: 235
Location: Florida

PostPosted: Mon Apr 11, 2005 5:03 am    Post subject: Reply with quote

yay, solution to the pthread_join problem:

locate libphtread and delete the ones inside /emul/linux/x86/

this solved it for me.

I think running:
Code:

equery l -i emul-linux*


And unmerging all those packages, then:
Code:

rm -rf /emul/


then re-emerging the packages listed by equery earlier.

will make it better also, but I haven't tried.
Back to top
View user's profile Send private message
Display posts from previous:   
Reply to topic    Gentoo Forums Forum Index Gentoo on AMD64 All times are GMT
Goto page Previous  1, 2, 3, 4, 5 ... 9, 10, 11  Next
Page 4 of 11

 
Jump to:  
You cannot post new topics in this forum
You cannot reply to topics in this forum
You cannot edit your posts in this forum
You cannot delete your posts in this forum
You cannot vote in polls in this forum