Gentoo Forums
Gentoo Forums
Gentoo Forums
Quick Search: in
akonadi-server fails to compile
View unanswered posts
View posts from last 24 hours

 
Reply to topic    Gentoo Forums Forum Index Desktop Environments
View previous topic :: View next topic  
Author Message
soya
Guru
Guru


Joined: 29 Jan 2004
Posts: 423

PostPosted: Tue Sep 15, 2009 4:29 am    Post subject: akonadi-server fails to compile Reply with quote

Hi, i'm trying to emerge akonadi-server (have tried every version in portage) but i'm always getting the same error:
Code:

[ 31%] Building CXX object server/control/CMakeFiles/akonadi_control.dir/resource_manager.cpp.o
[ 31%] Building CXX object server/control/CMakeFiles/akonadi_control.dir/preprocessor_manager.cpp.o
Linking CXX executable ../../bin/akonadi_control
CMakeFiles/akonadi_control.dir/__/shared/akapplication.cpp.o: In function `AkApplication::printUsage() const':
akapplication.cpp:(.text+0x277): undefined reference to `boost::program_options::operator<<(std::basic_ostream<char, std::char_traits<char> >&, boost::program_options::options_description const&)'
CMakeFiles/akonadi_control.dir/__/shared/akapplication.cpp.o: In function `AkApplication::parseCommandLine()':
akapplication.cpp:(.text+0x334): undefined reference to `boost::program_options::options_description::m_default_line_length'
akapplication.cpp:(.text+0x356): undefined reference to `boost::program_options::options_description::options_description(std::basic_string<char, std::char_traits<char>, std::allocator<char> > const&, unsigned int)'
akapplication.cpp:(.text+0x37e): undefined reference to `boost::program_options::options_description::add_options()'
akapplication.cpp:(.text+0x39d): undefined reference to `boost::program_options::options_description_easy_init::operator()(char const*, char const*)'
akapplication.cpp:(.text+0x3af): undefined reference to `boost::program_options::options_description_easy_init::operator()(char const*, char const*)'
akapplication.cpp:(.text+0x3c7): undefined reference to `boost::program_options::options_description::add(boost::program_options::options_description const&)'
akapplication.cpp:(.text+0x41a): undefined reference to `boost::program_options::store(boost::program_options::basic_parsed_options<char> const&, boost::program_options::variables_map&, bool)'
akapplication.cpp:(.text+0x540): undefined reference to `boost::program_options::notify(boost::program_options::variables_map&)'
CMakeFiles/akonadi_control.dir/__/shared/akapplication.cpp.o: In function `AkApplication::AkApplication(int&, char**)':
akapplication.cpp:(.text+0xc0c): undefined reference to `boost::program_options::options_description::m_default_line_length'
akapplication.cpp:(.text+0xc19): undefined reference to `boost::program_options::options_description::options_description(unsigned int)'
akapplication.cpp:(.text+0xc29): undefined reference to `boost::program_options::variables_map::variables_map()'
CMakeFiles/akonadi_control.dir/__/shared/akapplication.cpp.o: In function `AkApplication::AkApplication(int&, char**)':
akapplication.cpp:(.text+0xfac): undefined reference to `boost::program_options::options_description::m_default_line_length'
akapplication.cpp:(.text+0xfb9): undefined reference to `boost::program_options::options_description::options_description(unsigned int)'
akapplication.cpp:(.text+0xfc9): undefined reference to `boost::program_options::variables_map::variables_map()'
CMakeFiles/akonadi_control.dir/__/shared/akapplication.cpp.o: In function `AkApplication::addCommandLineOptions(boost::program_options::options_description const&)':
akapplication.cpp:(.text+0x85): undefined reference to `boost::program_options::options_description::add(boost::program_options::options_description const&)'
CMakeFiles/akonadi_control.dir/__/shared/akapplication.cpp.o: In function `boost::program_options::variables_map::~variables_map()':
akapplication.cpp:(.text._ZN5boost15program_options13variables_mapD1Ev[boost::program_options::variables_map::~variables_map()]+0x14): undefined reference to `vtable for boost::program_options::variables_map'
CMakeFiles/akonadi_control.dir/__/shared/akapplication.cpp.o: In function `boost::program_options::basic_command_line_parser<char>::run()':
akapplication.cpp:(.text._ZN5boost15program_options25basic_command_line_parserIcE3runEv[boost::program_options::basic_command_line_parser<char>::run()]+0x43): undefined reference to `boost::program_options::detail::cmdline::run()'
CMakeFiles/akonadi_control.dir/__/shared/akapplication.cpp.o: In function `std::vector<std::basic_string<char, std::char_traits<char>, std::allocator<char> >, std::allocator<std::basic_string<char, std::char_traits<char>, std::allocator<char> > > > boost::program_options::to_internal<std::basic_string<char, std::char_traits<char>, std::allocator<char> > >(std::vector<std::basic_string<char, std::char_traits<char>, std::allocator<char> >, std::allocator<std::basic_string<char, std::char_traits<char>, std::allocator<char> > > > const&)':
akapplication.cpp:(.text._ZN5boost15program_options11to_internalISsEESt6vectorISsSaISsEERKS2_IT_SaIS5_EE[std::vector<std::basic_string<char, std::char_traits<char>, std::allocator<char> >, std::allocator<std::basic_string<char, std::char_traits<char>, std::allocator<char> > > > boost::program_options::to_internal<std::basic_string<char, std::char_traits<char>, std::allocator<char> > >(std::vector<std::basic_string<char, std::char_traits<char>, std::allocator<char> >, std::allocator<std::basic_string<char, std::char_traits<char>, std::allocator<char> > > > const&)]+0xb2): undefined reference to `boost::program_options::to_internal(std::basic_string<char, std::char_traits<char>, std::allocator<char> > const&)'
akapplication.cpp:(.text._ZN5boost15program_options11to_internalISsEESt6vectorISsSaISsEERKS2_IT_SaIS5_EE[std::vector<std::basic_string<char, std::char_traits<char>, std::allocator<char> >, std::allocator<std::basic_string<char, std::char_traits<char>, std::allocator<char> > > > boost::program_options::to_internal<std::basic_string<char, std::char_traits<char>, std::allocator<char> > >(std::vector<std::basic_string<char, std::char_traits<char>, std::allocator<char> >, std::allocator<std::basic_string<char, std::char_traits<char>, std::allocator<char> > > > const&)]+0x157): undefined reference to `boost::program_options::to_internal(std::basic_string<char, std::char_traits<char>, std::allocator<char> > const&)'
CMakeFiles/akonadi_control.dir/__/shared/akapplication.cpp.o: In function `boost::program_options::basic_command_line_parser<char>::basic_command_line_parser(int, char**)':
akapplication.cpp:(.text._ZN5boost15program_options25basic_command_line_parserIcEC1EiPPc[boost::program_options::basic_command_line_parser<char>::basic_command_line_parser(int, char**)]+0x47): undefined reference to `boost::program_options::detail::cmdline::cmdline(std::vector<std::basic_string<char, std::char_traits<char>, std::allocator<char> >, std::allocator<std::basic_string<char, std::char_traits<char>, std::allocator<char> > > > const&)'
CMakeFiles/akonadi_control.dir/__/shared/akapplication.cpp.o: In function `boost::program_options::basic_parsed_options<char> boost::program_options::parse_command_line<char>(int, char**, boost::program_options::options_description const&, int, boost::function1<std::pair<std::basic_string<char, std::char_traits<char>, std::allocator<char> >, std::basic_string<char, std::char_traits<char>, std::allocator<char> > >, std::basic_string<char, std::char_traits<char>, std::allocator<char> > const&, std::allocator<boost::function_base> >)':
akapplication.cpp:(.text._ZN5boost15program_options18parse_command_lineIcEENS0_20basic_parsed_optionsIT_EEiPPS3_RKNS0_19options_descriptionEiNS_9function1ISt4pairISsSsERKSsSaINS_13function_baseEEEE[boost::program_options::basic_parsed_options<char> boost::program_options::parse_command_line<char>(int, char**, boost::program_options::options_description const&, int, boost::function1<std::pair<std::basic_string<char, std::char_traits<char>, std::allocator<char> >, std::basic_string<char, std::char_traits<char>, std::allocator<char> > >, std::basic_string<char, std::char_traits<char>, std::allocator<char> > const&, std::allocator<boost::function_base> >)]+0x6c): undefined reference to `boost::program_options::detail::cmdline::set_options_description(boost::program_options::options_description const&)'
akapplication.cpp:(.text._ZN5boost15program_options18parse_command_lineIcEENS0_20basic_parsed_optionsIT_EEiPPS3_RKNS0_19options_descriptionEiNS_9function1ISt4pairISsSsERKSsSaINS_13function_baseEEEE[boost::program_options::basic_parsed_options<char> boost::program_options::parse_command_line<char>(int, char**, boost::program_options::options_description const&, int, boost::function1<std::pair<std::basic_string<char, std::char_traits<char>, std::allocator<char> >, std::basic_string<char, std::char_traits<char>, std::allocator<char> > >, std::basic_string<char, std::char_traits<char>, std::allocator<char> > const&, std::allocator<boost::function_base> >)]+0x84): undefined reference to `boost::program_options::detail::cmdline::style(int)'
akapplication.cpp:(.text._ZN5boost15program_options18parse_command_lineIcEENS0_20basic_parsed_optionsIT_EEiPPS3_RKNS0_19options_descriptionEiNS_9function1ISt4pairISsSsERKSsSaINS_13function_baseEEEE[boost::program_options::basic_parsed_options<char> boost::program_options::parse_command_line<char>(int, char**, boost::program_options::options_description const&, int, boost::function1<std::pair<std::basic_string<char, std::char_traits<char>, std::allocator<char> >, std::basic_string<char, std::char_traits<char>, std::allocator<char> > >, std::basic_string<char, std::char_traits<char>, std::allocator<char> > const&, std::allocator<boost::function_base> >)]+0xd4): undefined reference to `boost::program_options::detail::cmdline::set_additional_parser(boost::function1<std::pair<std::basic_string<char, std::char_traits<char>, std::allocator<char> >, std::basic_string<char, std::char_traits<char>, std::allocator<char> > >, std::basic_string<char, std::char_traits<char>, std::allocator<char> > const&, std::allocator<boost::function_base> >)'
CMakeFiles/akonadi_control.dir/__/shared/akapplication.cpp.o: In function `AkApplication::~AkApplication()':
akapplication.cpp:(.text._ZN13AkApplicationD1Ev[AkApplication::~AkApplication()]+0x1d): undefined reference to `vtable for boost::program_options::variables_map'
CMakeFiles/akonadi_control.dir/__/shared/akapplication.cpp.o: In function `AkApplication::~AkApplication()':
akapplication.cpp:(.text._ZN13AkApplicationD0Ev[AkApplication::~AkApplication()]+0x1d): undefined reference to `vtable for boost::program_options::variables_map'
collect2: ld devolvió el estado de salida 1
make[2]: *** [bin/akonadi_control] Error 1
make[1]: *** [server/control/CMakeFiles/akonadi_control.dir/all] Error 2
make: *** [all] Error 2


I've reemerged boost and boost-build then tried use eselect boost list (eselect-boost 0.2 and 0.3 package) but i'm always getting that output, it's like boost it's not in the system:
Code:
 eselect boost list
Available boost versions:
  (none found)     


Code:

# eselect boost update
!!! Error: Sorry, "/usr/include/boost" exists but is not a symlink
exiting


Code:

# ls -l /usr/include |grep boost
drwxr-xr-x 64 root root    177 sep 15 06:22 boost


Code:

# eselect boost set 1.35.0-r1
!!! Error: Sorry, existing boost installation confuses me
exiting


That are my compile flags:
Code:
LDFLAGS="-Wl,-O1,--hash-style=gnu"
CFLAGS="-march=native -O2 -pipe -fomit-frame-pointer -msse4 -msse4.1 -msse4.2"
CXXFLAGS="-march=native -O3 -pipe -fomit-frame-pointer -msse4 -msse4.1 -msse4.2"

_________________
Si el tonto te alaba lamentalo, si el listo te censura piensalo...
Back to top
View user's profile Send private message
Mike Hunt
Watchman
Watchman


Joined: 19 Jul 2009
Posts: 5287

PostPosted: Tue Sep 15, 2009 4:41 am    Post subject: Reply with quote

What is the output of
Code:
emerge -pv boost


Also -march=native will set appropriate CFLAGS so you don't need all that -msse4 -msse4.1 -msse4.2 stuff in there.

Also last time I checked -Wl,-O1,--hash-style=gnu was not a supported LDFLAG, so you may want to leave the default -Wl,-O1
Back to top
View user's profile Send private message
soya
Guru
Guru


Joined: 29 Jan 2004
Posts: 423

PostPosted: Tue Sep 15, 2009 5:16 am    Post subject: Reply with quote

Code:
 # emerge -pv boost

These are the packages that would be merged, in order:

Calculating dependencies... done!
[ebuild  NS   ] dev-util/boost-build-1.35.0-r1 [1.37.0, 1.39.0] USE="-examples -python" 0 kB
[ebuild  N    ] dev-libs/boost-1.35.0-r2  USE="-debug -doc -expat -icu -mpi -tools" 0 kB

_________________
Si el tonto te alaba lamentalo, si el listo te censura piensalo...
Back to top
View user's profile Send private message
Mike Hunt
Watchman
Watchman


Joined: 19 Jul 2009
Posts: 5287

PostPosted: Tue Sep 15, 2009 5:20 am    Post subject: Reply with quote

Well you need boost to build akonadi-server. But why is your box USE="-python" ?

Please post your emerge --info

and eselect python list
Back to top
View user's profile Send private message
soya
Guru
Guru


Joined: 29 Jan 2004
Posts: 423

PostPosted: Tue Sep 15, 2009 8:50 am    Post subject: Reply with quote

Why not?
Mike Hunt wrote:
Well you need boost to build akonadi-server. But why is your box USE="-python" ?


Please post your emerge --info

Code:
Portage 2.2_rc40 (default/linux/amd64/2008.0/desktop, gcc-4.3.3, glibc-2.9_p20081201-r2, 2.6.29-reiser4 x86_64)
=================================================================
System uname: Linux-2.6.29-reiser4-x86_64-Intel-R-_Core-TM-_i7_CPU_920_@_2.67GHz-with-gentoo-1.12.11.1
Timestamp of tree: Tue, 15 Sep 2009 04:00:03 +0000
ccache version 2.4 [enabled]
app-shells/bash:     3.2_p39
dev-java/java-config: 1.3.7-r1, 2.1.8-r1
dev-lang/python:     2.6.2-r1
dev-python/pycrypto: 2.0.1-r8
dev-util/ccache:     2.4-r7
dev-util/cmake:      2.6.4
sys-apps/baselayout: 1.12.11.1
sys-apps/sandbox:    2.1
sys-devel/autoconf:  2.13, 2.63-r1
sys-devel/automake:  1.7.9-r1, 1.8.5-r3, 1.9.6-r2, 1.10.2
sys-devel/binutils:  2.18-r3
sys-devel/gcc-config: 1.4.1
sys-devel/libtool:   1.5.26
virtual/os-headers:  2.6.27-r2
ACCEPT_KEYWORDS="amd64"
CBUILD="x86_64-pc-linux-gnu"
CFLAGS="-march=native -O2 -pipe -fomit-frame-pointer"
CHOST="x86_64-pc-linux-gnu"
CONFIG_PROTECT="/etc /usr/share/config"
CONFIG_PROTECT_MASK="/etc/ca-certificates.conf /etc/env.d /etc/env.d/java/ /etc/fonts/fonts.conf /etc/gconf /etc/php/apache2-php5/ext-active/ /etc/php/cgi-php5/ext-active/ /etc/php/cli-php5/ext-active/ /etc/revdep-rebuild /etc/sandbox.d /etc/splash /etc/terminfo /etc/udev/rules.d"
CXXFLAGS="-march=native -O3 -pipe -fomit-frame-pointer"
DISTDIR="/usr/portage/distfiles"
FEATURES="assume-digests ccache distlocks fixpackages metadata-transfer parallel-fetch preserve-libs protect-owned sandbox sfperms strict unmerge-logs unmerge-orphans userfetch"
GENTOO_MIRRORS="http://distfiles.gentoo.org http://distro.ibiblio.org/pub/linux/distributions/gentoo"
LANG="es_ES@euro"
LC_ALL="es_ES@euro"
LDFLAGS="-Wl,-O1"
LINGUAS="es es_ES"
MAKEOPTS="-j6"
PKGDIR="/usr/portage/packages"
PORTAGE_CONFIGROOT="/"
PORTAGE_RSYNC_OPTS="--recursive --links --safe-links --perms --times --compress --force --whole-file --delete --stats --timeout=180 --exclude=/distfiles --exclude=/local --exclude=/packages"
PORTAGE_TMPDIR="/var/tmp"
PORTDIR="/usr/portage"
PORTDIR_OVERLAY="/usr/local/portage/layman/java-overlay /usr/local/portage/layman/wirelay /usr/local/portage/layman/qting-edge /usr/local/portage/layman/THE /usr/local/portage/layman/jyujin /usr/local/portage/layman/kde-testing /usr/local/portage"
SYNC="rsync://rsync.gentoo.org/gentoo-portage"
USE="X a52 aac acpi alsa amd64 bluetooth branding bzip2 cairo cdr cli cracklib crypt cups custom-cxxflags dbus dri dts dvd dvdr eds emboss encode esd evo exceptions fam firefox flac fortran gif gpm gtk gtkstyle hal iconv isdnlog jpeg kde libnotify mad mikmod mmx mmxext mp3 mp4 mpeg mudflap multilib ncurses nls nptl nptlonly ogg opengl openmp pcre pdf pic png ppds pppd qt-copy qt3 qt3support qt4 quicktime readline reflection samba sdl session spell spl sse sse2 sse3 ssse3 startup-notification svg sysfs thunar tiff truetype unicode usb v4l v4l2 vorbis webkit x264 xcomposite xml xorg xulrunner xv xvid zlib" ALSA_CARDS="ali5451 als4000 atiixp atiixp-modem bt87x ca0106 cmipci emu10k1x ens1370 ens1371 es1938 es1968 fm801 hda-intel intel8x0 intel8x0m maestro3 trident usb-audio via82xx via82xx-modem ymfpci" ALSA_PCM_PLUGINS="adpcm alaw asym copy dmix dshare dsnoop empty extplug file hooks iec958 ioplug ladspa lfloat linear meter mmap_emul mulaw multi null plug rate route share shm softvol" APACHE2_MODULES="actions alias auth_basic authn _alias authn_anon authn_dbm authn_default authn_file authz_dbm authz_default authz_groupfile authz_host authz_owner authz_user autoindex cache dav dav_fs dav_lock deflate dir disk_cache env expires ext_filter file_cache filter headers include info log_config logio mem_cache mime mime_magic negotiation rewrite setenvif speling status unique_id userdir usertrack vhost_alias filter" ELIBC="glibc" INPUT_DEVICES="keyboard mouse joystick penmount evdev" KERNEL="linux" LCD_DEVICES="bayrad cfontz cfontz633 glk hd44780 lb216 lcdm001 mtxorb ncurses text" LINGUAS="es es_ES" USERLAND="GNU" VIDEO_CARDS="nvidia v4l"
Unset:  CPPFLAGS, CTARGET, EMERGE_DEFAULT_OPTS, FFLAGS, INSTALL_MASK, PORTAGE_COMPRESS, PORTAGE_COMPRESS_FLAGS, PORTAGE_RSYNC_EXTRA_OPTS


and eselect python list

Code:

# eselect python list
Available python interpreters:
  [1]   python2.6

_________________
Si el tonto te alaba lamentalo, si el listo te censura piensalo...
Back to top
View user's profile Send private message
VoidMage
Watchman
Watchman


Joined: 14 Oct 2006
Posts: 5623

PostPosted: Tue Sep 15, 2009 11:38 am    Post subject: Reply with quote

I think you've failed to read your output.
Also, this seems to be a case of self harm - you're mixing stable
and unstable (frankly, I do that too, but I'm expecting most of such things).
It's only in boost-1.35.0-r3, that boost started using eselect-boost,
earlier versions don't work with it, so you need to update that version.
Then eselect-boost will work.
Back to top
View user's profile Send private message
Mike Hunt
Watchman
Watchman


Joined: 19 Jul 2009
Posts: 5287

PostPosted: Tue Sep 15, 2009 11:47 am    Post subject: Reply with quote

Something is weird un your profile, you have neither perl, nor python USE flags.

Redo your profile
Code:
emerge --sync
Code:
eselect profile set N
use the 10.0 dessktop (I think it's 7 on your box) then recheck your emerge --info, if python and perl are still not in the USE report back.

And set your python profile
Code:
eselect python set 1


Then run
Code:
emerge -uDNav world
Back to top
View user's profile Send private message
soya
Guru
Guru


Joined: 29 Jan 2004
Posts: 423

PostPosted: Tue Sep 15, 2009 1:22 pm    Post subject: Reply with quote

Thanks for your answer, i also noticed that behavour =>boost-1.35.0.-r3 appears eselect use flag. I've currently tried different versions of boost and akonadi-server always fails to compile, i really apreciate your answer but i can get no clue at all as i alread knew everything you sayd, which didn't help to solve the problem. Thanks anyway :)

VoidMage wrote:
I think you've failed to read your output.
Also, this seems to be a case of self harm - you're mixing stable
and unstable (frankly, I do that too, but I'm expecting most of such things).
It's only in boost-1.35.0-r3, that boost started using eselect-boost,
earlier versions don't work with it, so you need to update that version.
Then eselect-boost will work.


Mike Hunt: thanks for the answer, will update my profile settings and select 10.0 as you're pointing, but i don't think that's going to solve the issue. Anyway, i hope it helps :)
_________________
Si el tonto te alaba lamentalo, si el listo te censura piensalo...
Back to top
View user's profile Send private message
VoidMage
Watchman
Watchman


Joined: 14 Oct 2006
Posts: 5623

PostPosted: Tue Sep 15, 2009 1:40 pm    Post subject: Reply with quote

So, did you or did you not update boost in 1.35 slot ?
If you did, eselect boost should work.
Those functions seems to be there already in 1.35.
Back to top
View user's profile Send private message
soya
Guru
Guru


Joined: 29 Jan 2004
Posts: 423

PostPosted: Tue Sep 15, 2009 3:12 pm    Post subject: Reply with quote

Yes, i updated boost and boost-build and also tried every availableversion and run eselect thing but nothing helped :'(

Right now i'm reemerging some packages after updating to 10.0 desktop profile but i don't hitnk that's going to help

akonadi-server error log:
Code:
[ 37%] Generating notificationmanageradaptor.moc
[ 38%] Generating serveradaptor.moc
[ 39%] Generating debuginterfaceadaptor.moc
[ 40%] Generating resourcemanageradaptor.moc
[ 41%] Generating agentmanagerinterface.moc
Linking CXX executable ../../bin/akonadictl
[ 42%] Generating resourceinterface.moc
CMakeFiles/akonadictl.dir/__/shared/akapplication.cpp.o: In function `AkApplication::printUsage() const':
akapplication.cpp:(.text+0x277): undefined reference to `boost::program_options::operator<<(std::basic_ostream<char, std::char_traits<char> >&, boost::program_options::options_description const&)'
CMakeFiles/akonadictl.dir/__/shared/akapplication.cpp.o: In function `AkApplication::parseCommandLine()':
akapplication.cpp:(.text+0x334): undefined reference to `boost::program_options::options_description::m_default_line_length'
akapplication.cpp:(.text+0x356): undefined reference to `boost::program_options::options_description::options_description(std::basic_string<char, std::char_traits<char>, std::allocator<char> > const&, unsigned int)'
akapplication.cpp:(.text+0x37e): undefined reference to `boost::program_options::options_description::add_options()'
akapplication.cpp:(.text+0x39d): undefined reference to `boost::program_options::options_description_easy_init::operator()(char const*, char const*)'
akapplication.cpp:(.text+0x3af): undefined reference to `boost::program_options::options_description_easy_init::operator()(char const*, char const*)'
akapplication.cpp:(.text+0x3c7): undefined reference to `boost::program_options::options_description::add(boost::program_options::options_description const&)'
akapplication.cpp:(.text+0x41a): undefined reference to `boost::program_options::store(boost::program_options::basic_parsed_options<char> const&, boost::program_options::variables_map&, bool)'
akapplication.cpp:(.text+0x540): undefined reference to `boost::program_options::notify(boost::program_options::variables_map&)'
CMakeFiles/akonadictl.dir/__/shared/akapplication.cpp.o: In function `AkApplication::AkApplication(int&, char**)':
akapplication.cpp:(.text+0xc0c): undefined reference to `boost::program_options::options_description::m_default_line_length'
akapplication.cpp:(.text+0xc19): undefined reference to `boost::program_options::options_description::options_description(unsigned int)'
akapplication.cpp:(.text+0xc29): undefined reference to `boost::program_options::variables_map::variables_map()'
CMakeFiles/akonadictl.dir/__/shared/akapplication.cpp.o: In function `AkApplication::AkApplication(int&, char**)':
akapplication.cpp:(.text+0xfac): undefined reference to `boost::program_options::options_description::m_default_line_length'
akapplication.cpp:(.text+0xfb9): undefined reference to `boost::program_options::options_description::options_description(unsigned int)'
akapplication.cpp:(.text+0xfc9): undefined reference to `boost::program_options::variables_map::variables_map()'
CMakeFiles/akonadictl.dir/__/shared/akapplication.cpp.o: In function `AkApplication::addCommandLineOptions(boost::program_options::options_description const&)':
akapplication.cpp:(.text+0x85): undefined reference to `boost::program_options::options_description::add(boost::program_options::options_description const&)'
CMakeFiles/akonadictl.dir/__/shared/akapplication.cpp.o: In function `boost::program_options::variables_map::~variables_map()':
akapplication.cpp:(.text._ZN5boost15program_options13variables_mapD1Ev[boost::program_options::variables_map::~variables_map()]+0x14): undefined reference to `vtable for boost::program_options::variables_map'
CMakeFiles/akonadictl.dir/__/shared/akapplication.cpp.o: In function `boost::program_options::basic_command_line_parser<char>::run()':
akapplication.cpp:(.text._ZN5boost15program_options25basic_command_line_parserIcE3runEv[boost::program_options::basic_command_line_parser<char>::run()]+0x43): undefined reference to `boost::program_options::detail::cmdline::run()'
CMakeFiles/akonadictl.dir/__/shared/akapplication.cpp.o: In function `std::vector<std::basic_string<char, std::char_traits<char>, std::allocator<char> >, std::allocator<std::basic_string<char, std::char_traits<char>, std::allocator<char> > > > boost::program_options::to_internal<std::basic_string<char, std::char_traits<char>, std::allocator<char> > >(std::vector<std::basic_string<char, std::char_traits<char>, std::allocator<char> >, std::allocator<std::basic_string<char, std::char_traits<char>, std::allocator<char> > > > const&)':
akapplication.cpp:(.text._ZN5boost15program_options11to_internalISsEESt6vectorISsSaISsEERKS2_IT_SaIS5_EE[std::vector<std::basic_string<char, std::char_traits<char>, std::allocator<char> >, std::allocator<std::basic_string<char, std::char_traits<char>, std::allocator<char> > > > boost::program_options::to_internal<std::basic_string<char, std::char_traits<char>, std::allocator<char> > >(std::vector<std::basic_string<char, std::char_traits<char>, std::allocator<char> >, std::allocator<std::basic_string<char, std::char_traits<char>, std::allocator<char> > > > const&)]+0xb2): undefined reference to `boost::program_options::to_internal(std::basic_string<char, std::char_traits<char>, std::allocator<char> > const&)'
akapplication.cpp:(.text._ZN5boost15program_options11to_internalISsEESt6vectorISsSaISsEERKS2_IT_SaIS5_EE[std::vector<std::basic_string<char, std::char_traits<char>, std::allocator<char> >, std::allocator<std::basic_string<char, std::char_traits<char>, std::allocator<char> > > > boost::program_options::to_internal<std::basic_string<char, std::char_traits<char>, std::allocator<char> > >(std::vector<std::basic_string<char, std::char_traits<char>, std::allocator<char> >, std::allocator<std::basic_string<char, std::char_traits<char>, std::allocator<char> > > > const&)]+0x157): undefined reference to `boost::program_options::to_internal(std::basic_string<char, std::char_traits<char>, std::allocator<char> > const&)'
CMakeFiles/akonadictl.dir/__/shared/akapplication.cpp.o: In function `boost::program_options::basic_command_line_parser<char>::basic_command_line_parser(int, char**)':
akapplication.cpp:(.text._ZN5boost15program_options25basic_command_line_parserIcEC1EiPPc[boost::program_options::basic_command_line_parser<char>::basic_command_line_parser(int, char**)]+0x47): undefined reference to `boost::program_options::detail::cmdline::cmdline(std::vector<std::basic_string<char, std::char_traits<char>, std::allocator<char> >, std::allocator<std::basic_string<char, std::char_traits<char>, std::allocator<char> > > > const&)'
CMakeFiles/akonadictl.dir/__/shared/akapplication.cpp.o: In function `boost::program_options::basic_parsed_options<char> boost::program_options::parse_command_line<char>(int, char**, boost::program_options::options_description const&, int, boost::function1<std::pair<std::basic_string<char, std::char_traits<char>, std::allocator<char> >, std::basic_string<char, std::char_traits<char>, std::allocator<char> > >, std::basic_string<char, std::char_traits<char>, std::allocator<char> > const&>)':
akapplication.cpp:(.text._ZN5boost15program_options18parse_command_lineIcEENS0_20basic_parsed_optionsIT_EEiPPS3_RKNS0_19options_descriptionEiNS_9function1ISt4pairISsSsERKSsEE[boost::program_options::basic_parsed_options<char> boost::program_options::parse_command_line<char>(int, char**, boost::program_options::options_description const&, int, boost::function1<std::pair<std::basic_string<char, std::char_traits<char>, std::allocator<char> >, std::basic_string<char, std::char_traits<char>, std::allocator<char> > >, std::basic_string<char, std::char_traits<char>, std::allocator<char> > const&>)]+0x6c): undefined reference to `boost::program_options::detail::cmdline::set_options_description(boost::program_options::options_description const&)'
akapplication.cpp:(.text._ZN5boost15program_options18parse_command_lineIcEENS0_20basic_parsed_optionsIT_EEiPPS3_RKNS0_19options_descriptionEiNS_9function1ISt4pairISsSsERKSsEE[boost::program_options::basic_parsed_options<char> boost::program_options::parse_command_line<char>(int, char**, boost::program_options::options_description const&, int, boost::function1<std::pair<std::basic_string<char, std::char_traits<char>, std::allocator<char> >, std::basic_string<char, std::char_traits<char>, std::allocator<char> > >, std::basic_string<char, std::char_traits<char>, std::allocator<char> > const&>)]+0x84): undefined reference to `boost::program_options::detail::cmdline::style(int)'
akapplication.cpp:(.text._ZN5boost15program_options18parse_command_lineIcEENS0_20basic_parsed_optionsIT_EEiPPS3_RKNS0_19options_descriptionEiNS_9function1ISt4pairISsSsERKSsEE[boost::program_options::basic_parsed_options<char> boost::program_options::parse_command_line<char>(int, char**, boost::program_options::options_description const&, int, boost::function1<std::pair<std::basic_string<char, std::char_traits<char>, std::allocator<char> >, std::basic_string<char, std::char_traits<char>, std::allocator<char> > >, std::basic_string<char, std::char_traits<char>, std::allocator<char> > const&>)]+0xd4): undefined reference to `boost::program_options::detail::cmdline::set_additional_parser(boost::function1<std::pair<std::basic_string<char, std::char_traits<char>, std::allocator<char> >, std::basic_string<char, std::char_traits<char>, std::allocator<char> > >, std::basic_string<char, std::char_traits<char>, std::allocator<char> > const&>)'
CMakeFiles/akonadictl.dir/__/shared/akapplication.cpp.o: In function `AkApplication::~AkApplication()':
akapplication.cpp:(.text._ZN13AkApplicationD1Ev[AkApplication::~AkApplication()]+0x1d): undefined reference to `vtable for boost::program_options::variables_map'
CMakeFiles/akonadictl.dir/__/shared/akapplication.cpp.o: In function `AkApplication::~AkApplication()':
akapplication.cpp:(.text._ZN13AkApplicationD0Ev[AkApplication::~AkApplication()]+0x1d): undefined reference to `vtable for boost::program_options::variables_map'
collect2: ld devolvió el estado de salida 1
make[2]: *** [bin/akonadictl] Error 1
make[1]: *** [server/akonadictl/CMakeFiles/akonadictl.dir/all] Error 2
make[1]: *** Se espera a que terminen otras tareas....
[ 43%] Generating searchinterface.moc
[ 44%] Building CXX object server/control/CMakeFiles/akonadi_control.dir/resourceinterface.cpp.o
[ 44%] Generating searchqueryinterface.moc
[ 44%] Generating searchqueryiteratorinterface.moc
[ 44%] Building CXX object server/control/CMakeFiles/akonadi_control.dir/serverinterface.cpp.o
..
...
..
..
[ 46%] Generating queryinterface.moc
Scanning dependencies of target akonadiprivate
Linking CXX executable ../../bin/akonadi_control
CMakeFiles/akonadi_control.dir/__/shared/akapplication.cpp.o: In function `AkApplication::printUsage() const':
akapplication.cpp:(.text+0x277): undefined reference to `boost::program_options::operator<<(std::basic_ostream<char, std::char_traits<char> >&, boost::program_options::options_description const&)'
CMakeFiles/akonadi_control.dir/__/shared/akapplication.cpp.o: In function `AkApplication::parseCommandLine()':
akapplication.cpp:(.text+0x334): undefined reference to `boost::program_options::options_description::m_default_line_length'
akapplication.cpp:(.text+0x356): undefined reference to `boost::program_options::options_description::options_description(std::basic_string<char, std::char_traits<char>, std::allocator<char> > const&, unsigned int)'
akapplication.cpp:(.text+0x37e): undefined reference to `boost::program_options::options_description::add_options()'
akapplication.cpp:(.text+0x39d): undefined reference to `boost::program_options::options_description_easy_init::operator()(char const*, char const*)'
akapplication.cpp:(.text+0x3af): undefined reference to `boost::program_options::options_description_easy_init::operator()(char const*, char const*)'
akapplication.cpp:(.text+0x3c7): undefined reference to `boost::program_options::options_description::add(boost::program_options::options_description const&)'
akapplication.cpp:(.text+0x41a): undefined reference to `boost::program_options::store(boost::program_options::basic_parsed_options<char> const&, boost::program_options::variables_map&, bool)'
akapplication.cpp:(.text+0x540): undefined reference to `boost::program_options::notify(boost::program_options::variables_map&)'
CMakeFiles/akonadi_control.dir/__/shared/akapplication.cpp.o: In function `AkApplication::AkApplication(int&, char**)':
akapplication.cpp:(.text+0xc0c): undefined reference to `boost::program_options::options_description::m_default_line_length'
akapplication.cpp:(.text+0xc19): undefined reference to `boost::program_options::options_description::options_description(unsigned int)'
akapplication.cpp:(.text+0xc29): undefined reference to `boost::program_options::variables_map::variables_map()'
CMakeFiles/akonadi_control.dir/__/shared/akapplication.cpp.o: In function `AkApplication::AkApplication(int&, char**)':
akapplication.cpp:(.text+0xfac): undefined reference to `boost::program_options::options_description::m_default_line_length'
akapplication.cpp:(.text+0xfb9): undefined reference to `boost::program_options::options_description::options_description(unsigned int)'
akapplication.cpp:(.text+0xfc9): undefined reference to `boost::program_options::variables_map::variables_map()'
CMakeFiles/akonadi_control.dir/__/shared/akapplication.cpp.o: In function `AkApplication::addCommandLineOptions(boost::program_options::options_description const&)':
akapplication.cpp:(.text+0x85): undefined reference to `boost::program_options::options_description::add(boost::program_options::options_description const&)'
CMakeFiles/akonadi_control.dir/__/shared/akapplication.cpp.o: In function `boost::program_options::variables_map::~variables_map()':
akapplication.cpp:(.text._ZN5boost15program_options13variables_mapD1Ev[boost::program_options::variables_map::~variables_map()]+0x14): undefined reference to `vtable for boost::program_options::variables_map'
CMakeFiles/akonadi_control.dir/__/shared/akapplication.cpp.o: In function `boost::program_options::basic_command_line_parser<char>::run()':
akapplication.cpp:(.text._ZN5boost15program_options25basic_command_line_parserIcE3runEv[boost::program_options::basic_command_line_parser<char>::run()]+0x43): undefined reference to `boost::program_options::detail::cmdline::run()'
CMakeFiles/akonadi_control.dir/__/shared/akapplication.cpp.o: In function `std::vector<std::basic_string<char, std::char_traits<char>, std::allocator<char> >, std::allocator<std::basic_string<char, std::char_traits<char>, std::allocator<char> > > > boost::program_options::to_internal<std::basic_string<char, std::char_traits<char>, std::allocator<char> > >(std::vector<std::basic_string<char, std::char_traits<char>, std::allocator<char> >, std::allocator<std::basic_string<char, std::char_traits<char>, std::allocator<char> > > > const&)':
akapplication.cpp:(.text._ZN5boost15program_options11to_internalISsEESt6vectorISsSaISsEERKS2_IT_SaIS5_EE[std::vector<std::basic_string<char, std::char_traits<char>, std::allocator<char> >, std::allocator<std::basic_string<char, std::char_traits<char>, std::allocator<char> > > > boost::program_options::to_internal<std::basic_string<char, std::char_traits<char>, std::allocator<char> > >(std::vector<std::basic_string<char, std::char_traits<char>, std::allocator<char> >, std::allocator<std::basic_string<char, std::char_traits<char>, std::allocator<char> > > > const&)]+0xb2): undefined reference to `boost::program_options::to_internal(std::basic_string<char, std::char_traits<char>, std::allocator<char> > const&)'
akapplication.cpp:(.text._ZN5boost15program_options11to_internalISsEESt6vectorISsSaISsEERKS2_IT_SaIS5_EE[std::vector<std::basic_string<char, std::char_traits<char>, std::allocator<char> >, std::allocator<std::basic_string<char, std::char_traits<char>, std::allocator<char> > > > boost::program_options::to_internal<std::basic_string<char, std::char_traits<char>, std::allocator<char> > >(std::vector<std::basic_string<char, std::char_traits<char>, std::allocator<char> >, std::allocator<std::basic_string<char, std::char_traits<char>, std::allocator<char> > > > const&)]+0x157): undefined reference to `boost::program_options::to_internal(std::basic_string<char, std::char_traits<char>, std::allocator<char> > const&)'
CMakeFiles/akonadi_control.dir/__/shared/akapplication.cpp.o: In function `boost::program_options::basic_command_line_parser<char>::basic_command_line_parser(int, char**)':
akapplication.cpp:(.text._ZN5boost15program_options25basic_command_line_parserIcEC1EiPPc[boost::program_options::basic_command_line_parser<char>::basic_command_line_parser(int, char**)]+0x47): undefined reference to `boost::program_options::detail::cmdline::cmdline(std::vector<std::basic_string<char, std::char_traits<char>, std::allocator<char> >, std::allocator<std::basic_string<char, std::char_traits<char>, std::allocator<char> > > > const&)'
CMakeFiles/akonadi_control.dir/__/shared/akapplication.cpp.o: In function `boost::program_options::basic_parsed_options<char> boost::program_options::parse_command_line<char>(int, char**, boost::program_options::options_description const&, int, boost::function1<std::pair<std::basic_string<char, std::char_traits<char>, std::allocator<char> >, std::basic_string<char, std::char_traits<char>, std::allocator<char> > >, std::basic_string<char, std::char_traits<char>, std::allocator<char> > const&>)':
akapplication.cpp:(.text._ZN5boost15program_options18parse_command_lineIcEENS0_20basic_parsed_optionsIT_EEiPPS3_RKNS0_19options_descriptionEiNS_9function1ISt4pairISsSsERKSsEE[boost::program_options::basic_parsed_options<char> boost::program_options::parse_command_line<char>(int, char**, boost::program_options::options_description const&, int, boost::function1<std::pair<std::basic_string<char, std::char_traits<char>, std::allocator<char> >, std::basic_string<char, std::char_traits<char>, std::allocator<char> > >, std::basic_string<char, std::char_traits<char>, std::allocator<char> > const&>)]+0x6c): undefined reference to `boost::program_options::detail::cmdline::set_options_description(boost::program_options::options_description const&)'
akapplication.cpp:(.text._ZN5boost15program_options18parse_command_lineIcEENS0_20basic_parsed_optionsIT_EEiPPS3_RKNS0_19options_descriptionEiNS_9function1ISt4pairISsSsERKSsEE[boost::program_options::basic_parsed_options<char> boost::program_options::parse_command_line<char>(int, char**, boost::program_options::options_description const&, int, boost::function1<std::pair<std::basic_string<char, std::char_traits<char>, std::allocator<char> >, std::basic_string<char, std::char_traits<char>, std::allocator<char> > >, std::basic_string<char, std::char_traits<char>, std::allocator<char> > const&>)]+0x84): undefined reference to `boost::program_options::detail::cmdline::style(int)'
akapplication.cpp:(.text._ZN5boost15program_options18parse_command_lineIcEENS0_20basic_parsed_optionsIT_EEiPPS3_RKNS0_19options_descriptionEiNS_9function1ISt4pairISsSsERKSsEE[boost::program_options::basic_parsed_options<char> boost::program_options::parse_command_line<char>(int, char**, boost::program_options::options_description const&, int, boost::function1<std::pair<std::basic_string<char, std::char_traits<char>, std::allocator<char> >, std::basic_string<char, std::char_traits<char>, std::allocator<char> > >, std::basic_string<char, std::char_traits<char>, std::allocator<char> > const&>)]+0xd4): undefined reference to `boost::program_options::detail::cmdline::set_additional_parser(boost::function1<std::pair<std::basic_string<char, std::char_traits<char>, std::allocator<char> >, std::basic_string<char, std::char_traits<char>, std::allocator<char> > >, std::basic_string<char, std::char_traits<char>, std::allocator<char> > const&>)'
CMakeFiles/akonadi_control.dir/__/shared/akapplication.cpp.o: In function `AkApplication::~AkApplication()':
akapplication.cpp:(.text._ZN13AkApplicationD1Ev[AkApplication::~AkApplication()]+0x1d): undefined reference to `vtable for boost::program_options::variables_map'
CMakeFiles/akonadi_control.dir/__/shared/akapplication.cpp.o: In function `AkApplication::~AkApplication()':
akapplication.cpp:(.text._ZN13AkApplicationD0Ev[AkApplication::~AkApplication()]+0x1d): undefined reference to `vtable for boost::program_options::variables_map'
collect2: ld devolvió el estado de salida 1
make[2]: *** [bin/akonadi_control] Error 1
make[1]: *** [server/control/CMakeFiles/akonadi_control.dir/all] Error 2
[ 46%] [ 47%] [ 47%] [ 48%] Building CXX object server/CMakeFiles/akonadiprivate.dir/akonadiprivate_automoc.cpp.o
Building CXX object server/CMakeFiles/akonadiprivate.dir/shared/akcrash.cpp.o
[ 49%] Building CXX object server/CMakeFiles/akonadiprivate.dir/shared/akapplication.cpp.o
[ 49%] Building CXX object server/CMakeFiles/akonadiprivate.dir/shared/akdebug.cpp.o
Building CXX object server/CMakeFiles/akonadiprivate.dir/src/akonadi.cpp.o
Building CXX object server/CMakeFiles/akonadiprivate.dir/src/akonadiconnection.cpp.o
[ 50%] Building CXX object server/CMakeFiles/akonadiprivate.dir/src/handler.cpp.o
[ 50%] [ 51%] Building CXX object server/CMakeFiles/akonadiprivate.dir/src/handlerhelper.cpp.o
Building CXX object server/CMakeFiles/akonadiprivate.dir/src/intervalcheck.cpp.o
[ 51%] Building CXX object server/CMakeFiles/akonadiprivate.dir/src/response.cpp.o
[ 52%] Building CXX object server/CMakeFiles/akonadiprivate.dir/src/handler/aklist.cpp.o
[ 52%] Building CXX object server/CMakeFiles/akonadiprivate.dir/src/handler/akappend.cpp.o
[ 53%] Building CXX object server/CMakeFiles/akonadiprivate.dir/src/handler/append.cpp.o
[ 53%] Building CXX object server/CMakeFiles/akonadiprivate.dir/src/handler/copy.cpp.o
[ 54%] Building CXX object server/CMakeFiles/akonadiprivate.dir/src/handler/colcopy.cpp.o
[ 55%] Building CXX object server/CMakeFiles/akonadiprivate.dir/src/handler/colmove.cpp.o
[ 55%] Building CXX object server/CMakeFiles/akonadiprivate.dir/src/handler/create.cpp.o
[ 56%] Building CXX object server/CMakeFiles/akonadiprivate.dir/src/handler/capability.cpp.o
[ 56%] Building CXX object server/CMakeFiles/akonadiprivate.dir/src/handler/delete.cpp.o
[ 57%] Building CXX object server/CMakeFiles/akonadiprivate.dir/src/handler/expunge.cpp.o
[ 57%] Building CXX object server/CMakeFiles/akonadiprivate.dir/src/handler/fetch.cpp.o
[ 58%] Building CXX object server/CMakeFiles/akonadiprivate.dir/src/handler/link.cpp.o
[ 58%] Building CXX object server/CMakeFiles/akonadiprivate.dir/src/handler/list.cpp.o
[ 59%] Building CXX object server/CMakeFiles/akonadiprivate.dir/src/handler/login.cpp.o
[ 60%] Building CXX object server/CMakeFiles/akonadiprivate.dir/src/handler/logout.cpp.o
[ 60%] Building CXX object server/CMakeFiles/akonadiprivate.dir/src/handler/modify.cpp.o
[ 61%] Building CXX object server/CMakeFiles/akonadiprivate.dir/src/handler/move.cpp.o
[ 61%] Building CXX object server/CMakeFiles/akonadiprivate.dir/src/handler/noop.cpp.o
[ 62%] Building CXX object server/CMakeFiles/akonadiprivate.dir/src/handler/remove.cpp.o
[ 62%] Building CXX object server/CMakeFiles/akonadiprivate.dir/src/handler/rename.cpp.o
[ 63%] Building CXX object server/CMakeFiles/akonadiprivate.dir/src/handler/resourceselect.cpp.o
[ 63%] Building CXX object server/CMakeFiles/akonadiprivate.dir/src/handler/scope.cpp.o
[ 64%] Building CXX object server/CMakeFiles/akonadiprivate.dir/src/handler/searchhelper.cpp.o
[ 64%] Building CXX object server/CMakeFiles/akonadiprivate.dir/src/handler/searchpersistent.cpp.o
[ 65%] Building CXX object server/CMakeFiles/akonadiprivate.dir/src/handler/select.cpp.o
[ 66%] [ 66%] Building CXX object server/CMakeFiles/akonadiprivate.dir/src/handler/status.cpp.o
Building CXX object server/CMakeFiles/akonadiprivate.dir/src/handler/subscribe.cpp.o
[ 67%] Building CXX object server/CMakeFiles/akonadiprivate.dir/src/handler/store.cpp.o
[ 67%] Building CXX object server/CMakeFiles/akonadiprivate.dir/src/handler/transaction.cpp.o
[ 68%] Building CXX object server/CMakeFiles/akonadiprivate.dir/src/search/dbusoperators.cpp.o
[ 68%] [ 69%] Building CXX object server/CMakeFiles/akonadiprivate.dir/src/search/queryserviceclient.cpp.o
Building CXX object server/CMakeFiles/akonadiprivate.dir/src/search/query.cpp.o
[ 69%] Building CXX object server/CMakeFiles/akonadiprivate.dir/src/search/result.cpp.o
[ 70%] Building CXX object server/CMakeFiles/akonadiprivate.dir/src/search/term.cpp.o
/var/tmp/portage/app-office/akonadi-server-1.2.0/work/akonadi-1.2.0/server/src/search/dbusoperators.cpp: In function 'const QDBusArgument& operator>>(const QDBusArgument&, Soprano::Node&)':
/var/tmp/portage/app-office/akonadi-server-1.2.0/work/akonadi-1.2.0/server/src/search/dbusoperators.cpp:332: aviso: 'Soprano::Node::Node(const Soprano::LiteralValue&, const QString&)' es obsoleto (declarado en /usr/include/soprano/node.h:121)
[ 71%] Building CXX object server/CMakeFiles/akonadiprivate.dir/src/storage/collectionqueryhelper.cpp.o
[ 71%] Building CXX object server/CMakeFiles/akonadiprivate.dir/src/storage/entity.cpp.o
[ 72%] Building CXX object server/CMakeFiles/akonadiprivate.dir/entities.cpp.o
[ 72%] Building CXX object server/CMakeFiles/akonadiprivate.dir/src/storage/datastore.cpp.o
[ 73%] Building CXX object server/CMakeFiles/akonadiprivate.dir/src/storage/dbconfig.cpp.o
[ 73%] Building CXX object server/CMakeFiles/akonadiprivate.dir/src/storage/dbinitializer.cpp.o
[ 74%] Building CXX object server/CMakeFiles/akonadiprivate.dir/src/storage/dbupdater.cpp.o
[ 74%] Building CXX object server/CMakeFiles/akonadiprivate.dir/src/storage/itemqueryhelper.cpp.o
[ 75%] Building CXX object server/CMakeFiles/akonadiprivate.dir/src/storage/itemretriever.cpp.o
[ 75%] Building CXX object server/CMakeFiles/akonadiprivate.dir/src/storage/itemretrievalmanager.cpp.o
[ 76%] Building CXX object server/CMakeFiles/akonadiprivate.dir/src/storage/itemretrievalthread.cpp.o
[ 77%] Building CXX object server/CMakeFiles/akonadiprivate.dir/src/storage/notificationcollector.cpp.o
[ 77%] Building CXX object server/CMakeFiles/akonadiprivate.dir/src/storage/query.cpp.o
[ 78%] Building CXX object server/CMakeFiles/akonadiprivate.dir/src/storage/querybuilder.cpp.o
[ 78%] Building CXX object server/CMakeFiles/akonadiprivate.dir/src/storage/queryhelper.cpp.o
[ 79%] Building CXX object server/CMakeFiles/akonadiprivate.dir/src/storage/transaction.cpp.o
[ 79%] Building CXX object server/CMakeFiles/akonadiprivate.dir/src/storage/parthelper.cpp.o
[ 80%] Building CXX object server/CMakeFiles/akonadiprivate.dir/src/tracer.cpp.o
[ 80%] Building CXX object server/CMakeFiles/akonadiprivate.dir/src/dbustracer.cpp.o
[ 81%] Building CXX object server/CMakeFiles/akonadiprivate.dir/src/filetracer.cpp.o
[ 82%] Building CXX object server/CMakeFiles/akonadiprivate.dir/src/notificationmanager.cpp.o
[ 82%] Building CXX object server/CMakeFiles/akonadiprivate.dir/src/resourcemanager.cpp.o
[ 83%] Building CXX object server/CMakeFiles/akonadiprivate.dir/src/cachecleaner.cpp.o
[ 83%] Building CXX object server/CMakeFiles/akonadiprivate.dir/src/abstractsearchmanager.cpp.o
[ 84%] Building CXX object server/CMakeFiles/akonadiprivate.dir/src/xesammanager.cpp.o
[ 84%] Building CXX object server/CMakeFiles/akonadiprivate.dir/src/nepomukmanager.cpp.o
[ 85%] Building CXX object server/CMakeFiles/akonadiprivate.dir/src/debuginterface.cpp.o
[ 85%] Building CXX object server/CMakeFiles/akonadiprivate.dir/src/imapstreamparser.cpp.o
[ 86%] Building CXX object server/CMakeFiles/akonadiprivate.dir/tracernotificationadaptor.cpp.o
[ 86%] Building CXX object server/CMakeFiles/akonadiprivate.dir/traceradaptor.cpp.o
[ 87%] Building CXX object server/CMakeFiles/akonadiprivate.dir/notificationmanageradaptor.cpp.o
[ 88%] Building CXX object server/CMakeFiles/akonadiprivate.dir/serveradaptor.cpp.o
[ 88%] Building CXX object server/CMakeFiles/akonadiprivate.dir/debuginterfaceadaptor.cpp.o
[ 89%] Building CXX object server/CMakeFiles/akonadiprivate.dir/resourcemanageradaptor.cpp.o
[ 89%] Building CXX object server/CMakeFiles/akonadiprivate.dir/agentmanagerinterface.cpp.o
[ 90%] Building CXX object server/CMakeFiles/akonadiprivate.dir/resourceinterface.cpp.o
[ 90%] [ 91%] Building CXX object server/CMakeFiles/akonadiprivate.dir/searchinterface.cpp.o
Building CXX object server/CMakeFiles/akonadiprivate.dir/searchqueryinterface.cpp.o
[ 91%] Building CXX object server/CMakeFiles/akonadiprivate.dir/searchqueryiteratorinterface.cpp.o
[ 92%] Building CXX object server/CMakeFiles/akonadiprivate.dir/xesaminterface.cpp.o
[ 93%] Building CXX object server/CMakeFiles/akonadiprivate.dir/queryserviceinterface.cpp.o
[ 93%] Building CXX object server/CMakeFiles/akonadiprivate.dir/queryinterface.cpp.o
[ 94%] Building CXX object server/CMakeFiles/akonadiprivate.dir/qrc_akonadidb.cxx.o
/var/tmp/portage/app-office/akonadi-server-1.2.0/work/akonadi-1.2.0_build/server/entities.cpp:55: aviso: parámetro 'entry' sin uso
Linking CXX shared library ../lib/libakonadiprivate.so
[ 94%] Built target akonadiprivate
make: *** [all] Error 2
 *
 * ERROR: app-office/akonadi-server-1.2.0 failed.
 * Call stack:
 *               ebuild.sh, line   49:  Called src_compile
 *             environment, line 2995:  Called cmake-utils_src_compile
 *             environment, line  801:  Called cmake-utils_src_make
 *             environment, line  881:  Called die
 * The specific snippet of code:
 *           emake "$@" || die "Make failed!";
 *  The die message:
 *   Make failed!
 *
 * If you need support, post the topmost build error, and the call stack if relevant.
 * A complete build log is located at '/var/log/portage/app-office:akonadi-server-1.2.0:20090915-151046.log'.
 * The ebuild environment file is located at '/var/tmp/portage/app-office/akonadi-server-1.2.0/temp/environment'.
 *

>>> Failed to emerge app-office/akonadi-server-1.2.0, Log file:

_________________
Si el tonto te alaba lamentalo, si el listo te censura piensalo...
Back to top
View user's profile Send private message
VoidMage
Watchman
Watchman


Joined: 14 Oct 2006
Posts: 5623

PostPosted: Tue Sep 15, 2009 4:09 pm    Post subject: Reply with quote

There are two things that come to mind:
- did you check if that boost lib exist on your system ?
- I think cmake ebuild got some patches, when boost was switched to eselect-boost
Back to top
View user's profile Send private message
Mike Hunt
Watchman
Watchman


Joined: 19 Jul 2009
Posts: 5287

PostPosted: Tue Sep 15, 2009 4:22 pm    Post subject: Reply with quote

... Also can you repost your emerge --info so we can see what is going on with your box.
Back to top
View user's profile Send private message
soya
Guru
Guru


Joined: 29 Jan 2004
Posts: 423

PostPosted: Tue Sep 15, 2009 7:07 pm    Post subject: Reply with quote

Which lib are you talking about? thx

VoidMage wrote:
There are two things that come to mind:
- did you check if that boost lib exist on your system ?
- I think cmake ebuild got some patches, when boost was switched to eselect-boost


Here is emerge --info, but i don't think that's a profile nor make.conf issue but a corrupted package installation.

Code:
 # emerge --info
Portage 2.2_rc40 (default/linux/amd64/10.0/desktop, gcc-4.3.3, glibc-2.9_p20081201-r2, 2.6.29-reiser4 x86_64)
=================================================================
System uname: Linux-2.6.29-reiser4-x86_64-Intel-R-_Core-TM-_i7_CPU_920_@_2.67GHz-with-gentoo-1.12.11.1
Timestamp of tree: Tue, 15 Sep 2009 13:30:01 +0000
ccache version 2.4 [enabled]
app-shells/bash:     4.0_p28
dev-java/java-config: 1.3.7-r1, 2.1.8-r1
dev-lang/python:     2.6.2-r1
dev-python/pycrypto: 2.0.1-r8
dev-util/ccache:     2.4-r7
dev-util/cmake:      2.6.4
sys-apps/baselayout: 1.12.11.1
sys-apps/sandbox:    2.1
sys-devel/autoconf:  2.13, 2.63-r1
sys-devel/automake:  1.7.9-r1, 1.8.5-r3, 1.9.6-r2, 1.10.2
sys-devel/binutils:  2.18-r3
sys-devel/gcc-config: 1.4.1
sys-devel/libtool:   1.5.26
virtual/os-headers:  2.6.27-r2
ACCEPT_KEYWORDS="amd64"
CBUILD="x86_64-pc-linux-gnu"
CFLAGS="-march=native -O2 -pipe -fomit-frame-pointer"
CHOST="x86_64-pc-linux-gnu"
CONFIG_PROTECT="/etc /usr/share/config"
CONFIG_PROTECT_MASK="/etc/ca-certificates.conf /etc/env.d /etc/env.d/java/ /etc/fonts/fonts.conf /etc/gconf /etc/php/apache2-php5/ext-active/ /etc/php/cgi-php5/ext-active/ /etc/php/cli-php5/ext-active/ /etc/revdep-rebuild /etc/sandbox.d /etc/splash /etc/terminfo /etc/udev/rules.d"
CXXFLAGS="-march=native -O3 -pipe -fomit-frame-pointer"
DISTDIR="/usr/portage/distfiles"
FEATURES="assume-digests ccache distlocks fixpackages metadata-transfer parallel-fetch preserve-libs protect-owned sandbox sfperms strict unmerge-logs unmerge-orphans userfetch"
GENTOO_MIRRORS="http://distfiles.gentoo.org http://distro.ibiblio.org/pub/linux/distributions/gentoo"
LANG="es_ES@euro"
LC_ALL="es_ES@euro"
LDFLAGS="-Wl,-O1 -Wl,--hash-style=gnu"
LINGUAS="es es_ES"
MAKEOPTS="-j6"
PKGDIR="/usr/portage/packages"
PORTAGE_CONFIGROOT="/"
PORTAGE_RSYNC_OPTS="--recursive --links --safe-links --perms --times --compress --force --whole-file --delete --stats --timeout=180 --exclude=/distfiles --exclude=/local --exclude=/packages"
PORTAGE_TMPDIR="/var/tmp"
PORTDIR="/usr/portage"
PORTDIR_OVERLAY="/usr/local/portage/layman/java-overlay /usr/local/portage/layman/wirelay /usr/local/portage/layman/qting-edge /usr/local/portage/layman/THE /usr/local/portage/layman/jyujin /usr/local/portage/layman/kde-testing /usr/local/portage"
SYNC="rsync://rsync.gentoo.org/gentoo-portage"
USE="X a52 aac acpi alsa amd64 bluetooth branding bzip2 cairo cdr cli cracklib crypt cups custom-cxxflags dbus dri dts dvd dvdr eds emboss encode evo exceptions fam firefox flac fortran gif gpm gtk gtkstyle hal iconv isdnlog jpeg kde libnotify mad mikmod mmx mmxext mp3 mp4 mpeg mudflap multilib ncurses nls nptl nptlonly ogg opengl openmp pcre pdf pic png ppds pppd qt-copy qt3support qt4 quicktime readline reflection samba sdl session spell spl sse sse2 sse3 ssse3 startup-notification svg sysfs thunar tiff truetype unicode usb v4l v4l2 vorbis webkit x264 xcomposite xml xorg xulrunner xv xvid zlib" ALSA_CARDS="ali5451 als4000 atiixp atiixp-modem bt87x ca0106 cmipci emu10k1x ens1370 ens1371 es1938 es1968 fm801 hda-intel intel8x0 intel8x0m maestro3 trident usb-audio via82xx via82xx-modem ymfpci" ALSA_PCM_PLUGINS="adpcm alaw asym copy dmix dshare dsnoop empty extplug file hooks iec958 ioplug ladspa lfloat linear meter mmap_emul mulaw multi null plug rate route share shm softvol" APACHE2_MODULES="actions alias auth_basic authn _alias authn_anon authn_dbm authn_default authn_file authz_dbm authz_default authz_groupfile authz_host authz_owner authz_user autoindex cache dav dav_fs dav_lock deflate dir disk_cache env expires ext_filter file_cache filter headers include info log_config logio mem_cache mime mime_magic negotiation rewrite setenvif speling status unique_id userdir usertrack vhost_alias filter" ELIBC="glibc" INPUT_DEVICES="keyboard mouse joystick penmount evdev" KERNEL="linux" LCD_DEVICES="bayrad cfontz cfontz633 glk hd44780 lb216 lcdm001 mtxorb ncurses text" LINGUAS="es es_ES" USERLAND="GNU" VIDEO_CARDS="nvidia v4l"
Unset:  CPPFLAGS, CTARGET, EMERGE_DEFAULT_OPTS, FFLAGS, INSTALL_MASK, PORTAGE_COMPRESS, PORTAGE_COMPRESS_FLAGS, PORTAGE_RSYNC_EXTRA_OPTS

_________________
Si el tonto te alaba lamentalo, si el listo te censura piensalo...
Back to top
View user's profile Send private message
Mike Hunt
Watchman
Watchman


Joined: 19 Jul 2009
Posts: 5287

PostPosted: Tue Sep 15, 2009 8:12 pm    Post subject: Reply with quote

Something is way wrong with your installation. Even a default profile has USE="perl python"

Did you disable them manually in make.conf?

You need to fix that first before doing anything else :)

Also your LDFLAG could be what is causing your linker problem :)
Back to top
View user's profile Send private message
soya
Guru
Guru


Joined: 29 Jan 2004
Posts: 423

PostPosted: Tue Sep 15, 2009 8:34 pm    Post subject: Reply with quote

Of course, i disabled them as i don't need python nor perl object from most of the packages. I just enable it when i need. By the other hand, as sayd at the begining some packages is corrupted but instalaltion is ok. Thanks anyway, will try to find what it is.
_________________
Si el tonto te alaba lamentalo, si el listo te censura piensalo...
Back to top
View user's profile Send private message
mo6830968
n00b
n00b


Joined: 07 Nov 2013
Posts: 1

PostPosted: Thu Nov 07, 2013 2:51 am    Post subject: Reply with quote

Have you check if your system has other version boost library? maybe the compile take your header file,but it link with some other version boost.many linux will include boost library in them when installed,some keep them in "/usr/lib"!!!
Back to top
View user's profile Send private message
Display posts from previous:   
Reply to topic    Gentoo Forums Forum Index Desktop Environments All times are GMT
Page 1 of 1

 
Jump to:  
You cannot post new topics in this forum
You cannot reply to topics in this forum
You cannot edit your posts in this forum
You cannot delete your posts in this forum
You cannot vote in polls in this forum