Gentoo Forums
Gentoo Forums
Gentoo Forums
Quick Search: in
[SOLVED] Grub 2 error : unable to update
View unanswered posts
View posts from last 24 hours

 
Reply to topic    Gentoo Forums Forum Index Installing Gentoo
View previous topic :: View next topic  
Author Message
shaman200
n00b
n00b


Joined: 29 Dec 2005
Posts: 30

PostPosted: Tue Feb 26, 2013 8:24 pm    Post subject: [SOLVED] Grub 2 error : unable to update Reply with quote

Hi!

The update of the grub package is failing on my system lately, it's not that blocking, but I can't see what is the problem exactly.... :(

So any idea is welcome!

Thanks!!!!

Code:
emerge -pqv '=sys-boot/grub-2.00-r2'
[ebuild     U ] sys-boot/grub-2.00-r2 [2.00] USE="nls sdl truetype -custom-cflags -debug -device-mapper -doc% -efiemu -libzfs -mount -static" GRUB_PLATFORMS="-coreboot -efi-32 -efi-64 -emu -ieee1275 -multiboot -pc -qemu -qemu-mips -yeeloong"


Code:
emerge --info '=sys-boot/grub-2.00-r2'
Portage 2.1.11.52 (default/linux/amd64/13.0/desktop/gnome, gcc-4.6.3, glibc-2.16.0, 3.8.0-gentoo x86_64)
=================================================================
                        System Settings
=================================================================
System uname: Linux-3.8.0-gentoo-x86_64-Intel-R-_Core-TM-_i7-2600K_CPU_@_3.40GHz-with-gentoo-2.2
KiB Mem:     8175012 total,    726880 free
KiB Swap:          0 total,         0 free
Timestamp of tree: Tue, 26 Feb 2013 18:45:01 +0000
ld GNU ld (GNU Binutils) 2.23.1
app-shells/bash:          4.2_p42
dev-java/java-config:     2.1.12-r1
dev-lang/python:          2.7.3-r3, 3.2.3-r2
dev-util/cmake:           2.8.10.2-r1
dev-util/pkgconfig:       0.28
sys-apps/baselayout:      2.2
sys-apps/openrc:          0.11.8
sys-apps/sandbox:         2.6
sys-devel/autoconf:       2.13, 2.69
sys-devel/automake:       1.10.3, 1.11.6, 1.12.6, 1.13.1
sys-devel/binutils:       2.23.1
sys-devel/gcc:            4.6.3
sys-devel/gcc-config:     1.8
sys-devel/libtool:        2.4-r1
sys-devel/make:           3.82-r4
sys-kernel/linux-headers: 3.7 (virtual/os-headers)
sys-libs/glibc:           2.16.0
Repositories:

gentoo
    location: /usr/portage
    sync: rsync://rsync.au.gentoo.org/gentoo-portage
    priority: -1000

ABI="amd64"
ABI_X86="64"
ACCEPT_KEYWORDS="amd64 ~amd64"
ACCEPT_LICENSE="*"
ACCEPT_PROPERTIES="*"
ALSA_CARDS="ali5451 als4000 atiixp atiixp-modem bt87x ca0106 cmipci emu10k1x ens1370 ens1371 es1938 es1968 fm801 hda-intel intel8x0 intel8x0m maestro3 trident usb-audio via82xx via82xx-modem ymfpci"
ALSA_PCM_PLUGINS="adpcm alaw asym copy dmix dshare dsnoop empty extplug file hooks iec958 ioplug ladspa lfloat linear meter mmap_emul mulaw multi null plug rate route share shm softvol"
ANT_HOME="/usr/share/ant"
APACHE2_MODULES="authn_core authz_core socache_shmcb unixd actions alias auth_basic authn_alias authn_anon authn_dbm authn_default authn_file authz_dbm authz_default authz_groupfile authz_host authz_owner authz_user
autoindex cache cgi cgid dav dav_fs dav_lock deflate dir disk_cache env expires ext_filter file_cache filter headers include info log_config logio mem_cache mime mime_magic negotiation rewrite setenvif speling status unique_id userdir
usertrack vhost_alias"
ARCH="amd64"
AUTOCLEAN="yes"
BOOTSTRAP_USE="cxx unicode multilib"
CALLIGRA_FEATURES="kexi words flow plan sheets stage tables krita karbon braindump"
CAMERAS="ptp2"
CBUILD="x86_64-pc-linux-gnu"
CFLAGS="-O2 -pipe -march=core2 -mcx16 -msahf -maes -mpclmul -mpopcnt -msse4.1 -msse4.2 -mavx --param l1-cache-size=32 --param l1-cache-line-size=64 --param l2-cache-size=8192 -mtune=generic"
CFLAGS_amd64="-m64"
CFLAGS_x32="-mx32"
CFLAGS_x86="-m32"
CHOST="x86_64-pc-linux-gnu"
CHOST_amd64="x86_64-pc-linux-gnu"
CHOST_x32="x86_64-pc-linux-gnux32"
CHOST_x86="i686-pc-linux-gnu"
CLEAN_DELAY="5"
COLLECTD_PLUGINS="df interface irq load memory rrdtool swap syslog"
COLLISION_IGNORE="/lib/modules/* *.py[co] *$py.class"
COLORTERM="gnome-terminal"
CONFIG_PROTECT="/etc /usr/share/gnupg/qualified.txt"
CONFIG_PROTECT_MASK="/etc/ca-certificates.conf /etc/dconf /etc/env.d /etc/fonts/fonts.conf /etc/gconf /etc/gentoo-release /etc/revdep-rebuild /etc/sandbox.d /etc/splash /etc/terminfo"
CXXFLAGS="-O2 -pipe -march=core2 -mcx16 -msahf -maes -mpclmul -mpopcnt -msse4.1 -msse4.2 -mavx --param l1-cache-size=32 --param l1-cache-line-size=64 --param l2-cache-size=8192 -mtune=generic"
DEFAULT_ABI="amd64"
DISPLAY=":0.0"
DISTDIR="/usr/portage/distfiles"
EDITOR="/bin/nano"
ELIBC="glibc"
EMERGE_DEFAULT_OPTS="--jobs 8 --load-average 16 --keep-going --verbose"
EMERGE_WARNING_DELAY="10"
EPREFIX=""
EROOT="/"
FCFLAGS="-O2 -pipe"
FEATURES="assume-digests binpkg-logs config-protect-if-modified distlocks ebuild-locks fixlafiles merge-sync news parallel-fetch protect-owned sandbox sfperms splitdebug strict unknown-features-warn unmerge-logs unmerge-orphans userfetch"
FETCHCOMMAND="wget -t 3 -T 60 --passive-ftp -O "${DISTDIR}/${FILE}" "${URI}""
FETCHCOMMAND_RSYNC="rsync -avP "${URI}" "${DISTDIR}/${FILE}""
FETCHCOMMAND_SFTP="bash -c "x=\${2#sftp://} ; host=\${x%%/*} ; port=\${host##*:} ; host=\${host%:*} ; [[ \${host} = \${port} ]] && port=22 ; exec sftp -P \${port} \"\${host}:/\${x#*/}\" \"\$1\"" sftp "${DISTDIR}/${FILE}" "${URI}""
FETCHCOMMAND_SSH="bash -c "x=\${2#ssh://} ; host=\${x%%/*} ; port=\${host##*:} ; host=\${host%:*} ; [[ \${host} = \${port} ]] && port=22 ; exec rsync --rsh=\"ssh -p\${port}\" -avP \"\${host}:/\${x#*/}\" \"\$1\"" rsync "${DISTDIR}/${FILE}" "${URI}""
FFLAGS="-O2 -pipe"
GCC_SPECS=""
GENTOO_MIRRORS="http://ftp.ncnu.edu.tw/Linux/Gentoo/ http://mirrors.xmu.edu.cn/gentoo http://archive.mmu.edu.my/gentoo http://ftp.swin.edu.au/gentoo"
GPSD_PROTOCOLS="ashtech aivdm earthmate evermore fv18 garmin garmintxt gpsclock itrax mtk3301 nmea ntrip navcom oceanserver oldstyle oncore rtcm104v2 rtcm104v3 sirf superstar2 timing tsip tripmate tnt ubx"
GRUB_PLATFORMS=""
GSETTINGS_BACKEND="dconf"
GUILE_LOAD_PATH="/usr/share/guile/1.8"
HOME="/root"
INFOPATH="/usr/share/info:/usr/share/gcc-data/x86_64-pc-linux-gnu/4.6.3/info:/usr/share/binutils-data/x86_64-pc-linux-gnu/2.23.1/info"
INPUT_DEVICES="evdev void"
IUSE_IMPLICIT="prefix"
JAVAC="/etc/java-config-2/current-system-vm/bin/javac"
JAVACC_HOME="/usr/share/javacc/"
JAVA_HOME="/etc/java-config-2/current-system-vm"
JDK_HOME="/etc/java-config-2/current-system-vm"
KERNEL="linux"
LANG="en_US.UTF-8"
LCD_DEVICES="bayrad cfontz cfontz633 glk hd44780 lb216 lcdm001 mtxorb ncurses text"
LDFLAGS="-Wl,-O1,--as-needed"
LDFLAGS_amd64="-m elf_x86_64"
LDFLAGS_x32="-m elf32_x86_64"
LDFLAGS_x86="-m elf_i386"
LESS="-R -M --shift 5"
LESSOPEN="|lesspipe %s"
LIBDIR_amd64="lib64"
LIBDIR_amd64_fbsd="lib64"
LIBDIR_n32="lib32"
LIBDIR_n64="lib64"
LIBDIR_o32="lib"
LIBDIR_ppc="lib32"
LIBDIR_ppc64="lib64"
LIBDIR_s390="lib32"
LIBDIR_s390x="lib64"
LIBDIR_sparc32="lib32"
LIBDIR_sparc64="lib64"
LIBDIR_x32="libx32"
LIBDIR_x86="lib32"
LIBDIR_x86_fbsd="lib32"
LIBREOFFICE_EXTENSIONS="presenter-console presenter-minimizer"
LINGUAS="en en_US"
LOGNAME="root"
MAKEOPTS="-j8 -l16"
MANPATH="/etc/java-config-2/current-system-vm/man:/usr/local/share/man:/usr/share/man:/usr/share/gcc-data/x86_64-pc-linux-gnu/4.6.3/man:/usr/share/binutils-data/x86_64-pc-linux-gnu/2.23.1/man:/etc/java-config-2/current-system-vm/man/"
MULTILIB_ABIS="amd64 x86"
MULTILIB_STRICT_DENY="64-bit.*shared object"
MULTILIB_STRICT_DIRS="/lib32 /lib /usr/lib32 /usr/lib /usr/kde/*/lib32 /usr/kde/*/lib /usr/qt/*/lib32 /usr/qt/*/lib /usr/X11R6/lib32 /usr/X11R6/lib"
MULTILIB_STRICT_EXEMPT="(perl5|gcc|gcc-lib|binutils|eclipse-3|debug|portage|udev)"
NETBEANS="apisupport cnd groovy gsf harness ide identity j2ee java mobility nb php profiler soa visualweb webcommon websvccommon xml"
OLDPWD="/media"
OPENGL_PROFILE="xorg-x11"
PAGER="/usr/bin/less"
PATH="/usr/local/sbin:/usr/local/bin:/usr/sbin:/usr/bin:/sbin:/bin:/opt/bin:/usr/x86_64-pc-linux-gnu/gcc-bin/4.6.3:."
PHP_TARGETS="php5-3"
PKGDIR="/usr/portage/packages"
PORTAGE_ARCHLIST="ppc sparc64-freebsd ppc-openbsd x86-openbsd ppc64 x86-winnt x86-fbsd ppc-aix alpha arm x86-freebsd s390 amd64 arm-linux x86-macos x64-openbsd ia64-hpux hppa x86-netbsd ppc64-linux x86-cygwin amd64-linux ia64-linux x86 sparc-solaris x64-freebsd sparc64-solaris x86-linux x64-macos sparc m68k-mint ia64 mips ppc-macos x86-interix hppa-hpux amd64-fbsd x64-solaris m68k sh x86-solaris sparc-fbsd"
PORTAGE_BIN_PATH="/usr/lib64/portage/bin"
PORTAGE_COMPRESS_EXCLUDE_SUFFIXES="css gif htm[l]? jp[e]?g js pdf png"
PORTAGE_CONFIGROOT="/"
PORTAGE_DEBUG="0"
PORTAGE_DEPCACHEDIR="/var/cache/edb/dep"
PORTAGE_ELOG_CLASSES="log warn error"
PORTAGE_ELOG_MAILFROM="portage@localhost"
PORTAGE_ELOG_MAILSUBJECT="[portage] ebuild log for ${PACKAGE} on ${HOST}"
PORTAGE_ELOG_MAILURI="root"
PORTAGE_ELOG_SYSTEM="save_summary:log,warn,error,qa echo"
PORTAGE_FETCH_CHECKSUM_TRY_MIRRORS="5"
PORTAGE_FETCH_RESUME_MIN_SIZE="350K"
PORTAGE_GID="250"
PORTAGE_GPG_SIGNING_COMMAND="gpg --sign --digest-algo SHA256 --clearsign --yes --default-key "${PORTAGE_GPG_KEY}" --homedir "${PORTAGE_GPG_DIR}" "${FILE}""
PORTAGE_INST_GID="0"
PORTAGE_INST_UID="0"
PORTAGE_INTERNAL_CALLER="1"
PORTAGE_NICENESS="15"
PORTAGE_OVERRIDE_EPREFIX=""
PORTAGE_PYM_PATH="/usr/lib64/portage/pym"
PORTAGE_RSYNC_OPTS="--recursive --links --safe-links --perms --times --compress --force --whole-file --delete --stats --human-readable --timeout=180 --exclude=/distfiles --exclude=/local --exclude=/packages"
PORTAGE_RSYNC_RETRIES="-1"
PORTAGE_SYNC_STALE="30"
PORTAGE_TMPDIR="/var/tmp"
PORTAGE_VERBOSE="1"
PORTAGE_WORKDIR_MODE="0700"
PORTDIR="/usr/portage"
PORTDIR_OVERLAY=""
PORT_LOGDIR_CLEAN="find "${PORT_LOGDIR}" -type f ! -name "summary.log*" -mtime +7 -delete"
PRELINK_PATH_MASK="/usr/lib64/klibc:/usr/lib64/libfreebl3.so:/usr/lib64/libnssdbm3.so:/usr/lib64/libsoftokn3.so"
PROFILE_ONLY_VARIABLES="ARCH ELIBC IUSE_IMPLICIT KERNEL USERLAND USE_EXPAND_IMPLICIT USE_EXPAND_UNPREFIXED USE_EXPAND_VALUES_ARCH USE_EXPAND_VALUES_ELIBC USE_EXPAND_VALUES_KERNEL USE_EXPAND_VALUES_USERLAND"
PS1="\[\033[01;29m\](\u@\[\033[01;32;32m\]\h\[\033[00m\]\[\033[01;29m\]):\[\033[01;29m\]${PWD}>>\[\033[00m\]"
PWD="/usr/lib64"
PYTHONDONTWRITEBYTECODE="1"
PYTHONPATH="/usr/lib/portage/pym"
PYTHON_SINGLE_TARGET="python2_7"
PYTHON_TARGETS="python2_7 python3_2"
QT_GRAPHICSSYSTEM="raster"
RESUMECOMMAND="wget -c -t 3 -T 60 --passive-ftp -O "${DISTDIR}/${FILE}" "${URI}""
RESUMECOMMAND_RSYNC="rsync -avP "${URI}" "${DISTDIR}/${FILE}""
RESUMECOMMAND_SSH="bash -c "x=\${2#ssh://} ; host=\${x%%/*} ; port=\${host##*:} ; host=\${host%:*} ; [[ \${host} = \${port} ]] && port=22 ; exec rsync --rsh=\"ssh -p\${port}\" -avP \"\${host}:/\${x#*/}\" \"\$1\"" rsync "${DISTDIR}/${FILE}" "${URI}""
ROOT="/"
ROOTPATH="/opt/bin:/usr/x86_64-pc-linux-gnu/gcc-bin/4.6.3"
RPMDIR="/usr/portage/rpm"
RUBYOPT="-rauto_gem"
RUBY_TARGETS="ruby18 ruby19"
SHELL="/bin/bash"
SHLVL="1"
SYMLINK_LIB="yes"
SYNC="rsync://rsync.au.gentoo.org/gentoo-portage"
TERM="xterm"
UNINSTALL_IGNORE="/lib/modules/*"
USE="X a52 aac acl acpi alsa amd64 apm bash-completion berkdb bluetooth branding bzip2 cairo cdda cddb cdr cli colord consolekit cracklib crypt cups curl cxx dbus dri dts dvd dvdr eds emboss encode exif fam fbcon fbcondecor ffmpeg firefox flac fortran ftp gd gdbm gif gimp gnome gnome-keyring gnome-online-accounts gpm gstreamer gtk gzip hddtemp iconv ieee1394 ios ipv6 java javascript jpeg jpeg2k lame lcms ldap libnotify libwww lm_sensors mad maildir matroska mmx mng modules mono mp3 mp4 mpeg mplayer mudflap multilib musepack musicbrainz nautilus ncurses networkmanager nfs nls nptl nsplugin ntfs ogg opengl openmp pam pango pcre pdf perl php png policykit ppds pulseaudio python qt3support rar readline rss samba sdl session smp socialweb sockets sockets5 spell sse sse2 ssl startup-notification stream svg tcpd theora threads tiff truetype udev udisks unicode upower usb v4l v4l2 vorbis wxwidgets x264 xcb xml xulrunner xv xvid zlib" ABI_X86="64" ALSA_CARDS="ali5451 als4000 atiixp atiixp-modem bt87x ca0106 cmipci emu10k1x ens1370 ens1371 es1938 es1968 fm801 hda-intel intel8x0 intel8x0m maestro3 trident usb-audio via82xx via82xx-modem ymfpci" ALSA_PCM_PLUGINS="adpcm alaw asym copy dmix dshare dsnoop empty extplug file hooks iec958 ioplug ladspa lfloat linear meter mmap_emul mulaw multi null plug rate route share shm softvol" APACHE2_MODULES="authn_core authz_core socache_shmcb unixd actions alias auth_basic authn_alias authn_anon authn_dbm authn_default authn_file authz_dbm authz_default authz_groupfile authz_host authz_owner
 authz_user autoindex cache cgi cgid dav dav_fs dav_lock deflate dir disk_cache env expires ext_filter file_cache filter headers include info log_config logio mem_cache mime mime_magic negotiation rewrite setenvif speling status
 unique_id userdir usertrack vhost_alias" CALLIGRA_FEATURES="kexi words flow plan sheets stage tables krita karbon braindump" CAMERAS="ptp2" COLLECTD_PLUGINS="df interface irq load memory rrdtool swap syslog" ELIBC="glibc" GPSD_PROTOCOLS="ashtech aivdm earthmate evermore fv18 garmin garmintxt gpsclock itrax mtk3301 nmea ntrip navcom oceanserver oldstyle oncore rtcm104v2 rtcm104v3 sirf superstar2 timing tsip tripmate tnt ubx" INPUT_DEVICES="evdev void" KERNEL="linux" LCD_DEVICES="bayrad cfontz cfontz633 glk hd44780 lb216 lcdm001 mtxorb ncurses text" LIBREOFFICE_EXTENSIONS="presenter-console presenter-minimizer" LINGUAS="en en_US" PHP_TARGETS="php5-3" PYTHON_SINGLE_TARGET="python2_7" PYTHON_TARGETS="python2_7 python3_2" RUBY_TARGETS="ruby18 ruby19" USERLAND="GNU" VIDEO_CARDS="fbdev nouveau" XTABLES_ADDONS="quota2 psd pknock lscan length2 ipv4options ipset ipp2p iface geoip fuzzy condition tee tarpit sysrq steal rawnat logmark ipmark dhcpmac delude chaos account"
USER="root"
USERLAND="GNU"
USE_EXPAND="ABI_X86 ALSA_CARDS ALSA_PCM_PLUGINS APACHE2_MODULES APACHE2_MPMS CALLIGRA_FEATURES CAMERAS COLLECTD_PLUGINS CROSSCOMPILE_OPTS CURL_SSL DRACUT_MODULES DVB_CARDS ELIBC ENLIGHTENMENT_MODULES FCDSL_CARDS FFTOOLS FOO2ZJS_DEVICES FRITZCAPI_CARDS GPSD_PROTOCOLS GRUB_PLATFORMS INPUT_DEVICES KERNEL LCD_DEVICES LIBREOFFICE_EXTENSIONS LINGUAS LIRC_DEVICES MISDN_CARDS NETBEANS_MODULES NGINX_MODULES_HTTP NGINX_MODULES_MAIL OFED_DRIVERS OPENMPI_FABRICS OPENMPI_OFED_FEATURES OPENMPI_RM PHP_TARGETS PYTHON_SINGLE_TARGET PYTHON_TARGETS QEMU_SOFTMMU_TARGETS QEMU_USER_TARGETS RUBY_TARGETS SANE_BACKENDS USERLAND VIDEO_CARDS VOICEMAIL_STORAGE XFCE_PLUGINS XTABLES_ADDONS"
USE_EXPAND_HIDDEN="CROSSCOMPILE_OPTS ELIBC KERNEL USERLAND"
USE_EXPAND_IMPLICIT="ARCH ELIBC KERNEL USERLAND"
USE_EXPAND_UNPREFIXED="ARCH"
USE_EXPAND_VALUES_ARCH="alpha amd64 amd64-fbsd amd64-linux arm arm-linux hppa hppa-hpux ia64 ia64-hpux ia64-linux m68k m68k-mint mips ppc ppc64 ppc64-linux ppc-aix ppc-macos ppc-openbsd s390 sh sparc sparc64-freebsd sparc64-solaris sparc-fbsd sparc-solaris x64-freebsd x64-macos x64-openbsd x64-solaris x86 x86-cygwin x86-fbsd x86-freebsd x86-interix x86-linux x86-macos x86-netbsd x86-openbsd x86-solaris x86-winnt"
USE_EXPAND_VALUES_ELIBC="AIX Cygwin Darwin FreeBSD glibc HPUX Interix mintlib NetBSD OpenBSD SunOS uclibc Winnt"
USE_EXPAND_VALUES_KERNEL="AIX Cygwin Darwin FreeBSD freemint HPUX Interix linux NetBSD OpenBSD SunOS Winnt"
USE_EXPAND_VALUES_USERLAND="BSD GNU"
USE_ORDER="env:pkg:conf:defaults:pkginternal:repo:env.d"
VIDEO_CARDS="fbdev nouveau"
XAUTHORITY="/root/.xauthbSMxkq"
XDG_CONFIG_DIRS="/etc/xdg"
XDG_DATA_DIRS="/usr/local/share:/usr/share:/usr/share/gdm"
XTABLES_ADDONS="quota2 psd pknock lscan length2 ipv4options ipset ipp2p iface geoip fuzzy condition tee tarpit sysrq steal rawnat logmark ipmark dhcpmac delude chaos account"
_="/usr/bin/emerge"


Code:

x86_64-pc-linux-gnu-gcc -DHAVE_CONFIG_H -I. -I/var/tmp/portage/sys-boot/grub-2.00-r2/work/grub-2.00  -Wall -W -I./include -DGRUB_UTIL=1 -DGRUB_LIBDIR=\"/usr/lib/grub\" -DLOCALEDIR=\"/usr/share/locale\" -DGRUB_FILE=\"grub-core/unidata.c\" -I. -I/var/tmp/portage/sys-boot/grub-2.00-r2/work/grub-2.00 -I. -I/var/tmp/portage/sys-boot/grub-2.00-r2/work/grub-2.00 -I/var/tmp/portage/sys-boot/grub-2.00-r2/work/grub-2.00/include -I./include -I./grub-core/gnulib -I/var/tmp/portage/sys-boot/grub-2.00-r2/work/grub-2.00/grub-core/gnulib   -Wall -W -Wshadow -Wold-style-definition -Wpointer-arith -Wundef -Wextra -Waddress -Wattributes -Wcast-align -Wchar-subscripts -Wcomment -Wdeprecated-declarations -Wdisabled-optimization -Wdiv-by-zero -Wempty-body -Wendif-labels -Wfloat-equal -Wformat-extra-args -Wformat-security -Wformat-y2k -Wimplicit -Wimplicit-function-declaration -Wimplicit-int -Winit-self -Wint-to-pointer-cast -Winvalid-pch -Wmain -Wmissing-braces -Wmissing-field-initializers -Wmissing-format-attribute -Wmissing-noreturn -Wmultichar -Wnonnull -Woverflow -Wparentheses -Wpointer-arith -Wpointer-to-int-cast -Wreturn-type -Wsequence-point -Wshadow -Wsign-compare -Wstrict-aliasing -Wswitch -Wtrigraphs -Wundef -Wunknown-pragmas -Wunused -Wunused-function -Wunused-label -Wunused-parameter -Wunused-value  -Wunused-variable -Wvariadic-macros -Wvolatile-register-var -Wwrite-strings -Wnested-externs -Wstrict-prototypes -Wpointer-sign -Wno-undef -Wno-sign-compare -Wno-unused -Wno-unused-parameter -Wno-redundant-decls -Wno-unreachable-code -Wno-conversion -Wno-old-style-definition -Wno-unsafe-loop-optimizations -I/usr/lib64/freetype2/include/freetype2 -I/usr/lib64/freetype2/include   -c -o grub-core/grub_mkfont-unidata.o `test -f 'grub-core/unidata.c' || echo '/var/tmp/portage/sys-boot/grub-2.00-r2/work/grub-2.00/'`grub-core/unidata.c
x86_64-pc-linux-gnu-gcc -DHAVE_CONFIG_H -I. -I/var/tmp/portage/sys-boot/grub-2.00-r2/work/grub-2.00  -Wall -W -I./include -DGRUB_UTIL=1 -DGRUB_LIBDIR=\"/usr/lib/grub\" -DLOCALEDIR=\"/usr/share/locale\" -DGRUB_FILE=\"grub-core/lib/i386/pc/vesa_modes_table.c\" -I. -I/var/tmp/portage/sys-boot/grub-2.00-r2/work/grub-2.00 -I. -I/var/tmp/portage/sys-boot/grub-2.00-r2/work/grub-2.00 -I/var/tmp/portage/sys-boot/grub-2.00-r2/work/grub-2.00/include -I./include -I./grub-core/gnulib -I/var/tmp/portage/sys-boot/grub-2.00-r2/work/grub-2.00/grub-core/gnulib   -Wall -W -Wshadow -Wold-style-definition -Wpointer-arith -Wundef -Wextra -Waddress -Wattributes -Wcast-align -Wchar-subscripts -Wcomment -Wdeprecated-declarations -Wdisabled-optimization -Wdiv-by-zero -Wempty-body -Wendif-labels -Wfloat-equal -Wformat-extra-args -Wformat-security -Wformat-y2k -Wimplicit -Wimplicit-function-declaration -Wimplicit-int -Winit-self -Wint-to-pointer-cast -Winvalid-pch -Wmain -Wmissing-braces -Wmissing-field-initializers -Wmissing-format-attribute -Wmissing-noreturn -Wmultichar -Wnonnull -Woverflow -Wparentheses -Wpointer-arith -Wpointer-to-int-cast -Wreturn-type -Wsequence-point -Wshadow -Wsign-compare -Wstrict-aliasing -Wswitch -Wtrigraphs -Wundef -Wunknown-pragmas -Wunused -Wunused-function -Wunused-label -Wunused-parameter -Wunused-value  -Wunused-variable -Wvariadic-macros -Wvolatile-register-var -Wwrite-strings -Wnested-externs -Wstrict-prototypes -Wpointer-sign -Wno-undef -Wno-sign-compare -Wno-unused -Wno-unused-parameter -Wno-redundant-decls -Wno-unreachable-code -Wno-conversion -Wno-old-style-definition -Wno-unsafe-loop-optimizations   -c -o grub-core/lib/i386/pc/grub_menulst2cfg-vesa_modes_table.o `test -f 'grub-core/lib/i386/pc/vesa_modes_table.c' || echo '/var/tmp/portage/sys-boot/grub-2.00-r2/work/grub-2.00/'`grub-core/lib/i386/pc/vesa_modes_table.c
x86_64-pc-linux-gnu-gcc -DHAVE_CONFIG_H -I. -I/var/tmp/portage/sys-boot/grub-2.00-r2/work/grub-2.00  -Wall -W -I./include -DGRUB_UTIL=1 -DGRUB_LIBDIR=\"/usr/lib/grub\" -DLOCALEDIR=\"/usr/share/locale\" -DGRUB_FILE=\"util/ieee1275/ofpath.c\" -I. -I/var/tmp/portage/sys-boot/grub-2.00-r2/work/grub-2.00 -I. -I/var/tmp/portage/sys-boot/grub-2.00-r2/work/grub-2.00 -I/var/tmp/portage/sys-boot/grub-2.00-r2/work/grub-2.00/include -I./include -I./grub-core/gnulib -I/var/tmp/portage/sys-boot/grub-2.00-r2/work/grub-2.00/grub-core/gnulib   -Wall -W -Wshadow -Wold-style-definition -Wpointer-arith -Wundef -Wextra -Waddress -Wattributes -Wcast-align -Wchar-subscripts -Wcomment -Wdeprecated-declarations -Wdisabled-optimization -Wdiv-by-zero -Wempty-body -Wendif-labels -Wfloat-equal -Wformat-extra-args -Wformat-security -Wformat-y2k -Wimplicit -Wimplicit-function-declaration -Wimplicit-int -Winit-self -Wint-to-pointer-cast -Winvalid-pch -Wmain -Wmissing-braces -Wmissing-field-initializers -Wmissing-format-attribute -Wmissing-noreturn -Wmultichar -Wnonnull -Woverflow -Wparentheses -Wpointer-arith -Wpointer-to-int-cast -Wreturn-type -Wsequence-point -Wshadow -Wsign-compare -Wstrict-aliasing -Wswitch -Wtrigraphs -Wundef -Wunknown-pragmas -Wunused -Wunused-function -Wunused-label -Wunused-parameter -Wunused-value  -Wunused-variable -Wvariadic-macros -Wvolatile-register-var -Wwrite-strings -Wnested-externs -Wstrict-prototypes -Wpointer-sign -Wno-undef -Wno-sign-compare -Wno-unused -Wno-unused-parameter -Wno-redundant-decls -Wno-unreachable-code -Wno-conversion -Wno-old-style-definition -Wno-unsafe-loop-optimizations   -c -o util/ieee1275/grub_probe-ofpath.o `test -f 'util/ieee1275/ofpath.c' || echo '/var/tmp/portage/sys-boot/grub-2.00-r2/work/grub-2.00/'`util/ieee1275/ofpath.c
chmod a+x grub-mkrescue
PATH=.:$PATH pkgdatadir=. /usr/bin/help2man --section=1 -i /var/tmp/portage/sys-boot/grub-2.00-r2/work/grub-2.00/docs/man/grub-mkrescue.h2m -o grub-mkrescue.1 grub-mkrescue
chmod a+x grub-mkstandalone
chmod a+x grub-install
PATH=.:$PATH pkgdatadir=. /usr/bin/help2man --section=1 -i /var/tmp/portage/sys-boot/grub-2.00-r2/work/grub-2.00/docs/man/grub-mkstandalone.h2m -o grub-mkstandalone.1 grub-mkstandalone
PATH=.:$PATH pkgdatadir=. /usr/bin/help2man --section=8 -i /var/tmp/portage/sys-boot/grub-2.00-r2/work/grub-2.00/docs/man/grub-install.h2m -o grub-install.8 grub-install
chmod a+x grub-mknetdir
PATH=.:$PATH pkgdatadir=. /usr/bin/help2man --section=8 -i /var/tmp/portage/sys-boot/grub-2.00-r2/work/grub-2.00/docs/man/grub-mknetdir.h2m -o grub-mknetdir.8 grub-mknetdir
chmod a+x grub-mkconfig
PATH=.:$PATH pkgdatadir=. /usr/bin/help2man --section=8 -i /var/tmp/portage/sys-boot/grub-2.00-r2/work/grub-2.00/docs/man/grub-mkconfig.h2m -o grub-mkconfig.8 grub-mkconfig
chmod a+x grub-set-default
PATH=.:$PATH pkgdatadir=. /usr/bin/help2man --section=8 -i /var/tmp/portage/sys-boot/grub-2.00-r2/work/grub-2.00/docs/man/grub-set-default.h2m -o grub-set-default.8 grub-set-default
help2man: can't get `--help' info from grub-install
Try `--no-discard-stderr' if option outputs to stderr
make[2]: *** [grub-install.8] Error 2
make[2]: *** Waiting for unfinished jobs....
make[2]: Leaving directory `/var/tmp/portage/sys-boot/grub-2.00-r2/work/build-guessed'
make[1]: *** [all-recursive] Error 1
make[1]: Leaving directory `/var/tmp/portage/sys-boot/grub-2.00-r2/work/build-guessed'
make: *** [all] Error 2
 * ERROR: sys-boot/grub-2.00-r2 failed (compile phase):
 *   emake failed
 *
 * If you need support, post the output of `emerge --info '=sys-boot/grub-2.00-r2'`,
 * the complete build log and the output of `emerge -pqv '=sys-boot/grub-2.00-r2'`.
 * The complete build log is located at '/var/tmp/portage/sys-boot/grub-2.00-r2/temp/build.log'.
 * The ebuild environment file is located at '/var/tmp/portage/sys-boot/grub-2.00-r2/temp/environment'.
 * Working directory: '/var/tmp/portage/sys-boot/grub-2.00-r2/work/build-guessed'
 * S: '/var/tmp/portage/sys-boot/grub-2.00-r2/work/grub-2.00'

_________________
War is Peace, Freedom is Slavery, Ignorance is Strength.


Last edited by shaman200 on Mon Mar 11, 2013 9:00 pm; edited 2 times in total
Back to top
View user's profile Send private message
shaman200
n00b
n00b


Joined: 29 Dec 2005
Posts: 30

PostPosted: Sun Mar 03, 2013 2:53 pm    Post subject: Reply with quote

No idea???Anyone??

Thanks!
_________________
War is Peace, Freedom is Slavery, Ignorance is Strength.
Back to top
View user's profile Send private message
popsUlfr
Tux's lil' helper
Tux's lil' helper


Joined: 27 Feb 2011
Posts: 80

PostPosted: Sun Mar 03, 2013 5:16 pm    Post subject: Re: Grub 2 error : unable to update Reply with quote

shaman200 wrote:

Code:
emerge -pqv '=sys-boot/grub-2.00-r2'
[ebuild     U ] sys-boot/grub-2.00-r2 [2.00] USE="nls sdl truetype -custom-cflags -debug -device-mapper -doc% -efiemu -libzfs -mount -static" GRUB_PLATFORMS="-coreboot -efi-32 -efi-64 -emu -ieee1275 -multiboot -pc -qemu -qemu-mips -yeeloong"


None of the GRUB_PLATFORMS are enabled. Didn't emerge warn you about this when you tried to emerge it?

Add pc for normal MBR booting to your make.conf and try again:
Code:
GRUB_PLATFORMS="pc"


EDIT: could you remove the LS_COLORS line and put APACHE_MODULES on a new line in your original post? It stretches the thread quite heavily :P
Back to top
View user's profile Send private message
shaman200
n00b
n00b


Joined: 29 Dec 2005
Posts: 30

PostPosted: Tue Mar 05, 2013 5:29 am    Post subject: Reply with quote

Hi!

Thanks for your answer, unfortunately it's still failing...for the exact same reason.

Code:

/var/tmp/portage/sys-boot/grub-2.00-r2/work/grub-2.00/'`grub-core/lib/libgcrypt-grub/cipher/whirlpool.c
/var/tmp/portage/sys-boot/grub-2.00-r2/work/grub-2.00/grub-core/fs/zfs/zfs.c: In function 'grub_zfs_dir':
/var/tmp/portage/sys-boot/grub-2.00-r2/work/grub-2.00/grub-core/fs/zfs/zfs.c:3885:24: warning: trampoline generated for nested function 'iterate_zap' [-Wtrampolines]
/var/tmp/portage/sys-boot/grub-2.00-r2/work/grub-2.00/grub-core/fs/zfs/zfs.c:3938:24: warning: trampoline generated for nested function 'iterate_zap_fs' [-Wtrampolines]
/var/tmp/portage/sys-boot/grub-2.00-r2/work/grub-2.00/grub-core/fs/zfs/zfs.c:3951:24: warning: trampoline generated for nested function 'iterate_zap_snap' [-Wtrampolines]
x86_64-pc-linux-gnu-gcc -DHAVE_CONFIG_H -I. -I/var/tmp/portage/sys-boot/grub-2.00-r2/work/grub-2.00   -Wall -W -I./include -DGRUB_UTIL=1 -DGRUB_LIBDIR=\"/usr/lib/grub\" -DLOCALEDIR=\"/usr/share/locale\" -DGRUB_FILE=\"grub-core/lib/libgcrypt-grub/cipher/md5.c\" -I. -I/var/tmp/portage/sys-boot/grub-2.00-r2/work/grub-2.00 -I. -I/var/tmp/portage/sys-boot/grub-2.00-r2/work/grub-2.00 -I/var/tmp/portage/sys-boot/grub-2.00-r2/work/grub-2.00/include -I./include  -I/var/tmp/portage/sys-boot/grub-2.00-r2/work/grub-2.00/grub-core/lib/libgcrypt_wrap                -Wall -W -Wshadow -Wold-style-definition -Wpointer-arith -Wundef -Wextra -Waddress -Wattributes -Wcast-align -Wchar-subscripts -Wcomment -Wdeprecated-declarations -Wdisabled-optimization -Wdiv-by-zero -Wempty-body -Wendif-labels -Wfloat-equal -Wformat-extra-args -Wformat-security -Wformat-y2k -Wimplicit -Wimplicit-function-declaration -Wimplicit-int -Winit-self -Wint-to-pointer-cast -Winvalid-pch -Wmain -Wmissing-braces -Wmissing-field-initializers -Wmissing-format-attribute -Wmissing-noreturn -Wmultichar -Wnonnull -Woverflow -Wparentheses -Wpointer-arith -Wpointer-to-int-cast -Wreturn-type -Wsequence-point -Wshadow -Wsign-compare -Wstrict-aliasing -Wswitch -Wtrigraphs -Wundef -Wunknown-pragmas -Wunused -Wunused-function -Wunused-label -Wunused-parameter -Wunused-value  -Wunused-variable -Wvariadic-macros -Wvolatile-register-var -Wwrite-strings -Wnested-externs -Wstrict-prototypes -Wpointer-sign  -Wno-error -Wno-missing-field-initializers               -c -o grub-core/lib/libgcrypt-grub/cipher/libgrubgcry_a-md5.o `test -f 'grub-core/lib/libgcrypt-grub/cipher/md5.c' || echo '/var/tmp/portage/sys-boot/grub-2.00-r2/work/grub-2.00/'`grub-core/lib/libgcrypt-grub/cipher/md5.c
x86_64-pc-linux-gnu-gcc -DHAVE_CONFIG_H -I. -I/var/tmp/portage/sys-boot/grub-2.00-r2/work/grub-2.00   -Wall -W -I./include -DGRUB_UTIL=1 -DGRUB_LIBDIR=\"/usr/lib/grub\" -DLOCALEDIR=\"/usr/share/locale\" -DGRUB_FILE=\"grub-core/lib/libgcrypt-grub/cipher/serpent.c\" -I. -I/var/tmp/portage/sys-boot/grub-2.00-r2/work/grub-2.00 -I. -I/var/tmp/portage/sys-boot/grub-2.00-r2/work/grub-2.00 -I/var/tmp/portage/sys-boot/grub-2.00-r2/work/grub-2.00/include -I./include  -I/var/tmp/portage/sys-boot/grub-2.00-r2/work/grub-2.00/grub-core/lib/libgcrypt_wrap                -Wall -W -Wshadow -Wold-style-definition -Wpointer-arith -Wundef -Wextra -Waddress -Wattributes -Wcast-align -Wchar-subscripts -Wcomment -Wdeprecated-declarations -Wdisabled-optimization -Wdiv-by-zero -Wempty-body -Wendif-labels -Wfloat-equal -Wformat-extra-args -Wformat-security -Wformat-y2k -Wimplicit -Wimplicit-function-declaration -Wimplicit-int -Winit-self -Wint-to-pointer-cast -Winvalid-pch -Wmain -Wmissing-braces -Wmissing-field-initializers -Wmissing-format-attribute -Wmissing-noreturn -Wmultichar -Wnonnull -Woverflow -Wparentheses -Wpointer-arith -Wpointer-to-int-cast -Wreturn-type -Wsequence-point -Wshadow -Wsign-compare -Wstrict-aliasing -Wswitch -Wtrigraphs -Wundef -Wunknown-pragmas -Wunused -Wunused-function -Wunused-label -Wunused-parameter -Wunused-value  -Wunused-variable -Wvariadic-macros -Wvolatile-register-var -Wwrite-strings -Wnested-externs -Wstrict-prototypes -Wpointer-sign  -Wno-error -Wno-missing-field-initializers               -c -o grub-core/lib/libgcrypt-grub/cipher/libgrubgcry_a-serpent.o `test -f 'grub-core/lib/libgcrypt-grub/cipher/serpent.c' || echo '/var/tmp/portage/sys-boot/grub-2.00-r2/work/grub-2.00/'`grub-core/lib/libgcrypt-grub/cipher/serpent.c
x86_64-pc-linux-gnu-gcc -DHAVE_CONFIG_H -I. -I/var/tmp/portage/sys-boot/grub-2.00-r2/work/grub-2.00   -Wall -W -I./include -DGRUB_UTIL=1 -DGRUB_LIBDIR=\"/usr/lib/grub\" -DLOCALEDIR=\"/usr/share/locale\" -DGRUB_FILE=\"grub-core/lib/libgcrypt-grub/cipher/sha512.c\" -I. -I/var/tmp/portage/sys-boot/grub-2.00-r2/work/grub-2.00 -I. -I/var/tmp/portage/sys-boot/grub-2.00-r2/work/grub-2.00 -I/var/tmp/portage/sys-boot/grub-2.00-r2/work/grub-2.00/include -I./include  -I/var/tmp/portage/sys-boot/grub-2.00-r2/work/grub-2.00/grub-core/lib/libgcrypt_wrap                -Wall -W -Wshadow -Wold-style-definition -Wpointer-arith -Wundef -Wextra -Waddress -Wattributes -Wcast-align -Wchar-subscripts -Wcomment -Wdeprecated-declarations -Wdisabled-optimization -Wdiv-by-zero -Wempty-body -Wendif-labels -Wfloat-equal -Wformat-extra-args -Wformat-security -Wformat-y2k -Wimplicit -Wimplicit-function-declaration -Wimplicit-int -Winit-self -Wint-to-pointer-cast -Winvalid-pch -Wmain -Wmissing-braces -Wmissing-field-initializers -Wmissing-format-attribute -Wmissing-noreturn -Wmultichar -Wnonnull -Woverflow -Wparentheses -Wpointer-arith -Wpointer-to-int-cast -Wreturn-type -Wsequence-point -Wshadow -Wsign-compare -Wstrict-aliasing -Wswitch -Wtrigraphs -Wundef -Wunknown-pragmas -Wunused -Wunused-function -Wunused-label -Wunused-parameter -Wunused-value  -Wunused-variable -Wvariadic-macros -Wvolatile-register-var -Wwrite-strings -Wnested-externs -Wstrict-prototypes -Wpointer-sign  -Wno-error -Wno-missing-field-initializers               -c -o grub-core/lib/libgcrypt-grub/cipher/libgrubgcry_a-sha512.o `test -f 'grub-core/lib/libgcrypt-grub/cipher/sha512.c' || echo '/var/tmp/portage/sys-boot/grub-2.00-r2/work/grub-2.00/'`grub-core/lib/libgcrypt-grub/cipher/sha512.c
x86_64-pc-linux-gnu-gcc -DHAVE_CONFIG_H -I. -I/var/tmp/portage/sys-boot/grub-2.00-r2/work/grub-2.00   -Wall -W -I./include -DGRUB_UTIL=1 -DGRUB_LIBDIR=\"/usr/lib/grub\" -DLOCALEDIR=\"/usr/share/locale\" -DGRUB_FILE=\"grub-core/lib/libgcrypt-grub/cipher/tiger.c\" -I. -I/var/tmp/portage/sys-boot/grub-2.00-r2/work/grub-2.00 -I. -I/var/tmp/portage/sys-boot/grub-2.00-r2/work/grub-2.00 -I/var/tmp/portage/sys-boot/grub-2.00-r2/work/grub-2.00/include -I./include  -I/var/tmp/portage/sys-boot/grub-2.00-r2/work/grub-2.00/grub-core/lib/libgcrypt_wrap                -Wall -W -Wshadow -Wold-style-definition -Wpointer-arith -Wundef -Wextra -Waddress -Wattributes -Wcast-align -Wchar-subscripts -Wcomment -Wdeprecated-declarations -Wdisabled-optimization -Wdiv-by-zero -Wempty-body -Wendif-labels -Wfloat-equal -Wformat-extra-args -Wformat-security -Wformat-y2k -Wimplicit -Wimplicit-function-declaration -Wimplicit-int -Winit-self -Wint-to-pointer-cast -Winvalid-pch -Wmain -Wmissing-braces -Wmissing-field-initializers -Wmissing-format-attribute -Wmissing-noreturn -Wmultichar -Wnonnull -Woverflow -Wparentheses -Wpointer-arith -Wpointer-to-int-cast -Wreturn-type -Wsequence-point -Wshadow -Wsign-compare -Wstrict-aliasing -Wswitch -Wtrigraphs -Wundef -Wunknown-pragmas -Wunused -Wunused-function -Wunused-label -Wunused-parameter -Wunused-value  -Wunused-variable -Wvariadic-macros -Wvolatile-register-var -Wwrite-strings -Wnested-externs -Wstrict-prototypes -Wpointer-sign  -Wno-error -Wno-missing-field-initializers               -c -o grub-core/lib/libgcrypt-grub/cipher/libgrubgcry_a-tiger.o `test -f 'grub-core/lib/libgcrypt-grub/cipher/tiger.c' || echo '/var/tmp/portage/sys-boot/grub-2.00-r2/work/grub-2.00/'`grub-core/lib/libgcrypt-grub/cipher/tiger.c
x86_64-pc-linux-gnu-gcc -DHAVE_CONFIG_H -I. -I/var/tmp/portage/sys-boot/grub-2.00-r2/work/grub-2.00   -Wall -W -I./include -DGRUB_UTIL=1 -DGRUB_LIBDIR=\"/usr/lib/grub\" -DLOCALEDIR=\"/usr/share/locale\" -DGRUB_FILE=\"grub-core/lib/libgcrypt-grub/cipher/camellia-glue.c\" -I. -I/var/tmp/portage/sys-boot/grub-2.00-r2/work/grub-2.00 -I. -I/var/tmp/portage/sys-boot/grub-2.00-r2/work/grub-2.00 -I/var/tmp/portage/sys-boot/grub-2.00-r2/work/grub-2.00/include -I./include  -I/var/tmp/portage/sys-boot/grub-2.00-r2/work/grub-2.00/grub-core/lib/libgcrypt_wrap                -Wall -W -Wshadow -Wold-style-definition -Wpointer-arith -Wundef -Wextra -Waddress -Wattributes -Wcast-align -Wchar-subscripts -Wcomment -Wdeprecated-declarations -Wdisabled-optimization -Wdiv-by-zero -Wempty-body -Wendif-labels -Wfloat-equal -Wformat-extra-args -Wformat-security -Wformat-y2k -Wimplicit -Wimplicit-function-declaration -Wimplicit-int -Winit-self -Wint-to-pointer-cast -Winvalid-pch -Wmain -Wmissing-braces -Wmissing-field-initializers -Wmissing-format-attribute -Wmissing-noreturn -Wmultichar -Wnonnull -Woverflow -Wparentheses -Wpointer-arith -Wpointer-to-int-cast -Wreturn-type -Wsequence-point -Wshadow -Wsign-compare -Wstrict-aliasing -Wswitch -Wtrigraphs -Wundef -Wunknown-pragmas -Wunused -Wunused-function -Wunused-label -Wunused-parameter -Wunused-value  -Wunused-variable -Wvariadic-macros -Wvolatile-register-var -Wwrite-strings -Wnested-externs -Wstrict-prototypes -Wpointer-sign  -Wno-error -Wno-missing-field-initializers               -c -o grub-core/lib/libgcrypt-grub/cipher/libgrubgcry_a-camellia-glue.o `test -f 'grub-core/lib/libgcrypt-grub/cipher/camellia-glue.c' || echo '/var/tmp/portage/sys-boot/grub-2.00-r2/work/grub-2.00/'`grub-core/lib/libgcrypt-grub/cipher/camellia-glue.c
x86_64-pc-linux-gnu-gcc -DHAVE_CONFIG_H -I. -I/var/tmp/portage/sys-boot/grub-2.00-r2/work/grub-2.00   -Wall -W -I./include -DGRUB_UTIL=1 -DGRUB_LIBDIR=\"/usr/lib/grub\" -DLOCALEDIR=\"/usr/share/locale\" -DGRUB_FILE=\"grub-core/lib/libgcrypt-grub/cipher/camellia.c\" -I. -I/var/tmp/portage/sys-boot/grub-2.00-r2/work/grub-2.00 -I. -I/var/tmp/portage/sys-boot/grub-2.00-r2/work/grub-2.00 -I/var/tmp/portage/sys-boot/grub-2.00-r2/work/grub-2.00/include -I./include  -I/var/tmp/portage/sys-boot/grub-2.00-r2/work/grub-2.00/grub-core/lib/libgcrypt_wrap                -Wall -W -Wshadow -Wold-style-definition -Wpointer-arith -Wundef -Wextra -Waddress -Wattributes -Wcast-align -Wchar-subscripts -Wcomment -Wdeprecated-declarations -Wdisabled-optimization -Wdiv-by-zero -Wempty-body -Wendif-labels -Wfloat-equal -Wformat-extra-args -Wformat-security -Wformat-y2k -Wimplicit -Wimplicit-function-declaration -Wimplicit-int -Winit-self -Wint-to-pointer-cast -Winvalid-pch -Wmain -Wmissing-braces -Wmissing-field-initializers -Wmissing-format-attribute -Wmissing-noreturn -Wmultichar -Wnonnull -Woverflow -Wparentheses -Wpointer-arith -Wpointer-to-int-cast -Wreturn-type -Wsequence-point -Wshadow -Wsign-compare -Wstrict-aliasing -Wswitch -Wtrigraphs -Wundef -Wunknown-pragmas -Wunused -Wunused-function -Wunused-label -Wunused-parameter -Wunused-value  -Wunused-variable -Wvariadic-macros -Wvolatile-register-var -Wwrite-strings -Wnested-externs -Wstrict-prototypes -Wpointer-sign  -Wno-error -Wno-missing-field-initializers               -c -o grub-core/lib/libgcrypt-grub/cipher/libgrubgcry_a-camellia.o `test -f 'grub-core/lib/libgcrypt-grub/cipher/camellia.c' || echo '/var/tmp/portage/sys-boot/grub-2.00-r2/work/grub-2.00/'`grub-core/lib/libgcrypt-grub/cipher/camellia.c
x86_64-pc-linux-gnu-gcc -DHAVE_CONFIG_H -I. -I/var/tmp/portage/sys-boot/grub-2.00-r2/work/grub-2.00   -Wall -W -I./include -DGRUB_UTIL=1 -DGRUB_LIBDIR=\"/usr/lib/grub\" -DLOCALEDIR=\"/usr/share/locale\" -DGRUB_FILE=\"grub-core/lib/libgcrypt-grub/cipher/seed.c\" -I. -I/var/tmp/portage/sys-boot/grub-2.00-r2/work/grub-2.00 -I. -I/var/tmp/portage/sys-boot/grub-2.00-r2/work/grub-2.00 -I/var/tmp/portage/sys-boot/grub-2.00-r2/work/grub-2.00/include -I./include  -I/var/tmp/portage/sys-boot/grub-2.00-r2/work/grub-2.00/grub-core/lib/libgcrypt_wrap                -Wall -W -Wshadow -Wold-style-definition -Wpointer-arith -Wundef -Wextra -Waddress -Wattributes -Wcast-align -Wchar-subscripts -Wcomment -Wdeprecated-declarations -Wdisabled-optimization -Wdiv-by-zero -Wempty-body -Wendif-labels -Wfloat-equal -Wformat-extra-args -Wformat-security -Wformat-y2k -Wimplicit -Wimplicit-function-declaration -Wimplicit-int -Winit-self -Wint-to-pointer-cast -Winvalid-pch -Wmain -Wmissing-braces -Wmissing-field-initializers -Wmissing-format-attribute -Wmissing-noreturn -Wmultichar -Wnonnull -Woverflow -Wparentheses -Wpointer-arith -Wpointer-to-int-cast -Wreturn-type -Wsequence-point -Wshadow -Wsign-compare -Wstrict-aliasing -Wswitch -Wtrigraphs -Wundef -Wunknown-pragmas -Wunused -Wunused-function -Wunused-label -Wunused-parameter -Wunused-value  -Wunused-variable -Wvariadic-macros -Wvolatile-register-var -Wwrite-strings -Wnested-externs -Wstrict-prototypes -Wpointer-sign  -Wno-error -Wno-missing-field-initializers               -c -o grub-core/lib/libgcrypt-grub/cipher/libgrubgcry_a-seed.o `test -f 'grub-core/lib/libgcrypt-grub/cipher/seed.c' || echo '/var/tmp/portage/sys-boot/grub-2.00-r2/work/grub-2.00/'`grub-core/lib/libgcrypt-grub/cipher/seed.c
x86_64-pc-linux-gnu-gcc -DHAVE_CONFIG_H -I. -I/var/tmp/portage/sys-boot/grub-2.00-r2/work/grub-2.00   -Wall -W -I./include -DGRUB_UTIL=1 -DGRUB_LIBDIR=\"/usr/lib/grub\" -DLOCALEDIR=\"/usr/share/locale\" -DGRUB_FILE=\"grub-core/lib/libgcrypt-grub/cipher/blowfish.c\" -I. -I/var/tmp/portage/sys-boot/grub-2.00-r2/work/grub-2.00 -I. -I/var/tmp/portage/sys-boot/grub-2.00-r2/work/grub-2.00 -I/var/tmp/portage/sys-boot/grub-2.00-r2/work/grub-2.00/include -I./include  -I/var/tmp/portage/sys-boot/grub-2.00-r2/work/grub-2.00/grub-core/lib/libgcrypt_wrap                -Wall -W -Wshadow -Wold-style-definition -Wpointer-arith -Wundef -Wextra -Waddress -Wattributes -Wcast-align -Wchar-subscripts -Wcomment -Wdeprecated-declarations -Wdisabled-optimization -Wdiv-by-zero -Wempty-body -Wendif-labels -Wfloat-equal -Wformat-extra-args -Wformat-security -Wformat-y2k -Wimplicit -Wimplicit-function-declaration -Wimplicit-int -Winit-self -Wint-to-pointer-cast -Winvalid-pch -Wmain -Wmissing-braces -Wmissing-field-initializers -Wmissing-format-attribute -Wmissing-noreturn -Wmultichar -Wnonnull -Woverflow -Wparentheses -Wpointer-arith -Wpointer-to-int-cast -Wreturn-type -Wsequence-point -Wshadow -Wsign-compare -Wstrict-aliasing -Wswitch -Wtrigraphs -Wundef -Wunknown-pragmas -Wunused -Wunused-function -Wunused-label -Wunused-parameter -Wunused-value  -Wunused-variable -Wvariadic-macros -Wvolatile-register-var -Wwrite-strings -Wnested-externs -Wstrict-prototypes -Wpointer-sign  -Wno-error -Wno-missing-field-initializers               -c -o grub-core/lib/libgcrypt-grub/cipher/libgrubgcry_a-blowfish.o `test -f 'grub-core/lib/libgcrypt-grub/cipher/blowfish.c' || echo '/var/tmp/portage/sys-boot/grub-2.00-r2/work/grub-2.00/'`grub-core/lib/libgcrypt-grub/cipher/blowfish.c
x86_64-pc-linux-gnu-gcc -DHAVE_CONFIG_H -I. -I/var/tmp/portage/sys-boot/grub-2.00-r2/work/grub-2.00   -Wall -W -I./include -DGRUB_UTIL=1 -DGRUB_LIBDIR=\"/usr/lib/grub\" -DLOCALEDIR=\"/usr/share/locale\" -DGRUB_FILE=\"grub-core/lib/libgcrypt-grub/cipher/md4.c\" -I. -I/var/tmp/portage/sys-boot/grub-2.00-r2/work/grub-2.00 -I. -I/var/tmp/portage/sys-boot/grub-2.00-r2/work/grub-2.00 -I/var/tmp/portage/sys-boot/grub-2.00-r2/work/grub-2.00/include -I./include  -I/var/tmp/portage/sys-boot/grub-2.00-r2/work/grub-2.00/grub-core/lib/libgcrypt_wrap                -Wall -W -Wshadow -Wold-style-definition -Wpointer-arith -Wundef -Wextra -Waddress -Wattributes -Wcast-align -Wchar-subscripts -Wcomment -Wdeprecated-declarations -Wdisabled-optimization -Wdiv-by-zero -Wempty-body -Wendif-labels -Wfloat-equal -Wformat-extra-args -Wformat-security -Wformat-y2k -Wimplicit -Wimplicit-function-declaration -Wimplicit-int -Winit-self -Wint-to-pointer-cast -Winvalid-pch -Wmain -Wmissing-braces -Wmissing-field-initializers -Wmissing-format-attribute -Wmissing-noreturn -Wmultichar -Wnonnull -Woverflow -Wparentheses -Wpointer-arith -Wpointer-to-int-cast -Wreturn-type -Wsequence-point -Wshadow -Wsign-compare -Wstrict-aliasing -Wswitch -Wtrigraphs -Wundef -Wunknown-pragmas -Wunused -Wunused-function -Wunused-label -Wunused-parameter -Wunused-value  -Wunused-variable -Wvariadic-macros -Wvolatile-register-var -Wwrite-strings -Wnested-externs -Wstrict-prototypes -Wpointer-sign  -Wno-error -Wno-missing-field-initializers               -c -o grub-core/lib/libgcrypt-grub/cipher/libgrubgcry_a-md4.o `test -f 'grub-core/lib/libgcrypt-grub/cipher/md4.c' || echo '/var/tmp/portage/sys-boot/grub-2.00-r2/work/grub-2.00/'`grub-core/lib/libgcrypt-grub/cipher/md4.c
x86_64-pc-linux-gnu-gcc -DHAVE_CONFIG_H -I. -I/var/tmp/portage/sys-boot/grub-2.00-r2/work/grub-2.00   -Wall -W -I./include -DGRUB_UTIL=1 -DGRUB_LIBDIR=\"/usr/lib/grub\" -DLOCALEDIR=\"/usr/share/locale\" -DGRUB_FILE=\"grub-core/lib/libgcrypt-grub/cipher/init.c\" -I. -I/var/tmp/portage/sys-boot/grub-2.00-r2/work/grub-2.00 -I. -I/var/tmp/portage/sys-boot/grub-2.00-r2/work/grub-2.00 -I/var/tmp/portage/sys-boot/grub-2.00-r2/work/grub-2.00/include -I./include  -I/var/tmp/portage/sys-boot/grub-2.00-r2/work/grub-2.00/grub-core/lib/libgcrypt_wrap                -Wall -W -Wshadow -Wold-style-definition -Wpointer-arith -Wundef -Wextra -Waddress -Wattributes -Wcast-align -Wchar-subscripts -Wcomment -Wdeprecated-declarations -Wdisabled-optimization -Wdiv-by-zero -Wempty-body -Wendif-labels -Wfloat-equal -Wformat-extra-args -Wformat-security -Wformat-y2k -Wimplicit -Wimplicit-function-declaration -Wimplicit-int -Winit-self -Wint-to-pointer-cast -Winvalid-pch -Wmain -Wmissing-braces -Wmissing-field-initializers -Wmissing-format-attribute -Wmissing-noreturn -Wmultichar -Wnonnull -Woverflow -Wparentheses -Wpointer-arith -Wpointer-to-int-cast -Wreturn-type -Wsequence-point -Wshadow -Wsign-compare -Wstrict-aliasing -Wswitch -Wtrigraphs -Wundef -Wunknown-pragmas -Wunused -Wunused-function -Wunused-label -Wunused-parameter -Wunused-value  -Wunused-variable -Wvariadic-macros -Wvolatile-register-var -Wwrite-strings -Wnested-externs -Wstrict-prototypes -Wpointer-sign  -Wno-error -Wno-missing-field-initializers               -c -o grub-core/lib/libgcrypt-grub/cipher/libgrubgcry_a-init.o `test -f 'grub-core/lib/libgcrypt-grub/cipher/init.c' || echo '/var/tmp/portage/sys-boot/grub-2.00-r2/work/grub-2.00/'`grub-core/lib/libgcrypt-grub/cipher/init.c
x86_64-pc-linux-gnu-gcc -DHAVE_CONFIG_H -I. -I/var/tmp/portage/sys-boot/grub-2.00-r2/work/grub-2.00  -Wall -W -I./include -DGRUB_UTIL=1 -DGRUB_LIBDIR=\"/usr/lib/grub\" -DLOCALEDIR=\"/usr/share/locale\" -DGRUB_FILE=\"grub-core/unidata.c\" -I. -I/var/tmp/portage/sys-boot/grub-2.00-r2/work/grub-2.00 -I. -I/var/tmp/portage/sys-boot/grub-2.00-r2/work/grub-2.00 -I/var/tmp/portage/sys-boot/grub-2.00-r2/work/grub-2.00/include -I./include -I./grub-core/gnulib -I/var/tmp/portage/sys-boot/grub-2.00-r2/work/grub-2.00/grub-core/gnulib   -Wall -W -Wshadow -Wold-style-definition -Wpointer-arith -Wundef -Wextra -Waddress -Wattributes -Wcast-align -Wchar-subscripts -Wcomment -Wdeprecated-declarations -Wdisabled-optimization -Wdiv-by-zero -Wempty-body -Wendif-labels -Wfloat-equal -Wformat-extra-args -Wformat-security -Wformat-y2k -Wimplicit -Wimplicit-function-declaration -Wimplicit-int -Winit-self -Wint-to-pointer-cast -Winvalid-pch -Wmain -Wmissing-braces -Wmissing-field-initializers -Wmissing-format-attribute -Wmissing-noreturn -Wmultichar -Wnonnull -Woverflow -Wparentheses -Wpointer-arith -Wpointer-to-int-cast -Wreturn-type -Wsequence-point -Wshadow -Wsign-compare -Wstrict-aliasing -Wswitch -Wtrigraphs -Wundef -Wunknown-pragmas -Wunused -Wunused-function -Wunused-label -Wunused-parameter -Wunused-value  -Wunused-variable -Wvariadic-macros -Wvolatile-register-var -Wwrite-strings -Wnested-externs -Wstrict-prototypes -Wpointer-sign -Wno-undef -Wno-sign-compare -Wno-unused -Wno-unused-parameter -Wno-redundant-decls -Wno-unreachable-code -Wno-conversion -Wno-old-style-definition -Wno-unsafe-loop-optimizations -I/usr/include/freetype2   -c -o grub-core/grub_mkfont-unidata.o `test -f 'grub-core/unidata.c' || echo '/var/tmp/portage/sys-boot/grub-2.00-r2/work/grub-2.00/'`grub-core/unidata.c
x86_64-pc-linux-gnu-gcc -DHAVE_CONFIG_H -I. -I/var/tmp/portage/sys-boot/grub-2.00-r2/work/grub-2.00  -Wall -W -I./include -DGRUB_UTIL=1 -DGRUB_LIBDIR=\"/usr/lib/grub\" -DLOCALEDIR=\"/usr/share/locale\" -DGRUB_FILE=\"grub-core/lib/i386/pc/vesa_modes_table.c\" -I. -I/var/tmp/portage/sys-boot/grub-2.00-r2/work/grub-2.00 -I. -I/var/tmp/portage/sys-boot/grub-2.00-r2/work/grub-2.00 -I/var/tmp/portage/sys-boot/grub-2.00-r2/work/grub-2.00/include -I./include -I./grub-core/gnulib -I/var/tmp/portage/sys-boot/grub-2.00-r2/work/grub-2.00/grub-core/gnulib   -Wall -W -Wshadow -Wold-style-definition -Wpointer-arith -Wundef -Wextra -Waddress -Wattributes -Wcast-align -Wchar-subscripts -Wcomment -Wdeprecated-declarations -Wdisabled-optimization -Wdiv-by-zero -Wempty-body -Wendif-labels -Wfloat-equal -Wformat-extra-args -Wformat-security -Wformat-y2k -Wimplicit -Wimplicit-function-declaration -Wimplicit-int -Winit-self -Wint-to-pointer-cast -Winvalid-pch -Wmain -Wmissing-braces -Wmissing-field-initializers -Wmissing-format-attribute -Wmissing-noreturn -Wmultichar -Wnonnull -Woverflow -Wparentheses -Wpointer-arith -Wpointer-to-int-cast -Wreturn-type -Wsequence-point -Wshadow -Wsign-compare -Wstrict-aliasing -Wswitch -Wtrigraphs -Wundef -Wunknown-pragmas -Wunused -Wunused-function -Wunused-label -Wunused-parameter -Wunused-value  -Wunused-variable -Wvariadic-macros -Wvolatile-register-var -Wwrite-strings -Wnested-externs -Wstrict-prototypes -Wpointer-sign -Wno-undef -Wno-sign-compare -Wno-unused -Wno-unused-parameter -Wno-redundant-decls -Wno-unreachable-code -Wno-conversion -Wno-old-style-definition -Wno-unsafe-loop-optimizations   -c -o grub-core/lib/i386/pc/grub_menulst2cfg-vesa_modes_table.o `test -f 'grub-core/lib/i386/pc/vesa_modes_table.c' || echo '/var/tmp/portage/sys-boot/grub-2.00-r2/work/grub-2.00/'`grub-core/lib/i386/pc/vesa_modes_table.c
x86_64-pc-linux-gnu-gcc -DHAVE_CONFIG_H -I. -I/var/tmp/portage/sys-boot/grub-2.00-r2/work/grub-2.00  -Wall -W -I./include -DGRUB_UTIL=1 -DGRUB_LIBDIR=\"/usr/lib/grub\" -DLOCALEDIR=\"/usr/share/locale\" -DGRUB_FILE=\"util/ieee1275/ofpath.c\" -I. -I/var/tmp/portage/sys-boot/grub-2.00-r2/work/grub-2.00 -I. -I/var/tmp/portage/sys-boot/grub-2.00-r2/work/grub-2.00 -I/var/tmp/portage/sys-boot/grub-2.00-r2/work/grub-2.00/include -I./include -I./grub-core/gnulib -I/var/tmp/portage/sys-boot/grub-2.00-r2/work/grub-2.00/grub-core/gnulib   -Wall -W -Wshadow -Wold-style-definition -Wpointer-arith -Wundef -Wextra -Waddress -Wattributes -Wcast-align -Wchar-subscripts -Wcomment -Wdeprecated-declarations -Wdisabled-optimization -Wdiv-by-zero -Wempty-body -Wendif-labels -Wfloat-equal -Wformat-extra-args -Wformat-security -Wformat-y2k -Wimplicit -Wimplicit-function-declaration -Wimplicit-int -Winit-self -Wint-to-pointer-cast -Winvalid-pch -Wmain -Wmissing-braces -Wmissing-field-initializers -Wmissing-format-attribute -Wmissing-noreturn -Wmultichar -Wnonnull -Woverflow -Wparentheses -Wpointer-arith -Wpointer-to-int-cast -Wreturn-type -Wsequence-point -Wshadow -Wsign-compare -Wstrict-aliasing -Wswitch -Wtrigraphs -Wundef -Wunknown-pragmas -Wunused -Wunused-function -Wunused-label -Wunused-parameter -Wunused-value  -Wunused-variable -Wvariadic-macros -Wvolatile-register-var -Wwrite-strings -Wnested-externs -Wstrict-prototypes -Wpointer-sign -Wno-undef -Wno-sign-compare -Wno-unused -Wno-unused-parameter -Wno-redundant-decls -Wno-unreachable-code -Wno-conversion -Wno-old-style-definition -Wno-unsafe-loop-optimizations   -c -o util/ieee1275/grub_probe-ofpath.o `test -f 'util/ieee1275/ofpath.c' || echo '/var/tmp/portage/sys-boot/grub-2.00-r2/work/grub-2.00/'`util/ieee1275/ofpath.c
chmod a+x grub-mkrescue
PATH=.:$PATH pkgdatadir=. /usr/bin/help2man --section=1 -i /var/tmp/portage/sys-boot/grub-2.00-r2/work/grub-2.00/docs/man/grub-mkrescue.h2m -o grub-mkrescue.1 grub-mkrescue
chmod a+x grub-mkstandalone
chmod a+x grub-install
PATH=.:$PATH pkgdatadir=. /usr/bin/help2man --section=1 -i /var/tmp/portage/sys-boot/grub-2.00-r2/work/grub-2.00/docs/man/grub-mkstandalone.h2m -o grub-mkstandalone.1 grub-mkstandalone
PATH=.:$PATH pkgdatadir=. /usr/bin/help2man --section=8 -i /var/tmp/portage/sys-boot/grub-2.00-r2/work/grub-2.00/docs/man/grub-install.h2m -o grub-install.8 grub-install
chmod a+x grub-mknetdir
PATH=.:$PATH pkgdatadir=. /usr/bin/help2man --section=8 -i /var/tmp/portage/sys-boot/grub-2.00-r2/work/grub-2.00/docs/man/grub-mknetdir.h2m -o grub-mknetdir.8 grub-mknetdir
chmod a+x grub-mkconfig
PATH=.:$PATH pkgdatadir=. /usr/bin/help2man --section=8 -i /var/tmp/portage/sys-boot/grub-2.00-r2/work/grub-2.00/docs/man/grub-mkconfig.h2m -o grub-mkconfig.8 grub-mkconfig
chmod a+x grub-set-default
PATH=.:$PATH pkgdatadir=. /usr/bin/help2man --section=8 -i /var/tmp/portage/sys-boot/grub-2.00-r2/work/grub-2.00/docs/man/grub-set-default.h2m -o grub-set-default.8 grub-set-default
help2man: can't get `--help' info from grub-install
Try `--no-discard-stderr' if option outputs to stderr
make[2]: *** [grub-install.8] Error 2
make[2]: *** Waiting for unfinished jobs....
make[2]: Leaving directory `/var/tmp/portage/sys-boot/grub-2.00-r2/work/build-pc'
make[1]: *** [all-recursive] Error 1
make[1]: Leaving directory `/var/tmp/portage/sys-boot/grub-2.00-r2/work/build-pc'
make: *** [all] Error 2
 * ERROR: sys-boot/grub-2.00-r2 failed (compile phase):
 *   emake failed
 *
 * If you need support, post the output of `emerge --info '=sys-boot/grub-2.00-r2'`,
 * the complete build log and the output of `emerge -pqv '=sys-boot/grub-2.00-r2'`.
 * The complete build log is located at '/var/tmp/portage/sys-boot/grub-2.00-r2/temp/build.log'.
 * The ebuild environment file is located at '/var/tmp/portage/sys-boot/grub-2.00-r2/temp/environment'.
 * Working directory: '/var/tmp/portage/sys-boot/grub-2.00-r2/work/build-pc'
 * S: '/var/tmp/portage/sys-boot/grub-2.00-r2/work/grub-2.00'

 * Messages for package sys-boot/grub-2.00-r2:

 * ERROR: sys-boot/grub-2.00-r2 failed (compile phase):
 *   emake failed
 *
 * If you need support, post the output of `emerge --info '=sys-boot/grub-2.00-r2'`,
 * the complete build log and the output of `emerge -pqv '=sys-boot/grub-2.00-r2'`.
 * The complete build log is located at '/var/tmp/portage/sys-boot/grub-2.00-r2/temp/build.log'.
 * The ebuild environment file is located at '/var/tmp/portage/sys-boot/grub-2.00-r2/temp/environment'.
 * Working directory: '/var/tmp/portage/sys-boot/grub-2.00-r2/work/build-pc'
 * S: '/var/tmp/portage/sys-boot/grub-2.00-r2/work/grub-2.00'
 *
 * The following package has failed to build or install:
 *
 *  (sys-boot/grub-2.00-r2::gentoo, ebuild scheduled for merge), Log file:
 *   '/var/tmp/portage/sys-boot/grub-2.00-r2/temp/build.log'
 *

_________________
War is Peace, Freedom is Slavery, Ignorance is Strength.
Back to top
View user's profile Send private message
eyoung100
Veteran
Veteran


Joined: 23 Jan 2004
Posts: 1406

PostPosted: Wed Mar 06, 2013 12:53 am    Post subject: Reply with quote

Try it with static enabled...
_________________
The Birth and Growth of Science is the Death and Atrophy of Art -- Unknown
Registerd Linux User #363735
Adopt a Post | Strip Comments| Emerge Wrapper
Back to top
View user's profile Send private message
shaman200
n00b
n00b


Joined: 29 Dec 2005
Posts: 30

PostPosted: Thu Mar 07, 2013 5:15 am    Post subject: Reply with quote

Hi,

Thanks for the suggestion , so I added the following:

Code:
(root@Corto):/etc/portage>>tail -1 package.use
sys-boot/grub static-libs


but it still fails, again in the same way... :cry:
_________________
War is Peace, Freedom is Slavery, Ignorance is Strength.
Back to top
View user's profile Send private message
Navar
Apprentice
Apprentice


Joined: 20 Aug 2012
Posts: 222

PostPosted: Thu Mar 07, 2013 8:44 am    Post subject: Reply with quote

Cross fingers and maybe give:
Code:
perl-cleaner --all
a try.

http://forums.gentoo.org/viewtopic-t-928578-start-0.html sheds some light and success by running perl-cleaner. I've also found a full update with emerge -avuND --with-bdeps=y @world will sometimes address same. If this does fix it, credit would go to NeddySeagoon.

This one abandoned all hope ye who enter here: http://forums.gentoo.org/viewtopic-t-948844-start-0.html and ran screaming to lilo.

And then there was this upstream bug report: http://savannah.gnu.org/bugs/index.php?35452 with a commit change which at cursory glance looks akin to the issue.

Grub1 is easier, Grub2 is nicer for some additional functionality, but otherwise a hassle until it gets more mature. I've not exposed myself to Grub2 via Gentoo, yet and last I knew Gentoo is still left holding the pre-nuptial agreement. Thing about bootloaders is you tend to set them up, back them up (because everything else tries to trash them) and leave well alone other than the configuration file they load.

Some crazy individuals who allow other unnamed distributions to also be installed yet are rather forceful in their approach of installing grub2, just let them install as the bootloader. It's trivial to manually add entries for Gentoo so why fight it. When that's not enough they put it on a USB stick with 10 or so other live ISOs integrated (which was an interesting challenge). Been a long time since I used lilo, simpler days with one OS at a time.
Back to top
View user's profile Send private message
shaman200
n00b
n00b


Joined: 29 Dec 2005
Posts: 30

PostPosted: Mon Mar 11, 2013 8:39 pm    Post subject: Reply with quote

Hello!

Thanks for the reply.

So i used the following:
Code:

emerge -avuND --with-bdeps=y @world
perl-cleaner
python-updater
lafilefixer --justfixit /usr/lib
revdep-rebuild


And in the end...it failed AGAIN for the same reason... :roll:

The strangest thing is that I use grub 2.00...and it's working fine, it just fails to update for no clear reason.

Then, thanks to Navar and the links on the upstream bug report on savannah, I saw something:

Code:

PATH=.:$PATH pkgdatadir=. /usr/bin/help2man --section=8 -i /var/tmp/portage/sys-boot/grub-2.00-r2/work/grub-2.00/docs/man/grub-set-default.h2m -o grub-set-default.8 grub-set-default
help2man: can't get `--help' info from grub-install
Try `--no-discard-stderr' if option outputs to stderr


I realized that I don't have any binary called grub-install (remember, i'm on grub 2.00 already), all my grub binary are grub2-something...

I created the following links:
Code:

(root@Corto):/usr/sbin>>ll grub-*
lrwxrwxrwx 1 root root 13 Mar 12 04:44 grub-install -> grub2-install
lrwxrwxrwx 1 root root 14 Mar 12 04:40 grub-mkconfig -> grub2-mkconfig


I was able to update!

Thanks for your help!!!
_________________
War is Peace, Freedom is Slavery, Ignorance is Strength.
Back to top
View user's profile Send private message
Navar
Apprentice
Apprentice


Joined: 20 Aug 2012
Posts: 222

PostPosted: Tue Mar 12, 2013 4:38 am    Post subject: Reply with quote

Nice find, I missed that. :)
Back to top
View user's profile Send private message
Display posts from previous:   
Reply to topic    Gentoo Forums Forum Index Installing Gentoo All times are GMT
Page 1 of 1

 
Jump to:  
You cannot post new topics in this forum
You cannot reply to topics in this forum
You cannot edit your posts in this forum
You cannot delete your posts in this forum
You cannot vote in polls in this forum