Gentoo Forums
Gentoo Forums
Gentoo Forums
Quick Search: in
Gnome 3.6: Can't emerge pygobject-3.4.2-r1
View unanswered posts
View posts from last 24 hours

 
Reply to topic    Gentoo Forums Forum Index Desktop Environments
View previous topic :: View next topic  
Author Message
Rukiri
n00b
n00b


Joined: 28 Oct 2011
Posts: 56

PostPosted: Sat Jan 19, 2013 5:40 am    Post subject: Gnome 3.6: Can't emerge pygobject-3.4.2-r1 Reply with quote

I'm having an issue with Pygobject, I have indeed searched for an answer but wasn't able to find one so I'm sucking it up and asking for help.

Code:
#[32;01m * #[39;49;00mPackage:    dev-python/pygobject-3.4.2-r1
#[32;01m * #[39;49;00mRepository: gentoo
#[32;01m * #[39;49;00mMaintainer: gnome@gentoo.org python@gentoo.org
#[32;01m * #[39;49;00mUSE:        amd64 cairo elibc_glibc kernel_linux python_targets_python2_7 python_targets_python3_2 threads userland_GNU
#[32;01m * #[39;49;00mFEATURES:   sandbox
>>> Unpacking source...
>>> Unpacking pygobject-3.4.2.tar.xz to /var/tmp/portage/dev-python/pygobject-3.4.2-r1/work
>>> Source unpacked in /var/tmp/portage/dev-python/pygobject-3.4.2-r1/work
>>> Preparing source in /var/tmp/portage/dev-python/pygobject-3.4.2-r1/work/pygobject-3.4.2 ...
 #[32;01m*#[0m Applying pygobject-3.4.1.1-make_check.patch ...
#[A#[72C #[34;01m[ #[32;01mok#[34;01m ]#[0m
 #[32;01m*#[0m Applying pygobject-3.4.2-run-tests-with-old-python.patch ...
#[A#[72C #[34;01m[ #[32;01mok#[34;01m ]#[0m
 #[32;01m*#[0m Running eautoreconf in '/var/tmp/portage/dev-python/pygobject-3.4.2-r1/work/pygobject-3.4.2' ...
 #[32;01m*#[0m Running libtoolize --install --copy --force --automake ...
#[A#[72C #[34;01m[ #[32;01mok#[34;01m ]#[0m
 #[32;01m*#[0m Running aclocal -I m4 ...
#[A#[72C #[34;01m[ #[32;01mok#[34;01m ]#[0m
 #[32;01m*#[0m Running autoconf ...
#[A#[72C #[34;01m[ #[32;01mok#[34;01m ]#[0m
 #[32;01m*#[0m Running autoheader ...
#[A#[72C #[34;01m[ #[32;01mok#[34;01m ]#[0m
 #[32;01m*#[0m Running automake --add-missing --copy ...
#[A#[72C #[34;01m[ #[32;01mok#[34;01m ]#[0m
 #[32;01m*#[0m Running elibtoolize in: pygobject-3.4.2/
 #[32;01m*#[0m   Applying portage/1.2.0 patch ...
 #[32;01m*#[0m   Applying sed/1.5.6 patch ...
 #[32;01m*#[0m   Applying as-needed/2.4.2 patch ...
 #[32;01m*#[0m Fixing OMF Makefiles ...
#[A#[72C #[34;01m[ #[32;01mok#[34;01m ]#[0m
 #[32;01m*#[0m Disabling deprecation warnings ...
#[A#[72C #[34;01m[ #[32;01mok#[34;01m ]#[0m
 #[32;01m*#[0m Will copy sources from /var/tmp/portage/dev-python/pygobject-3.4.2-r1/work/pygobject-3.4.2
 #[32;01m*#[0m python2_7: copying to /var/tmp/portage/dev-python/pygobject-3.4.2-r1/work/pygobject-3.4.2-python2_7
 #[32;01m*#[0m python3_2: copying to /var/tmp/portage/dev-python/pygobject-3.4.2-r1/work/pygobject-3.4.2-python3_2
>>> Source prepared.
>>> Configuring source in /var/tmp/portage/dev-python/pygobject-3.4.2-r1/work/pygobject-3.4.2 ...
 #[32;01m*#[0m python3.2: running run_in_build_dir gnome2_src_configure
 * econf: updating pygobject-3.4.2/config.guess with /usr/share/gnuconfig/config.guess
 * econf: updating pygobject-3.4.2/config.sub with /usr/share/gnuconfig/config.sub
 * econf: updating pygobject-3.4.2-python2_7/config.guess with /usr/share/gnuconfig/config.guess
 * econf: updating pygobject-3.4.2-python2_7/config.sub with /usr/share/gnuconfig/config.sub
 * econf: updating pygobject-3.4.2-python3_2/config.guess with /usr/share/gnuconfig/config.guess
 * econf: updating pygobject-3.4.2-python3_2/config.sub with /usr/share/gnuconfig/config.sub
./configure --prefix=/usr --build=x86_64-pc-linux-gnu --host=x86_64-pc-linux-gnu --mandir=/usr/share/man --infodir=/usr/share/info --datadir=/usr/share --sysconfdir=/etc --localstatedir=/var/lib --libdir=/usr/lib64 --disable-silent-rules --disable-dependency-tracking --disable-maintainer-mode --disable-dependency-tracking --with-ffi --enable-cairo --enable-thread
checking whether make supports nested variables... yes
checking for a BSD-compatible install... /usr/bin/install -c
checking whether build environment is sane... yes
checking for a thread-safe mkdir -p... /bin/mkdir -p
checking for gawk... gawk
checking whether make sets $(MAKE)... yes
checking whether to enable maintainer-specific portions of Makefiles... no
checking build system type... x86_64-pc-linux-gnu
checking host system type... x86_64-pc-linux-gnu
checking for some Win32 platform... no
checking for native Win32... no
checking how to print strings... printf
checking for style of include used by make... GNU
checking for x86_64-pc-linux-gnu-gcc... x86_64-pc-linux-gnu-gcc
checking whether the C compiler works... yes
checking for C compiler default output file name... a.out
checking for suffix of executables...
checking whether we are cross compiling... no
checking for suffix of object files... o
checking whether we are using the GNU C compiler... yes
checking whether x86_64-pc-linux-gnu-gcc accepts -g... yes
checking for x86_64-pc-linux-gnu-gcc option to accept ISO C89... none needed
checking dependency style of x86_64-pc-linux-gnu-gcc... none
checking for a sed that does not truncate output... /bin/sed
checking for grep that handles long lines and -e... /bin/grep
checking for egrep... /bin/grep -E
checking for fgrep... /bin/grep -F
checking for ld used by x86_64-pc-linux-gnu-gcc... /usr/x86_64-pc-linux-gnu/bin/ld
checking if the linker (/usr/x86_64-pc-linux-gnu/bin/ld) is GNU ld... yes
checking for BSD- or MS-compatible name lister (nm)... /usr/bin/nm -B
checking the name lister (/usr/bin/nm -B) interface... BSD nm
checking whether ln -s works... yes
checking the maximum length of command line arguments... 1572864
checking whether the shell understands some XSI constructs... yes
checking whether the shell understands "+="... yes
checking how to convert x86_64-pc-linux-gnu file names to x86_64-pc-linux-gnu format... func_convert_file_noop
checking how to convert x86_64-pc-linux-gnu file names to toolchain format... func_convert_file_noop
checking for /usr/x86_64-pc-linux-gnu/bin/ld option to reload object files... -r
checking for x86_64-pc-linux-gnu-objdump... objdump
checking how to recognize dependent libraries... pass_all
checking for x86_64-pc-linux-gnu-dlltool... dlltool
checking how to associate runtime and link libraries... printf %s\n
checking for x86_64-pc-linux-gnu-ar... x86_64-pc-linux-gnu-ar
checking for archiver @FILE support... @
checking for x86_64-pc-linux-gnu-strip... x86_64-pc-linux-gnu-strip
checking for x86_64-pc-linux-gnu-ranlib... x86_64-pc-linux-gnu-ranlib
checking command to parse /usr/bin/nm -B output from x86_64-pc-linux-gnu-gcc object... ok
checking for sysroot... no
checking for x86_64-pc-linux-gnu-mt... no
checking for mt... no
checking if : is a manifest tool... no
checking how to run the C preprocessor... x86_64-pc-linux-gnu-gcc -E
checking for ANSI C header files... yes
checking for sys/types.h... yes
checking for sys/stat.h... yes
checking for stdlib.h... yes
checking for string.h... yes
checking for memory.h... yes
checking for strings.h... yes
checking for inttypes.h... yes
checking for stdint.h... yes
checking for unistd.h... yes
checking for dlfcn.h... yes
checking for objdir... .libs
checking if x86_64-pc-linux-gnu-gcc supports -fno-rtti -fno-exceptions... no
checking for x86_64-pc-linux-gnu-gcc option to produce PIC... -fPIC -DPIC
checking if x86_64-pc-linux-gnu-gcc PIC flag -fPIC -DPIC works... yes
checking if x86_64-pc-linux-gnu-gcc static flag -static works... yes
checking if x86_64-pc-linux-gnu-gcc supports -c -o file.o... yes
checking if x86_64-pc-linux-gnu-gcc supports -c -o file.o... (cached) yes
checking whether the x86_64-pc-linux-gnu-gcc linker (/usr/x86_64-pc-linux-gnu/bin/ld -m elf_x86_64) supports shared libraries... yes
checking whether -lc should be explicitly linked in... no
checking dynamic linker characteristics... GNU/Linux ld.so
checking how to hardcode library paths into programs... immediate
checking whether stripping libraries is possible... yes
checking if libtool supports shared libraries... yes
checking whether to build shared libraries... yes
checking whether to build static libraries... no
configure: creating ./config.lt
config.lt: creating libtool
checking for library containing strerror... none required
checking for x86_64-pc-linux-gnu-gcc... (cached) x86_64-pc-linux-gnu-gcc
checking whether we are using the GNU C compiler... (cached) yes
checking whether x86_64-pc-linux-gnu-gcc accepts -g... (cached) yes
checking for x86_64-pc-linux-gnu-gcc option to accept ISO C89... (cached) none needed
checking dependency style of x86_64-pc-linux-gnu-gcc... (cached) none
checking for x86_64-pc-linux-gnu-gcc... (cached) x86_64-pc-linux-gnu-gcc
checking whether we are using the GNU C compiler... (cached) yes
checking whether x86_64-pc-linux-gnu-gcc accepts -g... (cached) yes
checking for x86_64-pc-linux-gnu-gcc option to accept ISO C89... (cached) none needed
checking dependency style of x86_64-pc-linux-gnu-gcc... (cached) none
checking whether x86_64-pc-linux-gnu-gcc and cc understand -c and -o together... yes
checking whether /usr/bin/python3.2 version >= 2.6... yes
checking for /usr/bin/python3.2 version... 3.2
checking for /usr/bin/python3.2 platform... linux2
checking for /usr/bin/python3.2 script directory... ${prefix}/lib64/python3.2/site-packages
checking for /usr/bin/python3.2 extension module directory... ${exec_prefix}/lib64/python3.2/site-packages
checking for /usr/bin/python3.2 >= 3.1... yes
checking for python version... (cached) 3.2
checking for python platform... (cached) linux2
checking for python script directory... (cached) ${prefix}/lib64/python3.2/site-packages
checking for python extension module directory... (cached) ${exec_prefix}/lib64/python3.2/site-packages
checking for headers required to compile python extensions... found
checking for PySignal_SetWakeupFd in Python.h... no
checking for python module thread... no
checking for python module _thread... yes
checking whether to enable threading in pygobject... yes
checking for x86_64-pc-linux-gnu-pkg-config... no
checking for pkg-config... /usr/bin/pkg-config
checking pkg-config is at least version 0.16... yes
checking for GLIB - version >= 2.31.0... yes (version 2.34.3)
checking for ffi... checking for FFI... yes
checking for GIO... yes
checking for GI... yes
checking for CAIRO... yes
checking for PYCAIRO... yes
checking whether x86_64-pc-linux-gnu-gcc understands -Wall... yes
checking whether x86_64-pc-linux-gnu-gcc understands -Werror=implicit-function-declaration...
 yes
checking whether x86_64-pc-linux-gnu-gcc understands -Werror=pointer-arith... yes
checking whether x86_64-pc-linux-gnu-gcc understands -Werror=format-security... yes
checking whether x86_64-pc-linux-gnu-gcc understands -Werror=missing-include-dirs... yes
checking whether x86_64-pc-linux-gnu-gcc understands -Werror=format... yes
checking whether x86_64-pc-linux-gnu-gcc understands -fno-strict-aliasing... yes
checking whether x86_64-pc-linux-gnu-gcc understands -std=c9x... yes
configure: creating ./config.status
config.status: creating Makefile
config.status: creating pygobject-3.0.pc
config.status: creating pygobject-3.0-uninstalled.pc
config.status: creating gi/Makefile
config.status: creating gi/repository/Makefile
config.status: creating gi/overrides/Makefile
config.status: creating gi/_glib/Makefile
config.status: creating gi/_gobject/Makefile
config.status: creating examples/Makefile
config.status: creating tests/Makefile
config.status: creating PKG-INFO
config.status: creating config.h
config.status: executing depfiles commands
config.status: executing libtool commands

libffi support: yes

 #[32;01m*#[0m python2.7: running run_in_build_dir gnome2_src_configure
 * econf: updating pygobject-3.4.2/config.guess with /usr/share/gnuconfig/config.guess
 * econf: updating pygobject-3.4.2/config.sub with /usr/share/gnuconfig/config.sub
 * econf: updating pygobject-3.4.2-python2_7/config.guess with /usr/share/gnuconfig/config.guess
 * econf: updating pygobject-3.4.2-python2_7/config.sub with /usr/share/gnuconfig/config.sub
 * econf: updating pygobject-3.4.2-python3_2/config.guess with /usr/share/gnuconfig/config.guess
 * econf: updating pygobject-3.4.2-python3_2/config.sub with /usr/share/gnuconfig/config.sub
./configure --prefix=/usr --build=x86_64-pc-linux-gnu --host=x86_64-pc-linux-gnu --mandir=/usr/share/man --infodir=/usr/share/info --datadir=/usr/share --sysconfdir=/etc --localstatedir=/var/lib --libdir=/usr/lib64 --disable-silent-rules --disable-dependency-tracking --disable-maintainer-mode --disable-maintainer-mode --disable-dependency-tracking --with-ffi --enable-cairo --enable-thread
checking whether make supports nested variables... yes
checking for a BSD-compatible install... /usr/bin/install -c
checking whether build environment is sane... yes
checking for a thread-safe mkdir -p... /bin/mkdir -p
checking for gawk... gawk
checking whether make sets $(MAKE)... yes
checking whether to enable maintainer-specific portions of Makefiles... no
checking build system type... x86_64-pc-linux-gnu
checking host system type... x86_64-pc-linux-gnu
checking for some Win32 platform... no
checking for native Win32... no
checking how to print strings... printf
checking for style of include used by make... GNU
checking for x86_64-pc-linux-gnu-gcc... x86_64-pc-linux-gnu-gcc
checking whether the C compiler works... yes
checking for C compiler default output file name... a.out
checking for suffix of executables...
checking whether we are cross compiling... no
checking for suffix of object files... o
checking whether we are using the GNU C compiler... yes
checking whether x86_64-pc-linux-gnu-gcc accepts -g... yes
checking for x86_64-pc-linux-gnu-gcc option to accept ISO C89... none needed
checking dependency style of x86_64-pc-linux-gnu-gcc... none
checking for a sed that does not truncate output... /bin/sed
checking for grep that handles long lines and -e... /bin/grep
checking for egrep... /bin/grep -E
checking for fgrep... /bin/grep -F
checking for ld used by x86_64-pc-linux-gnu-gcc... /usr/x86_64-pc-linux-gnu/bin/ld
checking if the linker (/usr/x86_64-pc-linux-gnu/bin/ld) is GNU ld... yes
checking for BSD- or MS-compatible name lister (nm)... /usr/bin/nm -B
checking the name lister (/usr/bin/nm -B) interface... BSD nm
checking whether ln -s works... yes
checking the maximum length of command line arguments... 1572864
checking whether the shell understands some XSI constructs... yes
checking whether the shell understands "+="... yes
checking how to convert x86_64-pc-linux-gnu file names to x86_64-pc-linux-gnu format... func_convert_file_noop
checking how to convert x86_64-pc-linux-gnu file names to toolchain format... func_convert_file_noop
checking for /usr/x86_64-pc-linux-gnu/bin/ld option to reload object files... -r
checking for x86_64-pc-linux-gnu-objdump... objdump
checking how to recognize dependent libraries... pass_all
checking for x86_64-pc-linux-gnu-dlltool... dlltool
checking how to associate runtime and link libraries... printf %s\n
checking for x86_64-pc-linux-gnu-ar... x86_64-pc-linux-gnu-ar
checking for archiver @FILE support... @
checking for x86_64-pc-linux-gnu-strip... x86_64-pc-linux-gnu-strip
checking for x86_64-pc-linux-gnu-ranlib... x86_64-pc-linux-gnu-ranlib
checking command to parse /usr/bin/nm -B output from x86_64-pc-linux-gnu-gcc object... ok
checking for sysroot... no
checking for x86_64-pc-linux-gnu-mt... no
checking for mt... no
checking if : is a manifest tool... no
checking how to run the C preprocessor... x86_64-pc-linux-gnu-gcc -E
checking for ANSI C header files... yes
checking for sys/types.h... yes
checking for sys/stat.h... yes
checking for stdlib.h... yes
checking for string.h... yes
checking for memory.h... yes
checking for strings.h... yes
checking for inttypes.h... yes
checking for stdint.h... yes
checking for unistd.h... yes
checking for dlfcn.h... yes
checking for objdir... .libs
checking if x86_64-pc-linux-gnu-gcc supports -fno-rtti -fno-exceptions... no
checking for x86_64-pc-linux-gnu-gcc option to produce PIC... -fPIC -DPIC
checking if x86_64-pc-linux-gnu-gcc PIC flag -fPIC -DPIC works... yes
checking if x86_64-pc-linux-gnu-gcc static flag -static works... yes
checking if x86_64-pc-linux-gnu-gcc supports -c -o file.o... yes
checking if x86_64-pc-linux-gnu-gcc supports -c -o file.o... (cached) yes
checking whether the x86_64-pc-linux-gnu-gcc linker (/usr/x86_64-pc-linux-gnu/bin/ld -m elf_x86_64) supports shared libraries... yes
checking whether -lc should be explicitly linked in... no
checking dynamic linker characteristics... GNU/Linux ld.so
checking how to hardcode library paths into programs... immediate
checking whether stripping libraries is possible... yes
checking if libtool supports shared libraries... yes
checking whether to build shared libraries... yes
checking whether to build static libraries... no
configure: creating ./config.lt
config.lt: creating libtool
checking for library containing strerror... none required
checking for x86_64-pc-linux-gnu-gcc... (cached) x86_64-pc-linux-gnu-gcc
checking whether we are using the GNU C compiler... (cached) yes
checking whether x86_64-pc-linux-gnu-gcc accepts -g... (cached) yes
checking for x86_64-pc-linux-gnu-gcc option to accept ISO C89... (cached) none needed
checking dependency style of x86_64-pc-linux-gnu-gcc... (cached) none
checking for x86_64-pc-linux-gnu-gcc... (cached) x86_64-pc-linux-gnu-gcc
checking whether we are using the GNU C compiler... (cached) yes
checking whether x86_64-pc-linux-gnu-gcc accepts -g... (cached) yes
checking for x86_64-pc-linux-gnu-gcc option to accept ISO C89... (cached) none needed
checking dependency style of x86_64-pc-linux-gnu-gcc... (cached) none
checking whether x86_64-pc-linux-gnu-gcc and cc understand -c and -o together... yes
checking whether /usr/bin/python2.7 version >= 2.6... yes
checking for /usr/bin/python2.7 version... 2.7
checking for /usr/bin/python2.7 platform... linux2
checking for /usr/bin/python2.7 script directory... ${prefix}/lib64/python2.7/site-packages
checking for /usr/bin/python2.7 extension module directory... ${exec_prefix}/lib64/python2.7/site-packages
checking for python version... (cached) 2.7
checking for python platform... (cached) linux2
checking for python script directory... (cached) ${prefix}/lib64/python2.7/site-packages
checking for python extension module directory... (cached) ${exec_prefix}/lib64/python2.7/site-packages
checking for headers required to compile python extensions... found
checking for PySignal_SetWakeupFd in Python.h... no
checking for python module thread... yes
checking whether to enable threading in pygobject... yes
checking for x86_64-pc-linux-gnu-pkg-config... no
checking for pkg-config... /usr/bin/pkg-config
checking pkg-config is at least version 0.16... yes
checking for GLIB - version >= 2.31.0... yes (version 2.34.3)
checking for ffi... checking for FFI... yes
checking for GIO... yes
checking for GI... yes
checking for CAIRO... yes
checking for PYCAIRO... yes
checking whether x86_64-pc-linux-gnu-gcc understands -Wall... yes
checking whether x86_64-pc-linux-gnu-gcc understands -Werror=implicit-function-declaration... yes
checking whether x86_64-pc-linux-gnu-gcc understands -Werror=pointer-arith... yes
checking whether x86_64-pc-linux-gnu-gcc understands -Werror=format-security... yes
checking whether x86_64-pc-linux-gnu-gcc understands -Werror=missing-include-dirs... yes
checking whether x86_64-pc-linux-gnu-gcc understands -Werror=format... yes
checking whether x86_64-pc-linux-gnu-gcc understands -fno-strict-aliasing... yes
checking whether x86_64-pc-linux-gnu-gcc understands -std=c9x... yes
configure: creating ./config.status
config.status: creating Makefile
config.status: creating pygobject-3.0.pc
config.status: creating pygobject-3.0-uninstalled.pc
config.status: creating gi/Makefile
config.status: creating gi/repository/Makefile
config.status: creating gi/overrides/Makefile
config.status: creating gi/_glib/Makefile
config.status: creating gi/_gobject/Makefile
config.status: creating examples/Makefile
config.status: creating tests/Makefile
config.status: creating PKG-INFO
config.status: creating config.h
config.status: executing depfiles commands
config.status: executing libtool commands

libffi support: yes

>>> Source configured.
>>> Compiling source in /var/tmp/portage/dev-python/pygobject-3.4.2-r1/work/pygobject-3.4.2
 ...
 #[32;01m*#[0m python3.2: running run_in_build_dir gnome2_src_compile
make -j9
make  all-recursive
make[1]: Entering directory `/var/tmp/portage/dev-python/pygobject-3.4.2-r1/work/pygobject-3.4.2-python3_2'
Making all in examples
make[2]: Entering directory `/var/tmp/portage/dev-python/pygobject-3.4.2-r1/work/pygobject-3.4.2-python3_2/examples'
make[2]: Nothing to be done for `all'.
make[2]: Leaving directory `/var/tmp/portage/dev-python/pygobject-3.4.2-r1/work/pygobject-3.4.2-python3_2/examples'
Making all in gi
make[2]: Entering directory `/var/tmp/portage/dev-python/pygobject-3.4.2-r1/work/pygobject-3.4.2-python3_2/gi'
Making all in repository
make[3]: Entering directory `/var/tmp/portage/dev-python/pygobject-3.4.2-r1/work/pygobject-3.4.2-python3_2/gi/repository'
for f in __init__.py; do \
    [ -e ./$f ] || ln -s ./$f ./$f; \
done
make[3]: Leaving directory `/var/tmp/portage/dev-python/pygobject-3.4.2-r1/work/pygobject-3.4.2-python3_2/gi/repository'
Making all in overrides
make[3]: Entering directory `/var/tmp/portage/dev-python/pygobject-3.4.2-r1/work/pygobject-3.4.2-python3_2/gi/overrides'
for f in GLib.py Gtk.py Gdk.py Gio.py GIMarshallingTests.py Pango.py keysyms.py __init__.py; do \
    [ -e ./$f ] || ln -s ./$f ./$f; \
done
make[3]: Leaving directory `/var/tmp/portage/dev-python/pygobject-3.4.2-r1/work/pygobject-3.4.2-python3_2/gi/overrides'
Making all in _glib
make[3]: Entering directory `/var/tmp/portage/dev-python/pygobject-3.4.2-r1/work/pygobject-3.4.2-python3_2/gi/_glib'
/bin/sh ../../libtool  --tag=CC   --mode=compile x86_64-pc-linux-gnu-gcc -DHAVE_CONFIG_H -I. -I../..  -I/usr/include/python3.2 -I/usr/include/python3.2 -DPY_SSIZE_T_CLEAN  -pthread -I/usr/include/glib-2.0 -I/usr/lib64/glib-2.0/include   -march=native -O2 -pipe -Wall -Werror=implicit-function-declaration -Werror=pointer-arith -Werror=format-security -Werror=missing-include-dirs -Werror=format -fno-strict-aliasing -std=c9x -c -o libpyglib_gi_2_0_python3.2_la-pyglib.lo `test -f 'pyglib.c' || echo './'`pyglib.c
/bin/sh ../../libtool  --tag=CC   --mode=compile x86_64-pc-linux-gnu-gcc -DHAVE_CONFIG_H -I. -I../..  -I/usr/include/python3.2 -I/usr/include/python3.2 -DPY_SSIZE_T_CLEAN  -pthread -I/usr/include/glib-2.0 -I/usr/lib64/glib-2.0/include    -march=native -O2 -pipe -Wall -Werror=implicit-function-declaration -Werror=pointer-arith -Werror=format-security -Werror=missing-include-dirs -Werror=format -fno-strict-aliasing -std=c9x -c -o _glib_la-glibmodule.lo `test -f 'glibmodule.c' || echo './'`glibmodule.c
/bin/sh ../../libtool  --tag=CC   --mode=compile x86_64-pc-linux-gnu-gcc -DHAVE_CONFIG_H -I. -I../..  -I/usr/include/python3.2 -I/usr/include/python3.2 -DPY_SSIZE_T_CLEAN  -pthread -I/usr/include/glib-2.0 -I/usr/lib64/glib-2.0/include    -march=native -O2 -pipe -Wall -Werror=implicit-function-declaration -Werror=pointer-arith -Werror=format-security -Werror=missing-include-dirs -Werror=format -fno-strict-aliasing -std=c9x -c -o _glib_la-pygiochannel.lo `test -f 'pygiochannel.c' || echo './'`pygiochannel.c
/bin/sh ../../libtool  --tag=CC   --mode=compile x86_64-pc-linux-gnu-gcc -DHAVE_CONFIG_H -I. -I../..  -I/usr/include/python3.2 -I/usr/include/python3.2 -DPY_SSIZE_T_CLEAN  -pthread -I/usr/include/glib-2.0 -I/usr/lib64/glib-2.0/include    -march=native -O2 -pipe -Wall -Werror=implicit-function-declaration -Werror=pointer-arith -Werror=format-security -Werror=missing-include-dirs -Werror=format -fno-strict-aliasing -std=c9x -c -o _glib_la-pygoptioncontext.lo `test -f 'pygoptioncontext.c' || echo './'`pygoptioncontext.c
/bin/sh ../../libtool  --tag=CC   --mode=compile x86_64-pc-linux-gnu-gcc -DHAVE_CONFIG_H -I. -I../..  -I/usr/include/python3.2 -I/usr/include/python3.2 -DPY_SSIZE_T_CLEAN  -pthread -I/usr/include/glib-2.0 -I/usr/lib64/glib-2.0/include    -march=native -O2 -pipe -Wall -Werror=implicit-function-declaration -Werror=pointer-arith -Werror=format-security -Werror=missing-include-dirs -Werror=format -fno-strict-aliasing -std=c9x -c -o _glib_la-pygoptiongroup.lo `test -f 'pygoptiongroup.c' || echo './'`pygoptiongroup.c
/bin/sh ../../libtool  --tag=CC   --mode=compile x86_64-pc-linux-gnu-gcc -DHAVE_CONFIG_H -I. -I../..  -I/usr/include/python3.2 -I/usr/include/python3.2 -DPY_SSIZE_T_CLEAN  -pthread -I/usr/include/glib-2.0 -I/usr/lib64/glib-2.0/include    -march=native -O2 -pipe -Wall -Werror=implicit-function-declaration -Werror=pointer-arith -Werror=format-security -Werror=missing-include-dirs -Werror=format -fno-strict-aliasing -std=c9x -c -o _glib_la-pygmaincontext.lo `test -f 'pygmaincontext.c' || echo './'`pygmaincontext.c
/bin/sh ../../libtool  --tag=CC   --mode=compile x86_64-pc-linux-gnu-gcc -DHAVE_CONFIG_H -I. -I../..  -I/usr/include/python3.2 -I/usr/include/python3.2 -DPY_SSIZE_T_CLEAN  -pthread -I/usr/include/glib-2.0 -I/usr/lib64/glib-2.0/include    -march=native -O2 -pipe -Wall -Werror=implicit-function-declaration -Werror=pointer-arith -Werror=format-security -Werror=missing-include-dirs -Werror=format -fno-strict-aliasing -std=c9x -c -o _glib_la-pygmainloop.lo `test -f 'pygmainloop.c' || echo './'`pygmainloop.c
/bin/sh ../../libtool  --tag=CC   --mode=compile x86_64-pc-linux-gnu-gcc -DHAVE_CONFIG_H -I. -I../..  -I/usr/include/python3.2 -I/usr/include/python3.2 -DPY_SSIZE_T_CLEAN  -pthread -I/usr/include/glib-2.0 -I/usr/lib64/glib-2.0/include    -march=native -O2 -pipe -Wall -Werror=implicit-function-declaration -Werror=pointer-arith -Werror=format-security -Werror=missing-include-dirs -Werror=format -fno-strict-aliasing -std=c9x -c -o _glib_la-pygsource.lo `test -f 'pygsource.c' || echo './'`pygsource.c
/bin/sh ../../libtool  --tag=CC   --mode=compile x86_64-pc-linux-gnu-gcc -DHAVE_CONFIG_H -I. -I../..  -I/usr/include/python3.2 -I/usr/include/python3.2 -DPY_SSIZE_T_CLEAN  -pthread -I/usr/include/glib-2.0 -I/usr/lib64/glib-2.0/include    -march=native -O2 -pipe -Wall -Werror=implicit-function-declaration -Werror=pointer-arith -Werror=format-security -Werror=missing-include-dirs -Werror=format -fno-strict-aliasing -std=c9x -c -o _glib_la-pygspawn.lo `test -f 'pygspawn.c' || echo './'`pygspawn.c
libtool: compile:  x86_64-pc-linux-gnu-gcc -DHAVE_CONFIG_H -I. -I../.. -I/usr/include/python3.2 -I/usr/include/python3.2 -DPY_SSIZE_T_CLEAN -pthread -I/usr/include/glib-2.0 -I/usr/lib64/glib-2.0/include -march=native -O2 -pipe -Wall -Werror=implicit-function-declaration -Werror=pointer-arith -Werror=format-security -Werror=missing-include-dirs -Werror=format -fno-strict-aliasing -std=c9x -c pygiochannel.c  -fPIC -DPIC -o .libs/_glib_la-pygiochannel.o
libtool: compile:  x86_64-pc-linux-gnu-gcc -DHAVE_CONFIG_H -I. -I../.. -I/usr/include/python3.2 -I/usr/include/python3.2 -DPY_SSIZE_T_CLEAN -pthread -I/usr/include/glib-2.0 -I/usr/lib64/glib-2.0/include -march=native -O2 -pipe -Wall -Werror=implicit-function-declaration -Werror=pointer-arith -Werror=format-security -Werror=missing-include-dirs -Werror=format -fno-strict-aliasing -std=c9x -c pygoptiongroup.c  -fPIC -DPIC -o .libs/_glib_la-pygoptiongroup.o
libtool: compile:  x86_64-pc-linux-gnu-gcc -DHAVE_CONFIG_H -I. -I../.. -I/usr/include/python3.2 -I/usr/include/python3.2 -DPY_SSIZE_T_CLEAN -pthread -I/usr/include/glib-2.0 -I/usr/lib64/glib-2.0/include -march=native -O2 -pipe -Wall -Werror=implicit-function-declaration -Werror=pointer-arith -Werror=format-security -Werror=missing-include-dirs -Werror=format -fno-strict-aliasing -std=c9x -c pyglib.c  -fPIC -DPIC -o .libs/libpyglib_gi_2_0_python3.2_la-pyglib.o
libtool: compile:  x86_64-pc-linux-gnu-gcc -DHAVE_CONFIG_H -I. -I../.. -I/usr/include/python3.2 -I/usr/include/python3.2 -DPY_SSIZE_T_CLEAN -pthread -I/usr/include/glib-2.0 -I/usr/lib64/glib-2.0/include -march=native -O2 -pipe -Wall -Werror=implicit-function-declaration -Werror=pointer-arith -Werror=format-security -Werror=missing-include-dirs -Werror=format -fno-strict-aliasing -std=c9x -c pygsource.c  -fPIC -DPIC -o .libs/_glib_la-pygsource.o
libtool: compile:  x86_64-pc-linux-gnu-gcc -DHAVE_CONFIG_H -I. -I../.. -I/usr/include/python3.2 -I/usr/include/python3.2 -DPY_SSIZE_T_CLEAN -pthread -I/usr/include/glib-2.0 -I/usr/lib64/glib-2.0/include -march=native -O2 -pipe -Wall -Werror=implicit-function-declaration -Werror=pointer-arith -Werror=format-security -Werror=missing-include-dirs -Werror=format -fno-strict-aliasing -std=c9x -c pygoptioncontext.c  -fPIC -DPIC -o .libs/_glib_la-pygoptioncontext.o
libtool: compile:  x86_64-pc-linux-gnu-gcc -DHAVE_CONFIG_H -I. -I../.. -I/usr/include/python3.2 -I/usr/include/python3.2 -DPY_SSIZE_T_CLEAN -pthread -I/usr/include/glib-2.0 -I/usr/lib64/glib-2.0/include -march=native -O2 -pipe -Wall -Werror=implicit-function-declaration -Werror=pointer-arith -Werror=format-security -Werror=missing-include-dirs -Werror=format -fno-strict-aliasing -std=c9x -c glibmodule.c  -fPIC -DPIC -o .libs/_glib_la-glibmodule.o
libtool: compile:  x86_64-pc-linux-gnu-gcc -DHAVE_CONFIG_H -I. -I../.. -I/usr/include/python3.2 -I/usr/include/python3.2 -DPY_SSIZE_T_CLEAN -pthread -I/usr/include/glib-2.0 -I/usr/lib64/glib-2.0/include -march=native -O2 -pipe -Wall -Werror=implicit-function-declaration -Werror=pointer-arith -Werror=format-security -Werror=missing-include-dirs -Werror=format -fno-strict-aliasing -std=c9x -c pygmaincontext.c  -fPIC -DPIC -o .libs/_glib_la-pygmaincontext.o
libtool: compile:  x86_64-pc-linux-gnu-gcc -DHAVE_CONFIG_H -I. -I../.. -I/usr/include/python3.2 -I/usr/include/python3.2 -DPY_SSIZE_T_CLEAN -pthread -I/usr/include/glib-2.0 -I/usr/lib64/glib-2.0/include -march=native -O2 -pipe -Wall -Werror=implicit-function-declaration -Werror=pointer-arith -Werror=format-security -Werror=missing-include-dirs -Werror=format -fno-strict-aliasing -std=c9x -c pygmainloop.c  -fPIC -DPIC -o .libs/_glib_la-pygmainloop.o
libtool: compile:  x86_64-pc-linux-gnu-gcc -DHAVE_CONFIG_H -I. -I../.. -I/usr/include/python3.2 -I/usr/include/python3.2 -DPY_SSIZE_T_CLEAN
 -pthread -I/usr/include/glib-2.0 -I/usr/lib64/glib-2.0/include -march=native -O2 -pipe -Wall -Werror=implicit-function-declaration -Werror=pointer-arith -Werror=format-security -Werror=missing-include-dirs -Werror=format -fno-strict-aliasing -std=c9x -c pygspawn.c  -fPIC -DPIC -o .libs/_glib_la-pygspawn.o
In file included from /usr/include/python3.2/Python.h:111:0,
                 from pygmainloop.c:29:
/usr/include/python3.2/modsupport.h:27:1: error: '_PyArg_ParseTuple_SizeT' is an unrecognized format function type [-Werror=format=]
 PyAPI_FUNC(int) PyArg_ParseTuple(PyObject *, const char *, ...) Py_FORMAT_PARSE
 ^
In file included from /usr/include/python3.2/Python.h:111:0,
                 from ./pyglib.h:25,
                 from pygoptiongroup.c:27:
/usr/include/python3.2/modsupport.h:27:1: error: '_PyArg_ParseTuple_SizeT' is an unrecognized format function type [-Werror=format=]
 PyAPI_FUNC(int) PyArg_ParseTuple(PyObject *, const char *, ...) Py_FORMAT_PARSE
 ^
In file included from /usr/include/python3.2/Python.h:111:0,
                 from pyglib.c:26:
/usr/include/python3.2/modsupport.h:27:1: error: '_PyArg_ParseTuple_SizeT' is an unrecognized format function type [-Werror=format=]
 PyAPI_FUNC(int) PyArg_ParseTuple(PyObject *, const char *, ...) Py_FORMAT_PARSE
 ^
In file included from /usr/include/python3.2/Python.h:111:0,
                 from pygiochannel.c:7:
/usr/include/python3.2/modsupport.h:27:1: error: '_PyArg_ParseTuple_SizeT' is an unrecognized format function type [-Werror=format=]
 PyAPI_FUNC(int) PyArg_ParseTuple(PyObject *, const char *, ...) Py_FORMAT_PARSE
 ^
In file included from /usr/include/python3.2/Python.h:111:0,
                 from glibmodule.c:28:
/usr/include/python3.2/modsupport.h:27:1: error: '_PyArg_ParseTuple_SizeT' is an unrecognized format function type [-Werror=format=]
 PyAPI_FUNC(int) PyArg_ParseTuple(PyObject *, const char *, ...) Py_FORMAT_PARSE
 ^
In file included from /usr/include/python3.2/Python.h:111:0,
                 from pygmaincontext.c:27:
/usr/include/python3.2/modsupport.h:27:1: error: '_PyArg_ParseTuple_SizeT' is an unrecognized format function type [-Werror=format=]
 PyAPI_FUNC(int) PyArg_ParseTuple(PyObject *, const char *, ...) Py_FORMAT_PARSE
 ^
In file included from /usr/include/python3.2/Python.h:111:0,
                 from pygspawn.c:24:
/usr/include/python3.2/modsupport.h:27:1: error: '_PyArg_ParseTuple_SizeT' is an unrecognized format function type [-Werror=format=]
 PyAPI_FUNC(int) PyArg_ParseTuple(PyObject *, const char *, ...) Py_FORMAT_PARSE
 ^
In file included from /usr/include/python3.2/Python.h:111:0,
                 from pygsource.c:30:
/usr/include/python3.2/modsupport.h:27:1: error: '_PyArg_ParseTuple_SizeT' is an unrecognized format function type [-Werror=format=]
 PyAPI_FUNC(int) PyArg_ParseTuple(PyObject *, const char *, ...) Py_FORMAT_PARSE
 ^
cc1: some warnings being treated as errors
pygmainloop.c:38:12: warning: 'pipe_fds' defined but not used [-Wunused-variable]
 static int pipe_fds[2];
            ^
make[3]: *** [_glib_la-pygoptiongroup.lo] Error 1
make[3]: *** Waiting for unfinished jobs....
In file included from /usr/include/python3.2/Python.h:111:0,
                 from ./pyglib.h:25,
                 from pygoptioncontext.c:27:
/usr/include/python3.2/modsupport.h:27:1: error: '_PyArg_ParseTuple_SizeT' is an unrecognized format function type [-Werror=format=]
 PyAPI_FUNC(int) PyArg_ParseTuple(PyObject *, const char *, ...) Py_FORMAT_PARSE
 ^
cc1: some warnings being treated as errors
make[3]: *** [_glib_la-pygmainloop.lo] Error 1
cc1: some warnings being treated as errors
cc1: some warnings being treated as errors
make[3]: *** [libpyglib_gi_2_0_python3.2_la-pyglib.lo] Error 1
make[3]: *** [_glib_la-pygiochannel.lo] Error 1
cc1: some warnings being treated as errors
make[3]: *** [_glib_la-glibmodule.lo] Error 1
cc1: some warnings being treated as errors
make[3]: *** [_glib_la-pygmaincontext.lo] Error 1
cc1: some warnings being treated as errors
make[3]: *** [_glib_la-pygspawn.lo] Error 1
cc1: some warnings being treated as errors
make[3]: *** [_glib_la-pygsource.lo] Error 1
cc1: some warnings being treated as errors
make[3]: *** [_glib_la-pygoptioncontext.lo] Error 1
make[3]: Leaving directory `/var/tmp/portage/dev-python/pygobject-3.4.2-r1/work/pygobject-3.4.2-python3_2/gi/_glib'
make[2]: *** [all-recursive] Error 1
make[2]: Leaving directory `/var/tmp/portage/dev-python/pygobject-3.4.2-r1/work/pygobject-3.4.2-python3_2/gi'
make[1]: *** [all-recursive] Error 1
make[1]: Leaving directory `/var/tmp/portage/dev-python/pygobject-3.4.2-r1/work/pygobject-3.4.2-python3_2'
make: *** [all] Error 2
 #[31;01m*#[0m ERROR: dev-python/pygobject-3.4.2-r1 failed (compile phase):
 #[31;01m*#[0m   emake failed
 #[31;01m*#[0m
 #[31;01m*#[0m If you need support, post the output of `emerge --info '=dev-python/pygobject-3.4.2-r1'`,
 #[31;01m*#[0m the complete build log and the output of `emerge -pqv '=dev-python/pygobject-3.4.2-r1'`.
 #[31;01m*#[0m The complete build log is located at '/var/tmp/portage/dev-python/pygobject-3.4.2-r1/temp/build.log'.
 #[31;01m*#[0m The ebuild environment file is located at '/var/tmp/portage/dev-python/pygobject-3.4.2-r1/temp/environment'.
 #[31;01m*#[0m Working directory: '/var/tmp/portage/dev-python/pygobject-3.4.2-r1/work/pygobject-3.4.2-python3_2'
 #[31;01m*#[0m S: '/var/tmp/portage/dev-python/pygobject-3.4.2-r1/work/pygobject-3.4.2'
Back to top
View user's profile Send private message
WuDDjA
n00b
n00b


Joined: 30 Aug 2005
Posts: 42

PostPosted: Mon Feb 18, 2013 5:07 pm    Post subject: same here Reply with quote

Same problem for me on amd64
already tried another GCC version and MAKEOPTS=j1 but no change
Back to top
View user's profile Send private message
WuDDjA
n00b
n00b


Joined: 30 Aug 2005
Posts: 42

PostPosted: Mon Feb 18, 2013 9:19 pm    Post subject: Solved for me! Reply with quote

Problem solved after recompiling
python:3.2
python:2.7
Back to top
View user's profile Send private message
Maitreya
Apprentice
Apprentice


Joined: 11 Jan 2006
Posts: 219

PostPosted: Sat Apr 20, 2013 9:04 am    Post subject: not solved for me Reply with quote

I re-emerged python:2.7 and python:3.2 with : safest cflags, -j1

No dice for me. Still got

libtool: compile: x86_64-pc-linux-gnu-gcc -DHAVE_CONFIG_H -I. -I../.. -I/usr/include/python3.2 -I/usr/include/python3.2 -DPY_SSIZE_T_CLEAN -pthread -I/usr/include/glib-2.0 -I/usr/lib64/glib-2.0/include -march=n$
In file included from /usr/include/python3.2/Python.h:111:0,
from pyglib.c:26:
/usr/include/python3.2/modsupport.h:27:1: error: '_PyArg_ParseTuple_SizeT' is an unrecognized format function type [-Werror=format=]
PyAPI_FUNC(int) PyArg_ParseTuple(PyObject *, const char *, ...) Py_FORMAT_PARSETUPLE(PyArg_ParseTuple, 2, 3);
^
cc1: some warnings being treated as errors
make[3]: *** [libpyglib_gi_2_0_python3.2_la-pyglib.lo] Fout 1
Back to top
View user's profile Send private message
Display posts from previous:   
Reply to topic    Gentoo Forums Forum Index Desktop Environments All times are GMT
Page 1 of 1

 
Jump to:  
You cannot post new topics in this forum
You cannot reply to topics in this forum
You cannot edit your posts in this forum
You cannot delete your posts in this forum
You cannot vote in polls in this forum