Gentoo Forums
Gentoo Forums
Gentoo Forums
Quick Search: in
[Solved]I fail to update my system (world) because of "MESA"
View unanswered posts
View posts from last 24 hours

 
Reply to topic    Gentoo Forums Forum Index Installing Gentoo
View previous topic :: View next topic  
Author Message
bluephoenix
Tux's lil' helper
Tux's lil' helper


Joined: 01 Nov 2008
Posts: 75

PostPosted: Wed Jan 02, 2013 1:40 pm    Post subject: [Solved]I fail to update my system (world) because of " Reply with quote

The system print out the following information:

>>> Failed to emerge media-libs/mesa-9.0.1, Log file:

>>> '/var/tmp/portage/media-libs/mesa-9.0.1/temp/build.log'

* Messages for package media-libs/mesa-9.0.1:

* ERROR: media-libs/mesa-9.0.1 failed (compile phase):
* emake failed
*
* If you need support, post the output of `emerge --info '=media-libs/mesa-9.0.1'`,
* the complete build log and the output of `emerge -pqv '=media-libs/mesa-9.0.1'`.
* The complete build log is located at '/var/tmp/portage/media-libs/mesa-9.0.1/temp/build.log'.
* The ebuild environment file is located at '/var/tmp/portage/media-libs/mesa-9.0.1/temp/environment'.
* Working directory: '/var/tmp/portage/media-libs/mesa-9.0.1/work/Mesa-9.0.1'
* S: '/var/tmp/portage/media-libs/mesa-9.0.1/work/Mesa-9.0.1'

Just because of the above failure, emerge stops the updating procedure. Who can teach me how to do next? Thanks!


Last edited by bluephoenix on Thu Jan 03, 2013 1:25 pm; edited 1 time in total
Back to top
View user's profile Send private message
eccerr0r
Advocate
Advocate


Joined: 01 Jul 2004
Posts: 3822
Location: USA

PostPosted: Wed Jan 02, 2013 4:26 pm    Post subject: Reply with quote

Hmm...there really needs to be a "how to debug emerge failures FAQ" or at least a "howto" on post for help :D

The error message posted is the diagnostic error for emerge/portage. To debug this we need the information above the line ">>> Failed to emerge media-libs/mesa-9.0.1, Log file: "

In the next line of the diagnostic there's a file ">>> '/var/tmp/portage/media-libs/mesa-9.0.1/temp/build.log' " - this contains the mess of stuff that printed out before it printed this diagnostic error. In this file, check the end of the file. Pastebin that file or post the last few lines before it says "failed to emerge."
_________________
Intel Core i7 2700K@ 4.1GHz/HD3000 graphics/8GB DDR3/180GB SSD
What am I supposed to be advocating?
Back to top
View user's profile Send private message
bluephoenix
Tux's lil' helper
Tux's lil' helper


Joined: 01 Nov 2008
Posts: 75

PostPosted: Thu Jan 03, 2013 3:48 am    Post subject: cat build.log Reply with quote

cat build.log
* Package: media-libs/mesa-9.0.1
* Repository: gentoo
* Maintainer: x11@gentoo.org
* USE: classic egl elibc_glibc gallium kernel_linux llvm nptl shared-glapi userland_GNU video_cards_intel x86
* FEATURES: sandbox
>>> Unpacking source...
>>> Unpacking MesaLib-9.0.1.tar.bz2 to /var/tmp/portage/media-libs/mesa-9.0.1/work
>>> Source unpacked in /var/tmp/portage/media-libs/mesa-9.0.1/work
>>> Preparing source in /var/tmp/portage/media-libs/mesa-9.0.1/work/Mesa-9.0.1 ...
* Applying mesa-8.1-dont-require-llvm-for-r300.patch ... [ ok ]
* Applying glx_ro_text_segm.patch ... [ ok ]
* Running eautoreconf in '/var/tmp/portage/media-libs/mesa-9.0.1/work/Mesa-9.0.1' ...
* Running libtoolize --install --copy --force --automake ... [ ok ]
* Running aclocal -I m4 ... [ ok ]
* Running autoconf ... [ ok ]
* Running automake --add-missing --copy --foreign ... [ ok ]
* Running elibtoolize in: Mesa-9.0.1/bin/
* Applying portage/1.2.0 patch ...
* Applying sed/1.5.6 patch ...
* Applying as-needed/2.2.6 patch ...
>>> Source prepared.
>>> Configuring source in /var/tmp/portage/media-libs/mesa-9.0.1/work/Mesa-9.0.1 ...
* econf: updating Mesa-9.0.1/bin/config.guess with /usr/share/gnuconfig/config.guess
* econf: updating Mesa-9.0.1/bin/config.sub with /usr/share/gnuconfig/config.sub
./configure --prefix=/usr --build=i686-pc-linux-gnu --host=i686-pc-linux-gnu --mandir=/usr/share/man --infodir=/usr/share/info --datadir=/usr/share --sysconfdir=/etc --localstatedir=/var/lib --disable-dependency-tracking --enable-dri --enable-glx --enable-texture-float --disable-debug --enable-egl --disable-gbm --disable-gles1 --disable-gles2 --enable-glx-tls --disable-osmesa --enable-asm --enable-shared-glapi --disable-xa --disable-xorg --with-dri-drivers=,swrast,i915,i965 --with-gallium-drivers=,swrast,i915 --with-egl-platforms=x11 --enable-gallium-egl --disable-gallium-g3dvl --enable-gallium-llvm --disable-openvg --disable-r600-llvm-compiler --disable-vdpau --disable-xvmc
checking build system type... i686-pc-linux-gnu
checking host system type... i686-pc-linux-gnu
checking for a BSD-compatible install... /usr/bin/install -c
checking whether build environment is sane... yes
checking for a thread-safe mkdir -p... /bin/mkdir -p
checking for gawk... gawk
checking whether make sets $(MAKE)... yes
checking whether make supports nested variables... yes
checking for style of include used by make... GNU
checking for i686-pc-linux-gnu-gcc... i686-pc-linux-gnu-gcc
checking whether the C compiler works... yes
checking for C compiler default output file name... a.out
checking for suffix of executables...
checking whether we are cross compiling... no
checking for suffix of object files... o
checking whether we are using the GNU C compiler... yes
checking whether i686-pc-linux-gnu-gcc accepts -g... yes
checking for i686-pc-linux-gnu-gcc option to accept ISO C89... none needed
checking dependency style of i686-pc-linux-gnu-gcc... none
checking for i686-pc-linux-gnu-ar... i686-pc-linux-gnu-ar
checking the archiver (i686-pc-linux-gnu-ar) interface... ar
checking how to print strings... printf
checking for a sed that does not truncate output... /bin/sed
checking for grep that handles long lines and -e... /bin/grep
checking for egrep... /bin/grep -E
checking for fgrep... /bin/grep -F
checking for ld used by i686-pc-linux-gnu-gcc... /usr/i686-pc-linux-gnu/bin/ld
checking if the linker (/usr/i686-pc-linux-gnu/bin/ld) is GNU ld... yes
checking for BSD- or MS-compatible name lister (nm)... /usr/bin/nm -B
checking the name lister (/usr/bin/nm -B) interface... BSD nm
checking whether ln -s works... yes
checking the maximum length of command line arguments... 1572864
checking whether the shell understands some XSI constructs... yes
checking whether the shell understands "+="... yes
checking how to convert i686-pc-linux-gnu file names to i686-pc-linux-gnu format... func_convert_file_noop
checking how to convert i686-pc-linux-gnu file names to toolchain format... func_convert_file_noop
checking for /usr/i686-pc-linux-gnu/bin/ld option to reload object files... -r
checking for i686-pc-linux-gnu-objdump... i686-pc-linux-gnu-objdump
checking how to recognize dependent libraries... pass_all
checking for i686-pc-linux-gnu-dlltool... no
checking for dlltool... no
checking how to associate runtime and link libraries... printf %s\n
checking for i686-pc-linux-gnu-ar... (cached) i686-pc-linux-gnu-ar
checking for archiver @FILE support... @
checking for i686-pc-linux-gnu-strip... i686-pc-linux-gnu-strip
checking for i686-pc-linux-gnu-ranlib... i686-pc-linux-gnu-ranlib
checking command to parse /usr/bin/nm -B output from i686-pc-linux-gnu-gcc object... ok
checking for sysroot... no
checking for i686-pc-linux-gnu-mt... no
checking for mt... no
checking if : is a manifest tool... no
checking how to run the C preprocessor... i686-pc-linux-gnu-gcc -E
checking for ANSI C header files... yes
checking for sys/types.h... yes
checking for sys/stat.h... yes
checking for stdlib.h... yes
checking for string.h... yes
checking for memory.h... yes
checking for strings.h... yes
checking for inttypes.h... yes
checking for stdint.h... yes
checking for unistd.h... yes
checking for dlfcn.h... yes
checking for objdir... .libs
checking if i686-pc-linux-gnu-gcc supports -fno-rtti -fno-exceptions... no
checking for i686-pc-linux-gnu-gcc option to produce PIC... -fPIC -DPIC
checking if i686-pc-linux-gnu-gcc PIC flag -fPIC -DPIC works... yes
checking if i686-pc-linux-gnu-gcc static flag -static works... yes
checking if i686-pc-linux-gnu-gcc supports -c -o file.o... yes
checking if i686-pc-linux-gnu-gcc supports -c -o file.o... (cached) yes
checking whether the i686-pc-linux-gnu-gcc linker (/usr/i686-pc-linux-gnu/bin/ld) supports shared libraries... yes
checking whether -lc should be explicitly linked in... no
checking dynamic linker characteristics... GNU/Linux ld.so
checking how to hardcode library paths into programs... immediate
checking whether stripping libraries is possible... yes
checking if libtool supports shared libraries... yes
checking whether to build shared libraries... yes
checking whether to build static libraries... no
checking how to run the C preprocessor... i686-pc-linux-gnu-gcc -E
checking for i686-pc-linux-gnu-gcc... (cached) i686-pc-linux-gnu-gcc
checking whether we are using the GNU C compiler... (cached) yes
checking whether i686-pc-linux-gnu-gcc accepts -g... (cached) yes
checking for i686-pc-linux-gnu-gcc option to accept ISO C89... (cached) none needed
checking dependency style of i686-pc-linux-gnu-gcc... (cached) none
checking for i686-pc-linux-gnu-g++... i686-pc-linux-gnu-g++
checking whether we are using the GNU C++ compiler... yes
checking whether i686-pc-linux-gnu-g++ accepts -g... yes
checking dependency style of i686-pc-linux-gnu-g++... none
checking how to run the C++ preprocessor... i686-pc-linux-gnu-g++ -E
checking for ld used by i686-pc-linux-gnu-g++... /usr/i686-pc-linux-gnu/bin/ld
checking if the linker (/usr/i686-pc-linux-gnu/bin/ld) is GNU ld... yes
checking whether the i686-pc-linux-gnu-g++ linker (/usr/i686-pc-linux-gnu/bin/ld) supports shared libraries... yes
checking for i686-pc-linux-gnu-g++ option to produce PIC... -fPIC -DPIC
checking if i686-pc-linux-gnu-g++ PIC flag -fPIC -DPIC works... yes
checking if i686-pc-linux-gnu-g++ static flag -static works... yes
checking if i686-pc-linux-gnu-g++ supports -c -o file.o... yes
checking if i686-pc-linux-gnu-g++ supports -c -o file.o... (cached) yes
checking whether the i686-pc-linux-gnu-g++ linker (/usr/i686-pc-linux-gnu/bin/ld) supports shared libraries... yes
checking dynamic linker characteristics... (cached) GNU/Linux ld.so
checking how to hardcode library paths into programs... immediate
checking whether i686-pc-linux-gnu-gcc and cc understand -c and -o together... yes
checking dependency style of i686-pc-linux-gnu-gcc... none
checking for gmake... gmake
checking for python2... python2
checking for a sed that does not truncate output... (cached) /bin/sed
checking for makedepend... /usr/bin/makedepend
checking for bison... bison -y
checking for bison... /usr/bin/bison
checking for flex... flex
checking lex output file root... lex.yy
checking lex library... -lfl
checking whether yytext is a pointer... yes
checking for perl... /usr/bin/perl
checking for indent... cat
checking if compiling with clang... no
checking whether gcc version is sufficient... yes
checking for i686-pc-linux-gnu-pkg-config... no
checking for pkg-config... /usr/bin/pkg-config
checking pkg-config is at least version 0.9.0... yes
checking whether i686-pc-linux-gnu-gcc supports -Werror=missing-prototypes... yes
checking whether i686-pc-linux-gnu-gcc supports -fvisibility=hidden... yes
checking whether i686-pc-linux-gnu-g++ supports -fvisibility=hidden... yes
configure: WARNING: Floating-point textures enabled.
configure: WARNING: Please consult docs/patents.txt with your lawyer before building Mesa.
checking whether to enable assembly... yes, x86
checking for i686-pc-linux-gnu-gcc option to produce PIC... -fPIC
checking for dlopen... no
checking for dlopen in -ldl... yes
checking for posix_memalign... yes
checking for the pthreads library -lpthreads... no
checking whether pthreads work without any flags... no
checking whether pthreads work with -Kthread... no
checking whether pthreads work with -kthread... no
checking for the pthreads library -llthread... no
checking whether pthreads work with -pthread... yes
checking for joinable pthread attribute... PTHREAD_CREATE_JOINABLE
checking if more special flags are required for pthreads... no
checking for PTHREAD_PRIO_INHERIT... no
checking for LIBDRM... yes
checking for X11... yes
checking for GLPROTO... yes
checking for DRI2PROTO... yes
checking for XF86VIDMODE... yes
checking for DRIGL... yes
checking expat.h usability... yes
checking expat.h presence... yes
checking for expat.h... yes
checking for XML_ParserCreate in -lexpat... yes
checking for INTEL... yes
checking for mincore... yes
checking for LIBUDEV... yes
checking for XCB_DRI2... yes
checking for xcb_dri2_connect_alignment_pad in -lxcb-dri2... yes
checking for llvm-config... /usr/bin/llvm-config
checking for INTEL... yes
configure: creating ./config.status
config.status: creating configs/current
config.status: creating Makefile
config.status: creating src/egl/Makefile
config.status: creating src/egl/drivers/Makefile
config.status: creating src/egl/drivers/dri2/Makefile
config.status: creating src/egl/drivers/glx/Makefile
config.status: creating src/egl/main/Makefile
config.status: creating src/egl/main/egl.pc
config.status: creating src/egl/wayland/Makefile
config.status: creating src/egl/wayland/wayland-drm/Makefile
config.status: creating src/egl/wayland/wayland-egl/Makefile
config.status: creating src/egl/wayland/wayland-egl/wayland-egl.pc
config.status: creating src/gallium/Makefile
config.status: creating src/gallium/auxiliary/pipe-loader/Makefile
config.status: creating src/gallium/drivers/Makefile
config.status: creating src/gallium/drivers/r300/Makefile
config.status: creating src/gallium/drivers/r600/Makefile
config.status: creating src/gallium/state_trackers/clover/Makefile
config.status: creating src/gallium/targets/opencl/Makefile
config.status: creating src/gbm/Makefile
config.status: creating src/gbm/main/gbm.pc
config.status: creating src/glsl/Makefile
config.status: creating src/glsl/glcpp/Makefile
config.status: creating src/glsl/tests/Makefile
config.status: creating src/glx/Makefile
config.status: creating src/glx/tests/Makefile
config.status: creating src/gtest/Makefile
config.status: creating src/Makefile
config.status: creating src/mapi/es1api/Makefile
config.status: creating src/mapi/es1api/glesv1_cm.pc
config.status: creating src/mapi/es2api/Makefile
config.status: creating src/mapi/es2api/glesv2.pc
config.status: creating src/mapi/glapi/Makefile
config.status: creating src/mapi/glapi/gen/Makefile
config.status: creating src/mapi/glapi/tests/Makefile
config.status: creating src/mapi/shared-glapi/Makefile
config.status: creating src/mapi/shared-glapi/tests/Makefile
config.status: creating src/mapi/vgapi/Makefile
config.status: creating src/mapi/vgapi/vg.pc
config.status: creating src/mesa/Makefile
config.status: creating src/mesa/gl.pc
config.status: creating src/mesa/drivers/Makefile
config.status: creating src/mesa/drivers/dri/dri.pc
config.status: creating src/mesa/drivers/dri/common/Makefile
config.status: creating src/mesa/drivers/dri/i915/Makefile
config.status: creating src/mesa/drivers/dri/i965/Makefile
config.status: creating src/mesa/drivers/dri/Makefile
config.status: creating src/mesa/drivers/dri/nouveau/Makefile
config.status: creating src/mesa/drivers/dri/r200/Makefile
config.status: creating src/mesa/drivers/dri/radeon/Makefile
config.status: creating src/mesa/drivers/dri/swrast/Makefile
config.status: creating src/mesa/drivers/osmesa/Makefile
config.status: creating src/mesa/drivers/osmesa/osmesa.pc
config.status: creating src/mesa/drivers/x11/Makefile
config.status: creating src/mesa/libdricore/Makefile
config.status: creating src/mesa/main/tests/Makefile
config.status: creating src/mesa/x86-64/Makefile
config.status: creating src/mesa/x86/Makefile
config.status: executing depfiles commands
config.status: executing libtool commands

prefix: /usr
exec_prefix: ${prefix}
libdir: ${exec_prefix}/lib
includedir: ${prefix}/include

OpenGL: yes (ES1: no ES2: no)
OpenVG: no

OSMesa: no
DRI drivers: swrast i915 i965
DRI driver dir: ${libdir}/dri
GLX: DRI-based

EGL: yes
EGL platforms: x11
EGL drivers: builtin:egl_glx builtin:egl_dri2 egl_gallium
EGL Gallium STs: $(GL_LIB)

llvm: yes
llvm-config: /usr/bin/llvm-config
llvm-version: 3.1

Gallium: yes
Gallium dirs: auxiliary drivers state_trackers
Target dirs: dri-i915 dri-swrast egl-static
Winsys dirs: i915/drm i915/sw sw sw/dri
Driver dirs: galahad i915 identity llvmpipe noop rbug softpipe trace
Trackers dirs: dri egl

Shared libs: yes
Static libs: no
Shared-glapi: yes

CFLAGS: -O2 -march=pentium-m -pipe -fomit-frame-pointer -Wall -std=c99 -Werror=implicit-function-declaration -Werror=missing-prototypes -fno-strict-aliasing -fno-builtin-memcmp -fPIC
CXXFLAGS: -O2 -march=pentium-m -pipe -fomit-frame-pointer -Wall -fno-strict-aliasing -fno-builtin-memcmp -fPIC
Macros: -D_GNU_SOURCE -DHAVE_PTHREAD -DTEXTURE_FLOAT_ENABLED -DUSE_X86_ASM -DUSE_MMX_ASM -DUSE_3DNOW_ASM -DUSE_SSE_ASM -DHAVE_DLOPEN -DHAVE_POSIX_MEMALIGN -DIN_DRI_DRIVER -DUSE_XCB -DGLX_INDIRECT_RENDERING -DGLX_DIRECT_RENDERING -DGLX_USE_TLS -DHAVE_PTHREAD -DUSE_EXTERNAL_DXTN_LIB=1 -DIN_DRI_DRIVER -DHAVE_ALIAS -DHAVE_MINCORE -DHAVE_LIBUDEV -DHAVE_LLVM=0x0301

PYTHON2: python2

Run 'gmake' to build Mesa

>>> Source configured.
>>> Compiling source in /var/tmp/portage/media-libs/mesa-9.0.1/work/Mesa-9.0.1 ...
make -j2
Making all in src
gmake[1]: Entering directory `/var/tmp/portage/media-libs/mesa-9.0.1/work/Mesa-9.0.1/src'
Making all in mapi/glapi/gen
gmake[2]: Entering directory `/var/tmp/portage/media-libs/mesa-9.0.1/work/Mesa-9.0.1/src/mapi/glapi/gen'
GEN ../../../../src/mapi/glapi/glapi_mapi_tmp.h
GEN ../../../../src/mapi/glapi/glprocs.h
GEN ../../../../src/mapi/glapi/glapitemp.h
GEN ../../../../src/mapi/glapi/glapitable.h
GEN ../../../../src/mapi/glapi/glapi_gentable.c
GEN ../../../../src/mapi/glapi/glapi_x86.S
GEN ../../../../src/mesa/main/enums.c
GEN ../../../../src/mesa/main/dispatch.h
GEN ../../../../src/mesa/main/remap_helper.h
GEN ../../../../src/glx/indirect.c
GEN ../../../../src/glx/indirect.h
GEN ../../../../src/glx/indirect_init.c
GEN ../../../../src/glx/indirect_size.h
GEN ../../../../src/glx/indirect_size.c
gmake[2]: Leaving directory `/var/tmp/portage/media-libs/mesa-9.0.1/work/Mesa-9.0.1/src/mapi/glapi/gen'
Making all in mapi/shared-glapi
gmake[2]: Entering directory `/var/tmp/portage/media-libs/mesa-9.0.1/work/Mesa-9.0.1/src/mapi/shared-glapi'
GEN glapi_mapi_tmp.h
gmake all-am
gmake[3]: Entering directory `/var/tmp/portage/media-libs/mesa-9.0.1/work/Mesa-9.0.1/src/mapi/shared-glapi'
CC entry.lo
CC mapi_glapi.lo
CC stub.lo
CC table.lo
CC u_current.lo
CC u_execmem.lo
CCLD libglapi.la
/bin/mkdir -p ../../../lib
ln -f .libs/libglapi.so.0.0.0 ../../../lib/libglapi.so.0.0.0
ln -sf libglapi.so.0.0.0 ../../../lib/libglapi.so.0
ln -sf libglapi.so.0 ../../../lib/libglapi.so
gmake[3]: Leaving directory `/var/tmp/portage/media-libs/mesa-9.0.1/work/Mesa-9.0.1/src/mapi/shared-glapi'
gmake[2]: Leaving directory `/var/tmp/portage/media-libs/mesa-9.0.1/work/Mesa-9.0.1/src/mapi/shared-glapi'
Making all in mapi/glapi
gmake[2]: Entering directory `/var/tmp/portage/media-libs/mesa-9.0.1/work/Mesa-9.0.1/src/mapi/glapi'
CC entry.lo
CCLD libglapi.la
ln -sf .libs/libglapi.a libglapi.a
gmake[2]: Leaving directory `/var/tmp/portage/media-libs/mesa-9.0.1/work/Mesa-9.0.1/src/mapi/glapi'
Making all in glsl
gmake[2]: Entering directory `/var/tmp/portage/media-libs/mesa-9.0.1/work/Mesa-9.0.1/src/glsl'
CC hash_table.o
CC symbol_table.o
CXX standalone_scaffolding.o
CXX main.o
In file included from /usr/lib/gcc/i686-pc-linux-gnu/4.5.4/include/g++-v4/cstddef:43:0,
from /usr/lib/gcc/i686-pc-linux-gnu/4.5.4/include/g++-v4/new:41,
from ../../src/glsl/glsl_symbol_table.h:29,
from ../../src/glsl/glsl_parser_extras.h:35,
from ../../src/glsl/ast.h:30,
from ../../src/glsl/main.cpp:34:
/usr/lib/gcc/i686-pc-linux-gnu/4.5.4/include/g++-v4/i686-pc-linux-gnu/bits/c++config.h:31:0: error: unterminated #ifndef
In file included from /usr/lib/gcc/i686-pc-linux-gnu/4.5.4/include/g++-v4/exception:39:0,
from /usr/lib/gcc/i686-pc-linux-gnu/4.5.4/include/g++-v4/new:42,
from ../../src/glsl/glsl_symbol_table.h:29,
from ../../src/glsl/glsl_parser_extras.h:35,
from ../../src/glsl/ast.h:30,
from ../../src/glsl/main.cpp:34:
/usr/lib/gcc/i686-pc-linux-gnu/4.5.4/include/g++-v4/i686-pc-linux-gnu/bits/c++config.h:31:0: error: unterminated #ifndef
gmake[2]: *** [main.o] Error 1
gmake[2]: *** Waiting for unfinished jobs....
gmake[2]: Leaving directory `/var/tmp/portage/media-libs/mesa-9.0.1/work/Mesa-9.0.1/src/glsl'
gmake[1]: *** [all-recursive] Error 1
gmake[1]: Leaving directory `/var/tmp/portage/media-libs/mesa-9.0.1/work/Mesa-9.0.1/src'
make: *** [all-recursive] Error 1
* ERROR: media-libs/mesa-9.0.1 failed (compile phase):
* emake failed
*
* If you need support, post the output of `emerge --info '=media-libs/mesa-9.0.1'`,
* the complete build log and the output of `emerge -pqv '=media-libs/mesa-9.0.1'`.
* The complete build log is located at '/var/tmp/portage/media-libs/mesa-9.0.1/temp/build.log'.
* The ebuild environment file is located at '/var/tmp/portage/media-libs/mesa-9.0.1/temp/environment'.
* Working directory: '/var/tmp/portage/media-libs/mesa-9.0.1/work/Mesa-9.0.1'
* S: '/var/tmp/portage/media-libs/mesa-9.0.1/work/Mesa-9.0.1'
Back to top
View user's profile Send private message
bluephoenix
Tux's lil' helper
Tux's lil' helper


Joined: 01 Nov 2008
Posts: 75

PostPosted: Thu Jan 03, 2013 4:16 am    Post subject: Again I failed to emerge stardict. Reply with quote

it says:
Failed to emerge dev-libs/libsigc++-2.2.10,


emerge -av stardict

* IMPORTANT: 7 news items need reading for repository 'gentoo'.
* Use eselect news to read news items.


These are the packages that would be merged, in order:

Calculating dependencies... done!
[ebuild N ] dev-libs/libsigc++-2.2.10:2 USE="-doc -static-libs {-test}" 2,844 kB
[ebuild N ] app-text/stardict-3.0.3-r2 USE="spell -espeak -gnome -gucharmap -pronounce -qqwry -tools" 8,934 kB

Total: 2 packages (2 new), Size of downloads: 11,777 kB

Would you like to merge these packages? [Yes/No] y

>>> Verifying ebuild manifests

>>> Starting parallel fetch

>>> Emerging (1 of 2) dev-libs/libsigc++-2.2.10
* Fetching files in the background. To view fetch progress, run
* `tail -f /var/log/emerge-fetch.log` in another terminal.
* libsigc++-2.2.10.tar.xz SHA256 SHA512 WHIRLPOOL size ;-) ... [ ok ]
>>> Unpacking source...
>>> Unpacking libsigc++-2.2.10.tar.xz to /var/tmp/portage/dev-libs/libsigc++-2.2.10/work
>>> Source unpacked in /var/tmp/portage/dev-libs/libsigc++-2.2.10/work
>>> Preparing source in /var/tmp/portage/dev-libs/libsigc++-2.2.10/work/libsigc++-2.2.10 ...
>>> Source prepared.
>>> Configuring source in /var/tmp/portage/dev-libs/libsigc++-2.2.10/work/libsigc++-2.2.10 ...
* econf: updating libsigc++-2.2.10/build/config.guess with /usr/share/gnuconfig/config.guess
* econf: updating libsigc++-2.2.10/build/config.sub with /usr/share/gnuconfig/config.sub
./configure --prefix=/usr --build=i686-pc-linux-gnu --host=i686-pc-linux-gnu --mandir=/usr/share/man --infodir=/usr/share/info --datadir=/usr/share --sysconfdir=/etc --localstatedir=/var/lib --disable-dependency-tracking --disable-documentation --disable-static
checking for a BSD-compatible install... /usr/bin/install -c
checking whether build environment is sane... yes
checking for a thread-safe mkdir -p... /bin/mkdir -p
checking for gawk... gawk
checking whether make sets $(MAKE)... yes
checking how to create a ustar tar archive... gnutar
checking whether to enable maintainer-specific portions of Makefiles... no
checking whether make supports GNU make features... yes
checking for i686-pc-linux-gnu-g++... i686-pc-linux-gnu-g++
checking whether the C++ compiler works... yes
checking for C++ compiler default output file name... a.out
checking for suffix of executables...
checking whether we are cross compiling... no
checking for suffix of object files... o
checking whether we are using the GNU C++ compiler... yes
checking whether i686-pc-linux-gnu-g++ accepts -g... yes
checking for style of include used by make... GNU
checking dependency style of i686-pc-linux-gnu-g++... none
checking build system type... i686-pc-linux-gnu
checking host system type... i686-pc-linux-gnu
checking how to print strings... printf
checking for i686-pc-linux-gnu-gcc... i686-pc-linux-gnu-gcc
checking whether we are using the GNU C compiler... yes
checking whether i686-pc-linux-gnu-gcc accepts -g... yes
checking for i686-pc-linux-gnu-gcc option to accept ISO C89... none needed
checking dependency style of i686-pc-linux-gnu-gcc... none
checking for a sed that does not truncate output... /bin/sed
checking for grep that handles long lines and -e... /bin/grep
checking for egrep... /bin/grep -E
checking for fgrep... /bin/grep -F
checking for ld used by i686-pc-linux-gnu-gcc... /usr/i686-pc-linux-gnu/bin/ld
checking if the linker (/usr/i686-pc-linux-gnu/bin/ld) is GNU ld... yes
checking for BSD- or MS-compatible name lister (nm)... /usr/bin/nm -B
checking the name lister (/usr/bin/nm -B) interface... BSD nm
checking whether ln -s works... yes
checking the maximum length of command line arguments... 1572864
checking whether the shell understands some XSI constructs... yes
checking whether the shell understands "+="... yes
checking how to convert i686-pc-linux-gnu file names to i686-pc-linux-gnu format... func_convert_file_noop
checking how to convert i686-pc-linux-gnu file names to toolchain format... func_convert_file_noop
checking for /usr/i686-pc-linux-gnu/bin/ld option to reload object files... -r
checking for i686-pc-linux-gnu-objdump... objdump
checking how to recognize dependent libraries... pass_all
checking for i686-pc-linux-gnu-dlltool... dlltool
checking how to associate runtime and link libraries... printf %s\n
checking for i686-pc-linux-gnu-ar... i686-pc-linux-gnu-ar
checking for archiver @FILE support... @
checking for i686-pc-linux-gnu-strip... i686-pc-linux-gnu-strip
checking for i686-pc-linux-gnu-ranlib... i686-pc-linux-gnu-ranlib
checking command to parse /usr/bin/nm -B output from i686-pc-linux-gnu-gcc object... ok
checking for sysroot... no
checking for i686-pc-linux-gnu-mt... no
checking for mt... no
checking if : is a manifest tool... no
checking how to run the C preprocessor... i686-pc-linux-gnu-gcc -E
checking for ANSI C header files... yes
checking for sys/types.h... yes
checking for sys/stat.h... yes
checking for stdlib.h... yes
checking for string.h... yes
checking for memory.h... yes
checking for strings.h... yes
checking for inttypes.h... yes
checking for stdint.h... yes
checking for unistd.h... yes
checking for dlfcn.h... yes
checking for objdir... .libs
checking if i686-pc-linux-gnu-gcc supports -fno-rtti -fno-exceptions... no
checking for i686-pc-linux-gnu-gcc option to produce PIC... -fPIC -DPIC
checking if i686-pc-linux-gnu-gcc PIC flag -fPIC -DPIC works... yes
checking if i686-pc-linux-gnu-gcc static flag -static works... yes
checking if i686-pc-linux-gnu-gcc supports -c -o file.o... yes
checking if i686-pc-linux-gnu-gcc supports -c -o file.o... (cached) yes
checking whether the i686-pc-linux-gnu-gcc linker (/usr/i686-pc-linux-gnu/bin/ld) supports shared libraries... yes
checking whether -lc should be explicitly linked in... no
checking dynamic linker characteristics... GNU/Linux ld.so
checking how to hardcode library paths into programs... immediate
checking whether stripping libraries is possible... yes
checking if libtool supports shared libraries... yes
checking whether to build shared libraries... yes
checking whether to build static libraries... no
checking how to run the C++ preprocessor... i686-pc-linux-gnu-g++ -E
checking for ld used by i686-pc-linux-gnu-g++... /usr/i686-pc-linux-gnu/bin/ld
checking if the linker (/usr/i686-pc-linux-gnu/bin/ld) is GNU ld... yes
checking whether the i686-pc-linux-gnu-g++ linker (/usr/i686-pc-linux-gnu/bin/ld) supports shared libraries... yes
checking for i686-pc-linux-gnu-g++ option to produce PIC... -fPIC -DPIC
checking if i686-pc-linux-gnu-g++ PIC flag -fPIC -DPIC works... yes
checking if i686-pc-linux-gnu-g++ static flag -static works... yes
checking if i686-pc-linux-gnu-g++ supports -c -o file.o... yes
checking if i686-pc-linux-gnu-g++ supports -c -o file.o... (cached) yes
checking whether the i686-pc-linux-gnu-g++ linker (/usr/i686-pc-linux-gnu/bin/ld) supports shared libraries... yes
checking dynamic linker characteristics... (cached) GNU/Linux ld.so
checking how to hardcode library paths into programs... immediate
checking for gm4... no
checking for m4... m4
checking for perl... /usr/bin/perl
checking for dot... dot
checking for doxygen... doxygen
checking for xsltproc... /usr/bin/xsltproc
checking for i686-pc-linux-gnu-pkg-config... no
checking for pkg-config... /usr/bin/pkg-config
checking pkg-config is at least version 0.9.0... yes
checking if C++ compiler supports the use of a particular specialization when calling operator() template methods.... no
checking if C++ compiler supports the use of a particular specialization when calling operator() template methods omitting the template keyword.... no
checking if C++ compiler allows usage of member function in initialization of static member field.... yes
checking whether C++ library symbols are declared in namespace std... no
checking for non-standard Sun libCstd reverse_iterator... no
checking which C++ compiler warning flags to use... -Wall
configure: creating ./config.status
config.status: creating Makefile
config.status: creating sigc++-2.0.pc
config.status: creating sigc++-2.0-uninstalled.pc
config.status: creating sigc++/Makefile
config.status: creating examples/Makefile
config.status: creating tests/Makefile
config.status: creating docs/Makefile
config.status: creating docs/reference/Doxyfile
config.status: creating MSVC_Net2005/sigc.rc
config.status: creating MSVC_Net2008/sigc.rc
config.status: creating MSVC_Net2010/sigc.rc
config.status: creating config.h
config.status: creating sigc++config.h
config.status: executing depfiles commands
config.status: executing libtool commands
config.status: executing MSVC_Net2005/sigc++config.h commands
config.status: executing MSVC_Net2008/sigc++config.h commands
config.status: executing MSVC_Net2010/sigc++config.h commands
>>> Source configured.
>>> Compiling source in /var/tmp/portage/dev-libs/libsigc++-2.2.10/work/libsigc++-2.2.10 ...
make -j2
make all-recursive
make[1]: Entering directory `/var/tmp/portage/dev-libs/libsigc++-2.2.10/work/libsigc++-2.2.10'
Making all in sigc++
make[2]: Entering directory `/var/tmp/portage/dev-libs/libsigc++-2.2.10/work/libsigc++-2.2.10/sigc++'
make all-am
make[3]: Entering directory `/var/tmp/portage/dev-libs/libsigc++-2.2.10/work/libsigc++-2.2.10/sigc++'
\
# source='signal.cc' object='signal.lo' libtool=yes
\
# source='signal_base.cc' object='signal_base.lo' libtool=yes
/bin/sh ../libtool --tag=CXX --mode=compile i686-pc-linux-gnu-g++ -DHAVE_CONFIG_H -I.. -I.. -Wall -O2 -march=pentium-m -pipe -fomit-frame-pointer -c -o signal.lo signal.cc
/bin/sh ../libtool --tag=CXX --mode=compile i686-pc-linux-gnu-g++ -DHAVE_CONFIG_H -I.. -I.. -Wall -O2 -march=pentium-m -pipe -fomit-frame-pointer -c -o signal_base.lo signal_base.cc
libtool: compile: i686-pc-linux-gnu-g++ -DHAVE_CONFIG_H -I.. -I.. -Wall -O2 -march=pentium-m -pipe -fomit-frame-pointer -c signal.cc -fPIC -DPIC -o .libs/signal.o
libtool: compile: i686-pc-linux-gnu-g++ -DHAVE_CONFIG_H -I.. -I.. -Wall -O2 -march=pentium-m -pipe -fomit-frame-pointer -c signal_base.cc -fPIC -DPIC -o .libs/signal_base.o
In file included from /usr/lib/gcc/i686-pc-linux-gnu/4.5.4/include/g++-v4/cstddef:43:0,
from ../sigc++/signal_base.h:24,
from signal_base.cc:20:
/usr/lib/gcc/i686-pc-linux-gnu/4.5.4/include/g++-v4/i686-pc-linux-gnu/bits/c++config.h:31:0: error: unterminated #ifndef
In file included from /usr/lib/gcc/i686-pc-linux-gnu/4.5.4/include/g++-v4/bits/stl_algobase.h:60:0,
from /usr/lib/gcc/i686-pc-linux-gnu/4.5.4/include/g++-v4/list:61,
from ../sigc++/signal_base.h:25,
from signal_base.cc:20:
/usr/lib/gcc/i686-pc-linux-gnu/4.5.4/include/g++-v4/i686-pc-linux-gnu/bits/c++config.h:31:0: error: unterminated #ifndefIn file included from /usr/lib/gcc/i686-pc-linux-gnu/4.5.4/include/g++-v4/bits/stl_algobase.h:60:0,
from /usr/lib/gcc/i686-pc-linux-gnu/4.5.4/include/g++-v4/list:61,
from ../sigc++/signal.h:7,
from signal.cc:20:
/usr/lib/gcc/i686-pc-linux-gnu/4.5.4/include/g++-v4/i686-pc-linux-gnu/bits/c++config.h:31:0: error: unterminated #ifndef

In file included from /usr/lib/gcc/i686-pc-linux-gnu/4.5.4/include/g++-v4/cstddef:43:0,
from /usr/lib/gcc/i686-pc-linux-gnu/4.5.4/include/g++-v4/bits/stl_algobase.h:61,
from /usr/lib/gcc/i686-pc-linux-gnu/4.5.4/include/g++-v4/list:61,
from ../sigc++/signal_base.h:25,
from signal_base.cc:20:
/usr/lib/gcc/i686-pc-linux-gnu/4.5.4/include/g++-v4/i686-pc-linux-gnu/bits/c++config.h:31:0: error: unterminated #ifndef
In file included from /usr/lib/gcc/i686-pc-linux-gnu/4.5.4/include/g++-v4/cstddef:43:0,
from /usr/lib/gcc/i686-pc-linux-gnu/4.5.4/include/g++-v4/bits/stl_algobase.h:61,
from /usr/lib/gcc/i686-pc-linux-gnu/4.5.4/include/g++-v4/list:61,
from ../sigc++/signal.h:7,
from signal.cc:20:
/usr/lib/gcc/i686-pc-linux-gnu/4.5.4/include/g++-v4/i686-pc-linux-gnu/bits/c++config.h:31:0: error: unterminated #ifndef
In file included from /usr/lib/gcc/i686-pc-linux-gnu/4.5.4/include/g++-v4/bits/functexcept.h:36:0,
from /usr/lib/gcc/i686-pc-linux-gnu/4.5.4/include/g++-v4/bits/stl_algobase.h:62,
from /usr/lib/gcc/i686-pc-linux-gnu/4.5.4/include/g++-v4/list:61,
from ../sigc++/signal_base.h:25,
from signal_base.cc:20:
/usr/lib/gcc/i686-pc-linux-gnu/4.5.4/include/g++-v4/i686-pc-linux-gnu/bits/c++config.h:31:0: error: unterminated #ifndef
In file included from /usr/lib/gcc/i686-pc-linux-gnu/4.5.4/include/g++-v4/bits/cpp_type_traits.h:38:0,
from /usr/lib/gcc/i686-pc-linux-gnu/4.5.4/include/g++-v4/bits/stl_algobase.h:63,
from /usr/lib/gcc/i686-pc-linux-gnu/4.5.4/include/g++-v4/list:61,
from ../sigc++/signal_base.h:25,
from signal_base.cc:20:
/usr/lib/gcc/i686-pc-linux-gnu/4.5.4/include/g++-v4/i686-pc-linux-gnu/bits/c++config.h:31:0: error: unterminated #ifndefIn file included from /usr/lib/gcc/i686-pc-linux-gnu/4.5.4/include/g++-v4/bits/functexcept.h:36:0,
from /usr/lib/gcc/i686-pc-linux-gnu/4.5.4/include/g++-v4/bits/stl_algobase.h:62,
from /usr/lib/gcc/i686-pc-linux-gnu/4.5.4/include/g++-v4/list:61,
from ../sigc++/signal.h:7,
from signal.cc:20:
/usr/lib/gcc/i686-pc-linux-gnu/4.5.4/include/g++-v4/i686-pc-linux-gnu/bits/c++config.h:31:0: error: unterminated #ifndef

In file included from /usr/lib/gcc/i686-pc-linux-gnu/4.5.4/include/g++-v4/ext/type_traits.h:34:0,
from /usr/lib/gcc/i686-pc-linux-gnu/4.5.4/include/g++-v4/bits/stl_algobase.h:64,
from /usr/lib/gcc/i686-pc-linux-gnu/4.5.4/include/g++-v4/list:61,
from ../sigc++/signal_base.h:25,
from signal_base.cc:20:
/usr/lib/gcc/i686-pc-linux-gnu/4.5.4/include/g++-v4/i686-pc-linux-gnu/bits/c++config.h:31:0: error: unterminated #ifndefIn file included from /usr/lib/gcc/i686-pc-linux-gnu/4.5.4/include/g++-v4/bits/cpp_type_traits.h:38:0,
from /usr/lib/gcc/i686-pc-linux-gnu/4.5.4/include/g++-v4/bits/stl_algobase.h:63,
from /usr/lib/gcc/i686-pc-linux-gnu/4.5.4/include/g++-v4/list:61,
from ../sigc++/signal.h:7,
from signal.cc:20:
/usr/lib/gcc/i686-pc-linux-gnu/4.5.4/include/g++-v4/i686-pc-linux-gnu/bits/c++config.h:31:0: error: unterminated #ifndef
In file included from /usr/lib/gcc/i686-pc-linux-gnu/4.5.4/include/g++-v4/ext/type_traits.h:34:0,
from /usr/lib/gcc/i686-pc-linux-gnu/4.5.4/include/g++-v4/bits/stl_algobase.h:64,
from /usr/lib/gcc/i686-pc-linux-gnu/4.5.4/include/g++-v4/list:61,
from ../sigc++/signal.h:7,
from signal.cc:20:
/usr/lib/gcc/i686-pc-linux-gnu/4.5.4/include/g++-v4/i686-pc-linux-gnu/bits/c++config.h:31:0: error: unterminated #ifndef
In file included from /usr/lib/gcc/i686-pc-linux-gnu/4.5.4/include/g++-v4/bits/move.h:33:0,
from /usr/lib/gcc/i686-pc-linux-gnu/4.5.4/include/g++-v4/bits/stl_pair.h:60,
from /usr/lib/gcc/i686-pc-linux-gnu/4.5.4/include/g++-v4/bits/stl_algobase.h:66,
from /usr/lib/gcc/i686-pc-linux-gnu/4.5.4/include/g++-v4/list:61,
from ../sigc++/signal_base.h:25,
from signal_base.cc:20:
/usr/lib/gcc/i686-pc-linux-gnu/4.5.4/include/g++-v4/i686-pc-linux-gnu/bits/c++config.h:31:0: error: unterminated #ifndef
In file included from /usr/lib/gcc/i686-pc-linux-gnu/4.5.4/include/g++-v4/bits/move.h:33:0,
from /usr/lib/gcc/i686-pc-linux-gnu/4.5.4/include/g++-v4/bits/stl_pair.h:60,
from /usr/lib/gcc/i686-pc-linux-gnu/4.5.4/include/g++-v4/bits/stl_algobase.h:66,
from /usr/lib/gcc/i686-pc-linux-gnu/4.5.4/include/g++-v4/list:61,
from ../sigc++/signal.h:7,
from signal.cc:20:
/usr/lib/gcc/i686-pc-linux-gnu/4.5.4/include/g++-v4/i686-pc-linux-gnu/bits/c++config.h:31:0: error: unterminated #ifndef

In file included from /usr/lib/gcc/i686-pc-linux-gnu/4.5.4/include/g++-v4/cstddef:43:0,
from /usr/lib/gcc/i686-pc-linux-gnu/4.5.4/include/g++-v4/bits/move.h:34,
from /usr/lib/gcc/i686-pc-linux-gnu/4.5.4/include/g++-v4/bits/stl_pair.h:60,
from /usr/lib/gcc/i686-pc-linux-gnu/4.5.4/include/g++-v4/bits/stl_algobase.h:66,
from /usr/lib/gcc/i686-pc-linux-gnu/4.5.4/include/g++-v4/list:61,
from ../sigc++/signal.h:7,
from signal.cc:20:
/usr/lib/gcc/i686-pc-linux-gnu/4.5.4/include/g++-v4/i686-pc-linux-gnu/bits/c++config.h:31:0: error: unterminated #ifndefIn file included from /usr/lib/gcc/i686-pc-linux-gnu/4.5.4/include/g++-v4/cstddef:43:0,
from /usr/lib/gcc/i686-pc-linux-gnu/4.5.4/include/g++-v4/bits/move.h:34,
from /usr/lib/gcc/i686-pc-linux-gnu/4.5.4/include/g++-v4/bits/stl_pair.h:60,
from /usr/lib/gcc/i686-pc-linux-gnu/4.5.4/include/g++-v4/bits/stl_algobase.h:66,
from /usr/lib/gcc/i686-pc-linux-gnu/4.5.4/include/g++-v4/list:61,
from ../sigc++/signal_base.h:25,
from signal_base.cc:20:
/usr/lib/gcc/i686-pc-linux-gnu/4.5.4/include/g++-v4/i686-pc-linux-gnu/bits/c++config.h:31:0: error: unterminated #ifndef
In file included from /usr/lib/gcc/i686-pc-linux-gnu/4.5.4/include/g++-v4/bits/concept_check.h:35:0,
from /usr/lib/gcc/i686-pc-linux-gnu/4.5.4/include/g++-v4/bits/move.h:35,
from /usr/lib/gcc/i686-pc-linux-gnu/4.5.4/include/g++-v4/bits/stl_pair.h:60,
from /usr/lib/gcc/i686-pc-linux-gnu/4.5.4/include/g++-v4/bits/stl_algobase.h:66,
from /usr/lib/gcc/i686-pc-linux-gnu/4.5.4/include/g++-v4/list:61,
from ../sigc++/signal_base.h:25,
from signal_base.cc:20:
/usr/lib/gcc/i686-pc-linux-gnu/4.5.4/include/g++-v4/i686-pc-linux-gnu/bits/c++config.h:31:0: error: unterminated #ifndef
In file included from /usr/lib/gcc/i686-pc-linux-gnu/4.5.4/include/g++-v4/bits/concept_check.h:35:0,
from /usr/lib/gcc/i686-pc-linux-gnu/4.5.4/include/g++-v4/bits/move.h:35,
from /usr/lib/gcc/i686-pc-linux-gnu/4.5.4/include/g++-v4/bits/stl_pair.h:60,
from /usr/lib/gcc/i686-pc-linux-gnu/4.5.4/include/g++-v4/bits/stl_algobase.h:66,
from /usr/lib/gcc/i686-pc-linux-gnu/4.5.4/include/g++-v4/list:61,
from ../sigc++/signal.h:7,
from signal.cc:20:
/usr/lib/gcc/i686-pc-linux-gnu/4.5.4/include/g++-v4/i686-pc-linux-gnu/bits/c++config.h:31:0: error: unterminated #ifndef

In file included from /usr/lib/gcc/i686-pc-linux-gnu/4.5.4/include/g++-v4/bits/stl_iterator_base_types.h:65:0,
from /usr/lib/gcc/i686-pc-linux-gnu/4.5.4/include/g++-v4/bits/stl_algobase.h:67,
from /usr/lib/gcc/i686-pc-linux-gnu/4.5.4/include/g++-v4/list:61,
from ../sigc++/signal.h:7,
from signal.cc:20:
/usr/lib/gcc/i686-pc-linux-gnu/4.5.4/include/g++-v4/i686-pc-linux-gnu/bits/c++config.h:31:0: error: unterminated #ifndefIn file included from /usr/lib/gcc/i686-pc-linux-gnu/4.5.4/include/g++-v4/bits/stl_iterator_base_types.h:65:0,
from /usr/lib/gcc/i686-pc-linux-gnu/4.5.4/include/g++-v4/bits/stl_algobase.h:67,
from /usr/lib/gcc/i686-pc-linux-gnu/4.5.4/include/g++-v4/list:61,
from ../sigc++/signal_base.h:25,
from signal_base.cc:20:
/usr/lib/gcc/i686-pc-linux-gnu/4.5.4/include/g++-v4/i686-pc-linux-gnu/bits/c++config.h:31:0: error: unterminated #ifndef

In file included from /usr/lib/gcc/i686-pc-linux-gnu/4.5.4/include/g++-v4/cstddef:43:0,
from /usr/lib/gcc/i686-pc-linux-gnu/4.5.4/include/g++-v4/bits/stl_iterator_base_types.h:66,
from /usr/lib/gcc/i686-pc-linux-gnu/4.5.4/include/g++-v4/bits/stl_algobase.h:67,
from /usr/lib/gcc/i686-pc-linux-gnu/4.5.4/include/g++-v4/list:61,
from ../sigc++/signal_base.h:25,
from signal_base.cc:20:
/usr/lib/gcc/i686-pc-linux-gnu/4.5.4/include/g++-v4/i686-pc-linux-gnu/bits/c++config.h:31:0: error: unterminated #ifndef
In file included from /usr/lib/gcc/i686-pc-linux-gnu/4.5.4/include/g++-v4/cstddef:43:0,
from /usr/lib/gcc/i686-pc-linux-gnu/4.5.4/include/g++-v4/bits/stl_iterator_base_types.h:66,
from /usr/lib/gcc/i686-pc-linux-gnu/4.5.4/include/g++-v4/bits/stl_algobase.h:67,
from /usr/lib/gcc/i686-pc-linux-gnu/4.5.4/include/g++-v4/list:61,
from ../sigc++/signal.h:7,
from signal.cc:20:
/usr/lib/gcc/i686-pc-linux-gnu/4.5.4/include/g++-v4/i686-pc-linux-gnu/bits/c++config.h:31:0: error: unterminated #ifndef
In file included from /usr/lib/gcc/i686-pc-linux-gnu/4.5.4/include/g++-v4/cstddef:43:0,
from /usr/lib/gcc/i686-pc-linux-gnu/4.5.4/include/g++-v4/new:41,
from /usr/lib/gcc/i686-pc-linux-gnu/4.5.4/include/g++-v4/ext/new_allocator.h:33,
from /usr/lib/gcc/i686-pc-linux-gnu/4.5.4/include/g++-v4/i686-pc-linux-gnu/bits/c++allocator.h:34,
from /usr/lib/gcc/i686-pc-linux-gnu/4.5.4/include/g++-v4/bits/allocator.h:48,
from /usr/lib/gcc/i686-pc-linux-gnu/4.5.4/include/g++-v4/list:62,
from ../sigc++/signal_base.h:25,
from signal_base.cc:20:
/usr/lib/gcc/i686-pc-linux-gnu/4.5.4/include/g++-v4/i686-pc-linux-gnu/bits/c++config.h:31:0: error: unterminated #ifndef
In file included from /usr/lib/gcc/i686-pc-linux-gnu/4.5.4/include/g++-v4/exception:39:0,
from /usr/lib/gcc/i686-pc-linux-gnu/4.5.4/include/g++-v4/new:42,
from /usr/lib/gcc/i686-pc-linux-gnu/4.5.4/include/g++-v4/ext/new_allocator.h:33,
from /usr/lib/gcc/i686-pc-linux-gnu/4.5.4/include/g++-v4/i686-pc-linux-gnu/bits/c++allocator.h:34,
from /usr/lib/gcc/i686-pc-linux-gnu/4.5.4/include/g++-v4/bits/allocator.h:48,
from /usr/lib/gcc/i686-pc-linux-gnu/4.5.4/include/g++-v4/list:62,
from ../sigc++/signal_base.h:25,
from signal_base.cc:20:
/usr/lib/gcc/i686-pc-linux-gnu/4.5.4/include/g++-v4/i686-pc-linux-gnu/bits/c++config.h:31:0: error: unterminated #ifndefIn file included from /usr/lib/gcc/i686-pc-linux-gnu/4.5.4/include/g++-v4/cstddef:43:0,
from /usr/lib/gcc/i686-pc-linux-gnu/4.5.4/include/g++-v4/new:41,
from /usr/lib/gcc/i686-pc-linux-gnu/4.5.4/include/g++-v4/ext/new_allocator.h:33,
from /usr/lib/gcc/i686-pc-linux-gnu/4.5.4/include/g++-v4/i686-pc-linux-gnu/bits/c++allocator.h:34,
from /usr/lib/gcc/i686-pc-linux-gnu/4.5.4/include/g++-v4/bits/allocator.h:48,
from /usr/lib/gcc/i686-pc-linux-gnu/4.5.4/include/g++-v4/list:62,
from ../sigc++/signal.h:7,
from signal.cc:20:
/usr/lib/gcc/i686-pc-linux-gnu/4.5.4/include/g++-v4/i686-pc-linux-gnu/bits/c++config.h:31:0: error: unterminated #ifndef

In file included from /usr/lib/gcc/i686-pc-linux-gnu/4.5.4/include/g++-v4/exception:39:0,
from /usr/lib/gcc/i686-pc-linux-gnu/4.5.4/include/g++-v4/new:42,
from /usr/lib/gcc/i686-pc-linux-gnu/4.5.4/include/g++-v4/ext/new_allocator.h:33,
from /usr/lib/gcc/i686-pc-linux-gnu/4.5.4/include/g++-v4/i686-pc-linux-gnu/bits/c++allocator.h:34,
from /usr/lib/gcc/i686-pc-linux-gnu/4.5.4/include/g++-v4/bits/allocator.h:48,
from /usr/lib/gcc/i686-pc-linux-gnu/4.5.4/include/g++-v4/list:62,
from ../sigc++/signal.h:7,
from signal.cc:20:
/usr/lib/gcc/i686-pc-linux-gnu/4.5.4/include/g++-v4/i686-pc-linux-gnu/bits/c++config.h:31:0: error: unterminated #ifndef
In file included from /usr/lib/gcc/i686-pc-linux-gnu/4.5.4/include/g++-v4/cstddef:43:0,
from ../sigc++/signal_base.h:24,
from ../sigc++/signal.h:8,
from signal.cc:20:
/usr/lib/gcc/i686-pc-linux-gnu/4.5.4/include/g++-v4/i686-pc-linux-gnu/bits/c++config.h:31:0: error: unterminated #ifndef
In file included from /usr/lib/gcc/i686-pc-linux-gnu/4.5.4/include/g++-v4/list:63:0,
from ../sigc++/signal_base.h:25,
from signal_base.cc:20:
/usr/lib/gcc/i686-pc-linux-gnu/4.5.4/include/g++-v4/bits/stl_list.h: In member function 'void std::list<_Tp, _Alloc>::_M_check_equal_allocators(std::list<_Tp, _Alloc>&)':
/usr/lib/gcc/i686-pc-linux-gnu/4.5.4/include/g++-v4/bits/stl_list.h:1467:63: error: there are no arguments to '__N' that depend on a template parameter, so a declaration of '__N' must be available
/usr/lib/gcc/i686-pc-linux-gnu/4.5.4/include/g++-v4/bits/stl_list.h:1467:63: note: (if you use '-fpermissive', G++ will accept your code, but allowing the use of an undeclared name is deprecated)
In file included from /usr/lib/gcc/i686-pc-linux-gnu/4.5.4/include/g++-v4/list:63:0,
from ../sigc++/signal.h:7,
from signal.cc:20:
/usr/lib/gcc/i686-pc-linux-gnu/4.5.4/include/g++-v4/bits/stl_list.h: In member function 'void std::list<_Tp, _Alloc>::_M_check_equal_allocators(std::list<_Tp, _Alloc>&)':
/usr/lib/gcc/i686-pc-linux-gnu/4.5.4/include/g++-v4/bits/stl_list.h:1467:63: error: there are no arguments to '__N' that depend on a template parameter, so a declaration of '__N' must be available
/usr/lib/gcc/i686-pc-linux-gnu/4.5.4/include/g++-v4/bits/stl_list.h:1467:63: note: (if you use '-fpermissive', G++ will accept your code, but allowing the use of an undeclared name is deprecated)
In file included from ../sigc++/signal_base.h:29:0,
from signal_base.cc:20:
../sigc++/functors/slot.h: In static member function 'static T_return sigc::internal::slot_call1<T_functor, T_return, T_arg1>::call_it(sigc::internal::slot_rep*, typename sigc::type_trait<T_arg3>::take)':
../sigc++/functors/slot.h:136:106: error: expected '(' before '>' token
../sigc++/functors/slot.h: In static member function 'static T_return sigc::internal::slot_call2<T_functor, T_return, T_arg1, T_arg2>::call_it(sigc::internal::slot_rep*, typename sigc::type_trait<T_arg3>::take, typename sigc::type_trait<T_arg4>::take)':
../sigc++/functors/slot.h:172:106: error: expected '(' before ',' token
In file included from ../sigc++/signal_base.h:29:0,
from signal_base.cc:20:
../sigc++/functors/slot.h:172:141: error: expected '(' before '>' token
../sigc++/functors/slot.h: In static member function 'static T_return sigc::internal::slot_call3<T_functor, T_return, T_arg1, T_arg2, T_arg3>::call_it(sigc::internal::slot_rep*, typename sigc::type_trait<T_arg3>::take, typename sigc::type_trait<T_arg4>::take, typename sigc::type_trait<T_arg5>::take)':
../sigc++/functors/slot.h:210:106: error: expected '(' before ',' token
../sigc++/functors/slot.h:210:141: error: expected '(' before ',' token
../sigc++/functors/slot.h:210:176: error: expected '(' before '>' token
../sigc++/functors/slot.h: In static member function 'static T_return sigc::internal::slot_call4<T_functor, T_return, T_arg1, T_arg2, T_arg3, T_arg4>::call_it(sigc::internal::slot_rep*, typename sigc::type_trait<T_arg3>::take, typename sigc::type_trait<T_arg4>::take, typename sigc::type_trait<T_arg5>::take, typename sigc::type_trait<T_arg6>::take)':
../sigc++/functors/slot.h:250:106: error: expected '(' before ',' token
../sigc++/functors/slot.h:250:141: error: expected '(' before ',' token
../sigc++/functors/slot.h:250:176: error: expected '(' before ',' token
../sigc++/functors/slot.h:250:211: error: expected '(' before '>' token
../sigc++/functors/slot.h: In static member function 'static T_return sigc::internal::slot_call5<T_functor, T_return, T_arg1, T_arg2, T_arg3, T_arg4, T_arg5>::call_it(sigc::internal::slot_rep*, typename sigc::type_trait<T_arg3>::take, typename sigc::type_trait<T_arg4>::take, typename sigc::type_trait<T_arg5>::take, typename sigc::type_trait<T_arg6>::take, typename sigc::type_trait<T_arg7>::take)':
../sigc++/functors/slot.h:292:106: error: expected '(' before ',' token
../sigc++/functors/slot.h:292:141: error: expected '(' before ',' token
../sigc++/functors/slot.h:292:176: error: expected '(' before ',' token
../sigc++/functors/slot.h:292:211: error: expected '(' before ',' token
../sigc++/functors/slot.h:292:246: error: expected '(' before '>' token
In file included from ../sigc++/signal_base.h:29:0,
from signal_base.cc:20:
../sigc++/functors/slot.h: In static member function 'static T_return sigc::internal::slot_call6<T_functor, T_return, T_arg1, T_arg2, T_arg3, T_arg4, T_arg5, T_arg6>::call_it(sigc::internal::slot_rep*, typename sigc::type_trait<T_arg3>::take, typename sigc::type_trait<T_arg4>::take, typename sigc::type_trait<T_arg5>::take, typename sigc::type_trait<T_arg6>::take, typename sigc::type_trait<T_arg7>::take, typename sigc::type_trait<T_arg6>::take)':
../sigc++/functors/slot.h:336:106: error: expected '(' before ',' token
../sigc++/functors/slot.h:336:141: error: expected '(' before ',' token
../sigc++/functors/slot.h:336:176: error: expected '(' before ',' token
../sigc++/functors/slot.h:336:211: error: expected '(' before ',' token
../sigc++/functors/slot.h:336:246: error: expected '(' before ',' token
../sigc++/functors/slot.h:336:281: error: expected '(' before '>' token
../sigc++/functors/slot.h: In static member function 'static T_return sigc::internal::slot_call7<T_functor, T_return, T_arg1, T_arg2, T_arg3, T_arg4, T_arg5, T_arg6, T_arg7>::call_it(sigc::internal::slot_rep*, typename sigc::type_trait<T_arg3>::take, typename sigc::type_trait<T_arg4>::take, typename sigc::type_trait<T_arg5>::take, typename sigc::type_trait<T_arg6>::take, typename sigc::type_trait<T_arg7>::take, typename sigc::type_trait<T_arg6>::take, typename sigc::type_trait<T_arg7>::take)':
../sigc++/functors/slot.h:382:106: error: expected '(' before ',' token
../sigc++/functors/slot.h:382:141: error: expected '(' before ',' token
../sigc++/functors/slot.h:382:176: error: expected '(' before ',' token
../sigc++/functors/slot.h:382:211: error: expected '(' before ',' token
../sigc++/functors/slot.h:382:246: error: expected '(' before ',' token
../sigc++/functors/slot.h:382:281: error: expected '(' before ',' token
../sigc++/functors/slot.h:382:316: error: expected '(' before '>' token
In file included from ../sigc++/signal_base.h:29:0,
from ../sigc++/signal.h:8,
from signal.cc:20:
../sigc++/functors/slot.h: In static member function 'static T_return sigc::internal::slot_call1<T_functor, T_return, T_arg1>::call_it(sigc::internal::slot_rep*, typename sigc::type_trait<T_arg3>::take)':
../sigc++/functors/slot.h:136:106: error: expected '(' before '>' token
../sigc++/functors/slot.h: In static member function 'static T_return sigc::internal::slot_call2<T_functor, T_return, T_arg1, T_arg2>::call_it(sigc::internal::slot_rep*, typename sigc::type_trait<T_arg3>::take, typename sigc::type_trait<T_arg4>::take)':
../sigc++/functors/slot.h:172:106: error: expected '(' before ',' token
In file included from ../sigc++/signal_base.h:29:0,
from ../sigc++/signal.h:8,
from signal.cc:20:
../sigc++/functors/slot.h:172:141: error: expected '(' before '>' token
../sigc++/functors/slot.h: In static member function 'static T_return sigc::internal::slot_call3<T_functor, T_return, T_arg1, T_arg2, T_arg3>::call_it(sigc::internal::slot_rep*, typename sigc::type_trait<T_arg3>::take, typename sigc::type_trait<T_arg4>::take, typename sigc::type_trait<T_arg5>::take)':
../sigc++/functors/slot.h:210:106: error: expected '(' before ',' token
../sigc++/functors/slot.h:210:141: error: expected '(' before ',' token
../sigc++/functors/slot.h:210:176: error: expected '(' before '>' token
../sigc++/functors/slot.h: In static member function 'static T_return sigc::internal::slot_call4<T_functor, T_return, T_arg1, T_arg2, T_arg3, T_arg4>::call_it(sigc::internal::slot_rep*, typename sigc::type_trait<T_arg3>::take, typename sigc::type_trait<T_arg4>::take, typename sigc::type_trait<T_arg5>::take, typename sigc::type_trait<T_arg6>::take)':
../sigc++/functors/slot.h:250:106: error: expected '(' before ',' token
../sigc++/functors/slot.h:250:141: error: expected '(' before ',' token
../sigc++/functors/slot.h:250:176: error: expected '(' before ',' token
../sigc++/functors/slot.h:250:211: error: expected '(' before '>' token
../sigc++/functors/slot.h: In static member function 'static T_return sigc::internal::slot_call5<T_functor, T_return, T_arg1, T_arg2, T_arg3, T_arg4, T_arg5>::call_it(sigc::internal::slot_rep*, typename sigc::type_trait<T_arg3>::take, typename sigc::type_trait<T_arg4>::take, typename sigc::type_trait<T_arg5>::take, typename sigc::type_trait<T_arg6>::take, typename sigc::type_trait<T_arg7>::take)':
../sigc++/functors/slot.h:292:106: error: expected '(' before ',' token
../sigc++/functors/slot.h:292:141: error: expected '(' before ',' token
../sigc++/functors/slot.h:292:176: error: expected '(' before ',' token
../sigc++/functors/slot.h:292:211: error: expected '(' before ',' token
../sigc++/functors/slot.h:292:246: error: expected '(' before '>' token
In file included from ../sigc++/signal_base.h:29:0,
from ../sigc++/signal.h:8,
from signal.cc:20:
../sigc++/functors/slot.h: In static member function 'static T_return sigc::internal::slot_call6<T_functor, T_return, T_arg1, T_arg2, T_arg3, T_arg4, T_arg5, T_arg6>::call_it(sigc::internal::slot_rep*, typename sigc::type_trait<T_arg3>::take, typename sigc::type_trait<T_arg4>::take, typename sigc::type_trait<T_arg5>::take, typename sigc::type_trait<T_arg6>::take, typename sigc::type_trait<T_arg7>::take, typename sigc::type_trait<T_arg6>::take)':
../sigc++/functors/slot.h:336:106: error: expected '(' before ',' token
../sigc++/functors/slot.h:336:141: error: expected '(' before ',' token
../sigc++/functors/slot.h:336:176: error: expected '(' before ',' token
../sigc++/functors/slot.h:336:211: error: expected '(' before ',' token
../sigc++/functors/slot.h:336:246: error: expected '(' before ',' token
../sigc++/functors/slot.h:336:281: error: expected '(' before '>' token
../sigc++/functors/slot.h: In static member function 'static T_return sigc::internal::slot_call7<T_functor, T_return, T_arg1, T_arg2, T_arg3, T_arg4, T_arg5, T_arg6, T_arg7>::call_it(sigc::internal::slot_rep*, typename sigc::type_trait<T_arg3>::take, typename sigc::type_trait<T_arg4>::take, typename sigc::type_trait<T_arg5>::take, typename sigc::type_trait<T_arg6>::take, typename sigc::type_trait<T_arg7>::take, typename sigc::type_trait<T_arg6>::take, typename sigc::type_trait<T_arg7>::take)':
../sigc++/functors/slot.h:382:106: error: expected '(' before ',' token
../sigc++/functors/slot.h:382:141: error: expected '(' before ',' token
../sigc++/functors/slot.h:382:176: error: expected '(' before ',' token
../sigc++/functors/slot.h:382:211: error: expected '(' before ',' token
../sigc++/functors/slot.h:382:246: error: expected '(' before ',' token
../sigc++/functors/slot.h:382:281: error: expected '(' before ',' token
../sigc++/functors/slot.h:382:316: error: expected '(' before '>' token
make[3]: *** [signal_base.lo] Error 1
make[3]: *** Waiting for unfinished jobs....
make[3]: *** [signal.lo] Error 1
make[3]: Leaving directory `/var/tmp/portage/dev-libs/libsigc++-2.2.10/work/libsigc++-2.2.10/sigc++'
make[2]: *** [all] Error 2
make[2]: Leaving directory `/var/tmp/portage/dev-libs/libsigc++-2.2.10/work/libsigc++-2.2.10/sigc++'
make[1]: *** [all-recursive] Error 1
make[1]: Leaving directory `/var/tmp/portage/dev-libs/libsigc++-2.2.10/work/libsigc++-2.2.10'
make: *** [all] Error 2
* ERROR: dev-libs/libsigc++-2.2.10 failed (compile phase):
* emake failed
*
* If you need support, post the output of `emerge --info '=dev-libs/libsigc++-2.2.10'`,
* the complete build log and the output of `emerge -pqv '=dev-libs/libsigc++-2.2.10'`.
* The complete build log is located at '/var/tmp/portage/dev-libs/libsigc++-2.2.10/temp/build.log'.
* The ebuild environment file is located at '/var/tmp/portage/dev-libs/libsigc++-2.2.10/temp/environment'.
* Working directory: '/var/tmp/portage/dev-libs/libsigc++-2.2.10/work/libsigc++-2.2.10'
* S: '/var/tmp/portage/dev-libs/libsigc++-2.2.10/work/libsigc++-2.2.10'

>>> Failed to emerge dev-libs/libsigc++-2.2.10, Log file:

>>> '/var/tmp/portage/dev-libs/libsigc++-2.2.10/temp/build.log'

* Messages for package dev-libs/libsigc++-2.2.10:

* ERROR: dev-libs/libsigc++-2.2.10 failed (compile phase):
* emake failed
*
* If you need support, post the output of `emerge --info '=dev-libs/libsigc++-2.2.10'`,
* the complete build log and the output of `emerge -pqv '=dev-libs/libsigc++-2.2.10'`.
* The complete build log is located at '/var/tmp/portage/dev-libs/libsigc++-2.2.10/temp/build.log'.
* The ebuild environment file is located at '/var/tmp/portage/dev-libs/libsigc++-2.2.10/temp/environment'.
* Working directory: '/var/tmp/portage/dev-libs/libsigc++-2.2.10/work/libsigc++-2.2.10'
* S: '/var/tmp/portage/dev-libs/libsigc++-2.2.10/work/libsigc++-2.2.10'

I think something wrong in the libs. I ever improper shutdown my computer and cause hard disk error. I doubt some files missing or corrupt during that disaster.
Back to top
View user's profile Send private message
MustrumR
n00b
n00b


Joined: 15 Nov 2011
Posts: 51
Location: Right here

PostPosted: Thu Jan 03, 2013 8:47 am    Post subject: Reply with quote

Probably emerge gcc should fix it. Seems to be a bad gcc header.
Back to top
View user's profile Send private message
bluephoenix
Tux's lil' helper
Tux's lil' helper


Joined: 01 Nov 2008
Posts: 75

PostPosted: Thu Jan 03, 2013 1:24 pm    Post subject: After I re-emerge gcc, everything get well again. Reply with quote

After I re-emerge gcc, everything get well again.
Now the system seems recovered.
Thank you very much!
Back to top
View user's profile Send private message
Display posts from previous:   
Reply to topic    Gentoo Forums Forum Index Installing Gentoo All times are GMT
Page 1 of 1

 
Jump to:  
You cannot post new topics in this forum
You cannot reply to topics in this forum
You cannot edit your posts in this forum
You cannot delete your posts in this forum
You cannot vote in polls in this forum