Gentoo Forums
Gentoo Forums
Gentoo Forums
Quick Search: in
virtualbox-modules-4.1.22 failed (install phase) doins faile
View unanswered posts
View posts from last 24 hours

 
Reply to topic    Gentoo Forums Forum Index Portage & Programming
View previous topic :: View next topic  
Author Message
padoor
Advocate
Advocate


Joined: 30 Dec 2005
Posts: 4023
Location: india

PostPosted: Wed Oct 31, 2012 2:24 am    Post subject: virtualbox-modules-4.1.22 failed (install phase) doins faile Reply with quote

Code:
  MODPOST 1 modules
  CC      /var/tmp/portage/app-emulation/virtualbox-modules-4.1.22/work/vboxnetadp/vboxnetadp.mod.o
  LD [M]  /var/tmp/portage/app-emulation/virtualbox-modules-4.1.22/work/vboxnetadp/vboxnetadp.ko
make[2]: Leaving directory `/usr/src/linux-3.6.4-gentoo'
make[1]: Leaving directory `/var/tmp/portage/app-emulation/virtualbox-modules-4.1.22/work/vboxnetadp'

*** Building 'vboxpci' module ***
make[1]: Entering directory `/var/tmp/portage/app-emulation/virtualbox-modules-4.1.22/work/vboxpci'
make KBUILD_VERBOSE= SUBDIRS=/var/tmp/portage/app-emulation/virtualbox-modules-4.1.22/work/vboxpci SRCROOT=/var/tmp/portage/app-emulation/virtualbox-modules-4.1.22/work/vboxpci CONFIG_MODULE_SIG= -C /usr/src/linux modules
make[2]: Entering directory `/usr/src/linux-3.6.4-gentoo'
  CC [M]  /var/tmp/portage/app-emulation/virtualbox-modules-4.1.22/work/vboxpci/linux/VBoxPci-linux.o
  CC [M]  /var/tmp/portage/app-emulation/virtualbox-modules-4.1.22/work/vboxpci/VBoxPci.o
  CC [M]  /var/tmp/portage/app-emulation/virtualbox-modules-4.1.22/work/vboxpci/SUPR0IdcClient.o
In file included from /var/tmp/portage/app-emulation/virtualbox-modules-4.1.22/work/vboxpci/VBoxPciInternal.h:34:0,
                 from /var/tmp/portage/app-emulation/virtualbox-modules-4.1.22/work/vboxpci/VBoxPci.c:38:
include/linux/iommu.h: In function 'iommu_group_alloc':
include/linux/iommu.h:272:2: error: implicit declaration of function 'ERR_PTR'
include/linux/iommu.h:272:2: warning: return makes pointer from integer without a cast
  CC [M]  /var/tmp/portage/app-emulation/virtualbox-modules-4.1.22/work/vboxpci/SUPR0IdcClientComponent.o
make[3]: *** [/var/tmp/portage/app-emulation/virtualbox-modules-4.1.22/work/vboxpci/VBoxPci.o] Error 1
make[3]: *** Waiting for unfinished jobs....
make[2]: *** [_module_/var/tmp/portage/app-emulation/virtualbox-modules-4.1.22/work/vboxpci] Error 2
make[2]: Leaving directory `/usr/src/linux-3.6.4-gentoo'
make[1]: *** [vboxpci] Error 2
make[1]: Leaving directory `/var/tmp/portage/app-emulation/virtualbox-modules-4.1.22/work/vboxpci'
cp: cannot stat 'vboxpci/vboxpci.ko': No such file or directory

>>> Source compiled.
>>> Test phase [not enabled]: app-emulation/virtualbox-modules-4.1.22

>>> Install virtualbox-modules-4.1.22 into /var/tmp/portage/app-emulation/virtualbox-modules-4.1.22/image/ category app-emulation
 * Installing vboxdrv module
 * Installing vboxnetflt module
 * Installing vboxnetadp module
 * Installing vboxpci module
install: cannot stat 'vboxpci.ko': No such file or directory
!!! doins: vboxpci.ko does not exist
 * ERROR: app-emulation/virtualbox-modules-4.1.22 failed (install phase):
 *   doins failed
 *
 * If you need support, post the output of `emerge --info '=app-emulation/virtualbox-modules-4.1.22'`,
 * the complete build log and the output of `emerge -pqv '=app-emulation/virtualbox-modules-4.1.22'`.
 * The complete build log is located at '/var/tmp/portage/app-emulation/virtualbox-modules-4.1.22/temp/build.log'.
 * The ebuild environment file is located at '/var/tmp/portage/app-emulation/virtualbox-modules-4.1.22/temp/environment'.
 * Working directory: '/var/tmp/portage/app-emulation/virtualbox-modules-4.1.22/work'
 * S: '/var/tmp/portage/app-emulation/virtualbox-modules-4.1.22/work'
 * QA Notice: file does not exist:
 *
 *    doins: vboxpci.ko does not exist

what will correct this ?
_________________
reach out a little bit more to catch it (DON'T BELIEVE the advocate part under my user name)
Back to top
View user's profile Send private message
Section_8
Guru
Guru


Joined: 22 May 2004
Posts: 477
Location: Arlington, TX, US

PostPosted: Wed Oct 31, 2012 2:54 am    Post subject: Reply with quote

Looks like this bug: https://bugs.gentoo.org/show_bug.cgi?id=433796
Back to top
View user's profile Send private message
patrix_neo
Guru
Guru


Joined: 08 Jan 2004
Posts: 374
Location: Svedala

PostPosted: Tue Jan 08, 2013 7:11 pm    Post subject: Reply with quote

I read the bugzilla linked by Section_8
This happened again with gentoo-kernel-3.6.11.

A workaround they say is to add

Code:
#include "err.h"   -->   /usr/src/linux/includes/linux/iommu.h


I did so as the third #include line in the iommu.h file and everything compiled fine.
Back to top
View user's profile Send private message
Section_8
Guru
Guru


Joined: 22 May 2004
Posts: 477
Location: Arlington, TX, US

PostPosted: Wed Jan 09, 2013 1:04 am    Post subject: Reply with quote

I also hit this problem after upgrading to the 3.6.11 kernel. I got around it by keywording virtualbox and installing 4.2.4.
Back to top
View user's profile Send private message
knecht
n00b
n00b


Joined: 28 Oct 2010
Posts: 11

PostPosted: Fri Jan 11, 2013 10:40 am    Post subject: Reply with quote

Have the same problem here. Kernel 3.6.11, app-emulation/virtualbox-modules-4.1.22 does not compile:
Code:

>>> Install virtualbox-modules-4.1.22 into /var/tmp/portage/app-emulation/virtualbox-modules-4.1.22/image/ category app-emulation
 * Installing vboxdrv module
 * Installing vboxnetflt module
 * Installing vboxnetadp module
 * Installing vboxpci module
install: der Aufruf von stat für „vboxpci.ko“ ist nicht möglich: Datei oder Verzeichnis nicht gefunden
!!! doins: vboxpci.ko does not exist
 * ERROR: app-emulation/virtualbox-modules-4.1.22 failed (install phase):
 *   doins failed
 *
 * If you need support, post the output of `emerge --info '=app-emulation/virtualbox-modules-4.1.22'`,
 * the complete build log and the output of `emerge -pqv '=app-emulation/virtualbox-modules-4.1.22'`.
 * The complete build log is located at '/var/tmp/portage/app-emulation/virtualbox-modules-4.1.22/temp/build.log'.
 * The ebuild environment file is located at '/var/tmp/portage/app-emulation/virtualbox-modules-4.1.22/temp/environment'.
 * Working directory: '/var/tmp/portage/app-emulation/virtualbox-modules-4.1.22/work'
 * S: '/var/tmp/portage/app-emulation/virtualbox-modules-4.1.22/work'
 * QA Notice: file does not exist:
 *
 *      doins: vboxpci.ko does not exist

>>> Failed to emerge app-emulation/virtualbox-modules-4.1.22, Log file:


I'll try to install 4.2.4 now
_________________
Linux, programming and image processing, thats fun!
Back to top
View user's profile Send private message
Display posts from previous:   
Reply to topic    Gentoo Forums Forum Index Portage & Programming All times are GMT
Page 1 of 1

 
Jump to:  
You cannot post new topics in this forum
You cannot reply to topics in this forum
You cannot edit your posts in this forum
You cannot delete your posts in this forum
You cannot vote in polls in this forum