Gentoo Forums
Gentoo Forums
Gentoo Forums
Quick Search: in
Cannot build wireshark
View unanswered posts
View posts from last 24 hours

 
Reply to topic    Gentoo Forums Forum Index Portage & Programming
View previous topic :: View next topic  
Author Message
ONEEYEMAN
Advocate
Advocate


Joined: 01 Mar 2005
Posts: 2066

PostPosted: Sat Oct 13, 2012 12:41 am    Post subject: Cannot build wireshark Reply with quote

Hi, ALL,
I'm trying to develop a client/server application and to analyse a network traffic I wanted to build a wireshark. However it failed to build:

Code:

                 from /usr/include/pango-1.0/pango/pango-gravity.h:99,
                 from /usr/include/pango-1.0/pango/pango-types.h:92,
                 from /usr/include/pango-1.0/pango/pango-font.h:27,
                 from /usr/include/pango-1.0/pango/pango-attributes.h:26,
                 from /usr/include/pango-1.0/pango/pango.h:26,
                 from /usr/include/gtk-2.0/gdk/gdktypes.h:38,
                 from /usr/include/gtk-2.0/gdk/gdkscreen.h:33,
                 from /usr/include/gtk-2.0/gdk/gdkapplaunchcontext.h:32,
                 from /usr/include/gtk-2.0/gdk/gdk.h:33,
                 from /usr/include/gtk-2.0/gtk/gtk.h:33,
                 from airpcap_dlg.c:34:
/usr/include/pango-1.0/pango/pango-language.h:37: error: expected '=', ',', ';', 'asm' or '__attribute__' before 'char'
/usr/include/pango-1.0/pango/pango-language.h:41: error: expected '=', ',', ';', 'asm' or '__attribute__' before 'char'
In file included from /usr/include/pango-1.0/pango/pango-script.h:139,
                 from /usr/include/pango-1.0/pango/pango-gravity.h:99,
                 from /usr/include/pango-1.0/pango/pango-types.h:92,
                 from /usr/include/pango-1.0/pango/pango-font.h:27,
                 from /usr/include/pango-1.0/pango/pango-attributes.h:26,
                 from /usr/include/pango-1.0/pango/pango.h:26,
                 from /usr/include/gtk-2.0/gdk/gdktypes.h:38,
                 from /usr/include/gtk-2.0/gdk/gdkscreen.h:33,
                 from /usr/include/gtk-2.0/gdk/gdkapplaunchcontext.h:32,
                 from /usr/include/gtk-2.0/gdk/gdk.h:33,
                 from /usr/include/gtk-2.0/gtk/gtk.h:33,
                 from airpcap_dlg.c:34:
/usr/include/pango-1.0/pango/pango-language.h:51: error: expected '=', ',', ';', 'asm' or '__attribute__' before 'PangoScript'
In file included from /usr/include/pango-1.0/pango/pango-attributes.h:26,
                 from /usr/include/pango-1.0/pango/pango.h:26,
                 from /usr/include/gtk-2.0/gdk/gdktypes.h:38,
                 from /usr/include/gtk-2.0/gdk/gdkscreen.h:33,
                 from /usr/include/gtk-2.0/gdk/gdkapplaunchcontext.h:32,
                 from /usr/include/gtk-2.0/gdk/gdk.h:33,
                 from /usr/include/gtk-2.0/gtk/gtk.h:33,
                 from airpcap_dlg.c:34:
/usr/include/pango-1.0/pango/pango-font.h:120: error: expected '=', ',', ';', 'asm' or '__attribute__' before 'char'
In file included from /usr/include/pango-1.0/pango/pango-attributes.h:26,
                 from /usr/include/pango-1.0/pango/pango.h:26,
                 from /usr/include/gtk-2.0/gdk/gdktypes.h:38,
                 from /usr/include/gtk-2.0/gdk/gdkscreen.h:33,
                 from /usr/include/gtk-2.0/gdk/gdkapplaunchcontext.h:32,
                 from /usr/include/gtk-2.0/gdk/gdk.h:33,
                 from /usr/include/gtk-2.0/gtk/gtk.h:33,
                 from airpcap_dlg.c:34:
/usr/include/pango-1.0/pango/pango-font.h:215: error: expected '=', ',', ';', 'asm' or '__attribute__' before 'char'
In file included from /usr/include/pango-1.0/pango/pango-attributes.h:26,
                 from /usr/include/pango-1.0/pango/pango.h:26,
                 from /usr/include/gtk-2.0/gdk/gdktypes.h:38,
                 from /usr/include/gtk-2.0/gdk/gdkscreen.h:33,
                 from /usr/include/gtk-2.0/gdk/gdkapplaunchcontext.h:32,
                 from /usr/include/gtk-2.0/gdk/gdk.h:33,
                 from /usr/include/gtk-2.0/gtk/gtk.h:33,
                 from airpcap_dlg.c:34:
/usr/include/pango-1.0/pango/pango-font.h:264: error: expected '=', ',', ';', 'asm' or '__attribute__' before 'char'
In file included from /usr/include/pango-1.0/pango/pango.h:26,
                 from /usr/include/gtk-2.0/gdk/gdktypes.h:38,
                 from /usr/include/gtk-2.0/gdk/gdkscreen.h:33,
                 from /usr/include/gtk-2.0/gdk/gdkapplaunchcontext.h:32,
                 from /usr/include/gtk-2.0/gdk/gdk.h:33,
                 from /usr/include/gtk-2.0/gtk/gtk.h:33,
                 from airpcap_dlg.c:34:
/usr/include/pango-1.0/pango/pango-attributes.h:183: error: expected '=', ',', ';', 'asm' or '__attribute__' before 'char'
In file included from /usr/include/pango-1.0/pango/pango.h:29,
                 from /usr/include/gtk-2.0/gdk/gdktypes.h:38,
                 from /usr/include/gtk-2.0/gdk/gdkscreen.h:33,
                 from /usr/include/gtk-2.0/gdk/gdkapplaunchcontext.h:32,
                 from /usr/include/gtk-2.0/gdk/gdk.h:33,
                 from /usr/include/gtk-2.0/gtk/gtk.h:33,
                 from airpcap_dlg.c:34:
/usr/include/pango-1.0/pango/pango-context.h:89: error: expected '=', ',', ';', 'asm' or '__attribute__' before 'PangoMatrix'
In file included from /usr/include/pango-1.0/pango/pango.h:41,
                 from /usr/include/gtk-2.0/gdk/gdktypes.h:38,
                 from /usr/include/gtk-2.0/gdk/gdkscreen.h:33,
                 from /usr/include/gtk-2.0/gdk/gdkapplaunchcontext.h:32,
                 from /usr/include/gtk-2.0/gdk/gdk.h:33,
                 from /usr/include/gtk-2.0/gtk/gtk.h:33,
                 from airpcap_dlg.c:34:
/usr/include/pango-1.0/pango/pango-layout.h:119: error: expected '=', ',', ';', 'asm' or '__attribute__' before 'PangoFontDescription'
In file included from /usr/include/pango-1.0/pango/pango.h:43,
                 from /usr/include/gtk-2.0/gdk/gdktypes.h:38,
                 from /usr/include/gtk-2.0/gdk/gdkscreen.h:33,
                 from /usr/include/gtk-2.0/gdk/gdkapplaunchcontext.h:32,
                 from /usr/include/gtk-2.0/gdk/gdk.h:33,
                 from /usr/include/gtk-2.0/gtk/gtk.h:33,
                 from airpcap_dlg.c:34:
/usr/include/pango-1.0/pango/pango-renderer.h:252: error: expected '=', ',', ';', 'asm' or '__attribute__' before 'PangoMatrix'
In file included from /usr/include/pango-1.0/pango/pango.h:47,
                 from /usr/include/gtk-2.0/gdk/gdktypes.h:38,
                 from /usr/include/gtk-2.0/gdk/gdkscreen.h:33,
                 from /usr/include/gtk-2.0/gdk/gdkapplaunchcontext.h:32,
                 from /usr/include/gtk-2.0/gdk/gdk.h:33,
                 from /usr/include/gtk-2.0/gtk/gtk.h:33,
                 from airpcap_dlg.c:34:
/usr/include/pango-1.0/pango/pango-utils.h:134: error: expected '=', ',', ';', 'asm' or '__attribute__' before 'char'
/usr/include/pango-1.0/pango/pango-utils.h:137: error: expected '=', ',', ';', 'asm' or '__attribute__' before 'char'
In file included from /usr/include/gtk-2.0/gdk/gdkevents.h:38,
                 from /usr/include/gtk-2.0/gdk/gdkdisplay.h:33,
                 from /usr/include/gtk-2.0/gdk/gdkscreen.h:34,
                 from /usr/include/gtk-2.0/gdk/gdkapplaunchcontext.h:32,
                 from /usr/include/gtk-2.0/gdk/gdk.h:33,
                 from /usr/include/gtk-2.0/gtk/gtk.h:33,
                 from airpcap_dlg.c:34:
/usr/include/gtk-2.0/gdk/gdkinput.h:133: error: expected '=', ',', ';', 'asm' or '__attribute__' before 'gchar'
In file included from /usr/include/gtk-2.0/gdk/gdkscreen.h:34,
                 from /usr/include/gtk-2.0/gdk/gdkapplaunchcontext.h:32,
                 from /usr/include/gtk-2.0/gdk/gdk.h:33,
                 from /usr/include/gtk-2.0/gtk/gtk.h:33,
                 from airpcap_dlg.c:34:
/usr/include/gtk-2.0/gdk/gdkdisplay.h:112: error: expected specifier-qualifier-list before 'G_CONST_RETURN'
/usr/include/gtk-2.0/gdk/gdkdisplay.h:144: error: expected '=', ',', ';', 'asm' or '__attribute__' before 'gchar'
In file included from /usr/include/gdk-pixbuf-2.0/gdk-pixbuf/gdk-pixbuf.h:36,
                 from /usr/include/gtk-2.0/gdk/gdkpixbuf.h:38,
                 from /usr/include/gtk-2.0/gdk/gdkcairo.h:29,
                 from /usr/include/gtk-2.0/gdk/gdk.h:34,
                 from /usr/include/gtk-2.0/gtk/gtk.h:33,
                 from airpcap_dlg.c:34:
/usr/include/gdk-pixbuf-2.0/gdk-pixbuf/gdk-pixbuf-core.h:260: error: expected '=', ',', ';', 'asm' or '__attribute__' before 'gchar'
In file included from /usr/include/gtk-2.0/gtk/gtk.h:33,
                 from airpcap_dlg.c:34:
/usr/include/gtk-2.0/gdk/gdk.h:83: error: expected '=', ',', ';', 'asm' or '__attribute__' before 'char'
/usr/include/gtk-2.0/gdk/gdk.h:97: error: expected '=', ',', ';', 'asm' or '__attribute__' before 'gchar'
In file included from /usr/include/atk-1.0/atk/atkobject.h:29,
                 from /usr/include/atk-1.0/atk/atk.h:26,
                 from /usr/include/gtk-2.0/gtk/gtkwidget.h:41,
                 from /usr/include/gtk-2.0/gtk/gtkcontainer.h:36,
                 from /usr/include/gtk-2.0/gtk/gtkbin.h:36,
                 from /usr/include/gtk-2.0/gtk/gtkwindow.h:37,
                 from /usr/include/gtk-2.0/gtk/gtkdialog.h:36,
                 from /usr/include/gtk-2.0/gtk/gtkaboutdialog.h:33,
                 from /usr/include/gtk-2.0/gtk/gtk.h:34,
                 from airpcap_dlg.c:34:
/usr/include/atk-1.0/atk/atkstate.h:173: error: expected '=', ',', ';', 'asm' or '__attribute__' before 'gchar'
In file included from /usr/include/atk-1.0/atk/atk.h:26,
                 from /usr/include/gtk-2.0/gtk/gtkwidget.h:41,
                 from /usr/include/gtk-2.0/gtk/gtkcontainer.h:36,
                 from /usr/include/gtk-2.0/gtk/gtkbin.h:36,
                 from /usr/include/gtk-2.0/gtk/gtkwindow.h:37,
                 from /usr/include/gtk-2.0/gtk/gtkdialog.h:36,
                 from /usr/include/gtk-2.0/gtk/gtkaboutdialog.h:33,
                 from /usr/include/gtk-2.0/gtk/gtk.h:34,
                 from airpcap_dlg.c:34:
/usr/include/atk-1.0/atk/atkobject.h:384: error: expected specifier-qualifier-list before 'G_CONST_RETURN'
In file included from /usr/include/atk-1.0/atk/atk.h:26,
                 from /usr/include/gtk-2.0/gtk/gtkwidget.h:41,
                 from /usr/include/gtk-2.0/gtk/gtkcontainer.h:36,
                 from /usr/include/gtk-2.0/gtk/gtkbin.h:36,
                 from /usr/include/gtk-2.0/gtk/gtkwindow.h:37,
                 from /usr/include/gtk-2.0/gtk/gtkdialog.h:36,
                 from /usr/include/gtk-2.0/gtk/gtkaboutdialog.h:33,
                 from /usr/include/gtk-2.0/gtk/gtk.h:34,
                 from airpcap_dlg.c:34:
/usr/include/atk-1.0/atk/atkobject.h:538: error: expected '=', ',', ';', 'asm' or '__attribute__' before 'gchar'
/usr/include/atk-1.0/atk/atkobject.h:539: error: expected '=', ',', ';', 'asm' or '__attribute__' before 'gchar'
/usr/include/atk-1.0/atk/atkobject.h:574: error: expected '=', ',', ';', 'asm' or '__attribute__' before 'gchar'
/usr/include/atk-1.0/atk/atkobject.h:585: error: expected '=', ',', ';', 'asm' or '__attribute__' before 'gchar'
In file included from /usr/include/atk-1.0/atk/atk.h:27,
                 from /usr/include/gtk-2.0/gtk/gtkwidget.h:41,
                 from /usr/include/gtk-2.0/gtk/gtkcontainer.h:36,
                 from /usr/include/gtk-2.0/gtk/gtkbin.h:36,
                 from /usr/include/gtk-2.0/gtk/gtkwindow.h:37,
                 from /usr/include/gtk-2.0/gtk/gtkdialog.h:36,
                 from /usr/include/gtk-2.0/gtk/gtkaboutdialog.h:33,
                 from /usr/include/gtk-2.0/gtk/gtk.h:34,
                 from airpcap_dlg.c:34:
/usr/include/atk-1.0/atk/atkaction.h:58: error: expected specifier-qualifier-list before 'G_CONST_RETURN'
In file included from /usr/include/atk-1.0/atk/atk.h:27,
                 from /usr/include/gtk-2.0/gtk/gtkwidget.h:41,
                 from /usr/include/gtk-2.0/gtk/gtkcontainer.h:36,
                 from /usr/include/gtk-2.0/gtk/gtkbin.h:36,
                 from /usr/include/gtk-2.0/gtk/gtkwindow.h:37,
                 from /usr/include/gtk-2.0/gtk/gtkdialog.h:36,
                 from /usr/include/gtk-2.0/gtk/gtkaboutdialog.h:33,
                 from /usr/include/gtk-2.0/gtk/gtk.h:34,
                 from airpcap_dlg.c:34:
/usr/include/atk-1.0/atk/atkaction.h:88: error: expected '=', ',', ';', 'asm' or '__attribute__' before 'gchar'
/usr/include/atk-1.0/atk/atkaction.h:90: error: expected '=', ',', ';', 'asm' or '__attribute__' before 'gchar'
/usr/include/atk-1.0/atk/atkaction.h:92: error: expected '=', ',', ';', 'asm' or '__attribute__' before 'gchar'
/usr/include/atk-1.0/atk/atkaction.h:100: error: expected '=', ',', ';', 'asm' or '__attribute__' before 'gchar'
In file included from /usr/include/atk-1.0/atk/atkcomponent.h:29,
                 from /usr/include/atk-1.0/atk/atk.h:28,
                 from /usr/include/gtk-2.0/gtk/gtkwidget.h:41,
                 from /usr/include/gtk-2.0/gtk/gtkcontainer.h:36,
                 from /usr/include/gtk-2.0/gtk/gtkbin.h:36,
                 from /usr/include/gtk-2.0/gtk/gtkwindow.h:37,
                 from /usr/include/gtk-2.0/gtk/gtkdialog.h:36,
                 from /usr/include/gtk-2.0/gtk/gtkaboutdialog.h:33,
                 from /usr/include/gtk-2.0/gtk/gtk.h:34,
                 from airpcap_dlg.c:34:
/usr/include/atk-1.0/atk/atkutil.h:150: error: expected specifier-qualifier-list before 'G_CONST_RETURN'
In file included from /usr/include/atk-1.0/atk/atkcomponent.h:29,
                 from /usr/include/atk-1.0/atk/atk.h:28,
                 from /usr/include/gtk-2.0/gtk/gtkwidget.h:41,
                 from /usr/include/gtk-2.0/gtk/gtkcontainer.h:36,
                 from /usr/include/gtk-2.0/gtk/gtkbin.h:36,
                 from /usr/include/gtk-2.0/gtk/gtkwindow.h:37,
                 from /usr/include/gtk-2.0/gtk/gtkdialog.h:36,
                 from /usr/include/gtk-2.0/gtk/gtkaboutdialog.h:33,
                 from /usr/include/gtk-2.0/gtk/gtk.h:34,
                 from airpcap_dlg.c:34:
/usr/include/atk-1.0/atk/atkutil.h:232: error: expected '=', ',', ';', 'asm' or '__attribute__' before 'gchar'
/usr/include/atk-1.0/atk/atkutil.h:237: error: expected '=', ',', ';', 'asm' or '__attribute__' before 'gchar'
/usr/include/atk-1.0/atk/atkutil.h:242: error: expected '=', ',', ';', 'asm' or '__attribute__' before 'gchar'
In file included from /usr/include/atk-1.0/atk/atk.h:29,
                 from /usr/include/gtk-2.0/gtk/gtkwidget.h:41,
                 from /usr/include/gtk-2.0/gtk/gtkcontainer.h:36,
                 from /usr/include/gtk-2.0/gtk/gtkbin.h:36,
                 from /usr/include/gtk-2.0/gtk/gtkwindow.h:37,
                 from /usr/include/gtk-2.0/gtk/gtkdialog.h:36,
                 from /usr/include/gtk-2.0/gtk/gtkaboutdialog.h:33,
                 from /usr/include/gtk-2.0/gtk/gtk.h:34,
                 from airpcap_dlg.c:34:
/usr/include/atk-1.0/atk/atkdocument.h:52: error: expected specifier-qualifier-list before 'G_CONST_RETURN'
/usr/include/atk-1.0/atk/atkdocument.h:71: error: expected '=', ',', ';', 'asm' or '__attribute__' before 'gchar'
/usr/include/atk-1.0/atk/atkdocument.h:73: error: expected '=', ',', ';', 'asm' or '__attribute__' before 'gchar'
/usr/include/atk-1.0/atk/atkdocument.h:75: error: expected '=', ',', ';', 'asm' or '__attribute__' before 'gchar'
In file included from /usr/include/atk-1.0/atk/atkeditabletext.h:29,
                 from /usr/include/atk-1.0/atk/atk.h:30,
                 from /usr/include/gtk-2.0/gtk/gtkwidget.h:41,
                 from /usr/include/gtk-2.0/gtk/gtkcontainer.h:36,
                 from /usr/include/gtk-2.0/gtk/gtkbin.h:36,
                 from /usr/include/gtk-2.0/gtk/gtkwindow.h:37,
                 from /usr/include/gtk-2.0/gtk/gtkdialog.h:36,
                 from /usr/include/gtk-2.0/gtk/gtkaboutdialog.h:33,
                 from /usr/include/gtk-2.0/gtk/gtk.h:34,
                 from airpcap_dlg.c:34:
/usr/include/atk-1.0/atk/atktext.h:358: error: expected '=', ',', ';', 'asm' or '__attribute__' before 'gchar'
/usr/include/atk-1.0/atk/atktext.h:360: error: expected '=', ',', ';', 'asm' or '__attribute__' before 'gchar'
In file included from /usr/include/atk-1.0/atk/atk.h:35,
                 from /usr/include/gtk-2.0/gtk/gtkwidget.h:41,
                 from /usr/include/gtk-2.0/gtk/gtkcontainer.h:36,
                 from /usr/include/gtk-2.0/gtk/gtkbin.h:36,
                 from /usr/include/gtk-2.0/gtk/gtkwindow.h:37,
                 from /usr/include/gtk-2.0/gtk/gtkdialog.h:36,
                 from /usr/include/gtk-2.0/gtk/gtkaboutdialog.h:33,
                 from /usr/include/gtk-2.0/gtk/gtk.h:34,
                 from airpcap_dlg.c:34:
/usr/include/atk-1.0/atk/atkimage.h:56: error: expected specifier-qualifier-list before 'G_CONST_RETURN'
/usr/include/atk-1.0/atk/atkimage.h:70: error: expected '=', ',', ';', 'asm' or '__attribute__' before 'gchar'
/usr/include/atk-1.0/atk/atkimage.h:83: error: expected '=', ',', ';', 'asm' or '__attribute__' before 'gchar'
In file included from /usr/include/atk-1.0/atk/atk.h:41,
                 from /usr/include/gtk-2.0/gtk/gtkwidget.h:41,
                 from /usr/include/gtk-2.0/gtk/gtkcontainer.h:36,
                 from /usr/include/gtk-2.0/gtk/gtkbin.h:36,
                 from /usr/include/gtk-2.0/gtk/gtkwindow.h:37,
                 from /usr/include/gtk-2.0/gtk/gtkdialog.h:36,
                 from /usr/include/gtk-2.0/gtk/gtkaboutdialog.h:33,
                 from /usr/include/gtk-2.0/gtk/gtk.h:34,
                 from airpcap_dlg.c:34:
/usr/include/atk-1.0/atk/atkrelation.h:64: error: expected '=', ',', ';', 'asm' or '__attribute__' before 'gchar'
In file included from /usr/include/atk-1.0/atk/atk.h:48,
                 from /usr/include/gtk-2.0/gtk/gtkwidget.h:41,
                 from /usr/include/gtk-2.0/gtk/gtkcontainer.h:36,
                 from /usr/include/gtk-2.0/gtk/gtkbin.h:36,
                 from /usr/include/gtk-2.0/gtk/gtkwindow.h:37,
                 from /usr/include/gtk-2.0/gtk/gtkdialog.h:36,
                 from /usr/include/gtk-2.0/gtk/gtkaboutdialog.h:33,
                 from /usr/include/gtk-2.0/gtk/gtk.h:34,
                 from airpcap_dlg.c:34:
/usr/include/atk-1.0/atk/atkstreamablecontent.h:61: error: expected specifier-qualifier-list before 'G_CONST_RETURN'
In file included from /usr/include/atk-1.0/atk/atk.h:48,
                 from /usr/include/gtk-2.0/gtk/gtkwidget.h:41,
                 from /usr/include/gtk-2.0/gtk/gtkcontainer.h:36,
                 from /usr/include/gtk-2.0/gtk/gtkbin.h:36,
                 from /usr/include/gtk-2.0/gtk/gtkwindow.h:37,
                 from /usr/include/gtk-2.0/gtk/gtkdialog.h:36,
                 from /usr/include/gtk-2.0/gtk/gtkaboutdialog.h:33,
                 from /usr/include/gtk-2.0/gtk/gtk.h:34,
                 from airpcap_dlg.c:34:
/usr/include/atk-1.0/atk/atkstreamablecontent.h:95: error: expected '=', ',', ';', 'asm' or '__attribute__' before 'gchar'
In file included from /usr/include/atk-1.0/atk/atk.h:49,
                 from /usr/include/gtk-2.0/gtk/gtkwidget.h:41,
                 from /usr/include/gtk-2.0/gtk/gtkcontainer.h:36,
                 from /usr/include/gtk-2.0/gtk/gtkbin.h:36,
                 from /usr/include/gtk-2.0/gtk/gtkwindow.h:37,
                 from /usr/include/gtk-2.0/gtk/gtkdialog.h:36,
                 from /usr/include/gtk-2.0/gtk/gtkaboutdialog.h:33,
                 from /usr/include/gtk-2.0/gtk/gtk.h:34,
                 from airpcap_dlg.c:34:
/usr/include/atk-1.0/atk/atktable.h:72: error: expected specifier-qualifier-list before 'G_CONST_RETURN'
/usr/include/atk-1.0/atk/atktable.h:166: error: expected '=', ',', ';', 'asm' or '__attribute__' before 'gchar'
/usr/include/atk-1.0/atk/atktable.h:171: error: expected '=', ',', ';', 'asm' or '__attribute__' before 'gchar'
In file included from /usr/include/gtk-2.0/gtk/gtkcontainer.h:36,
                 from /usr/include/gtk-2.0/gtk/gtkbin.h:36,
                 from /usr/include/gtk-2.0/gtk/gtkwindow.h:37,
                 from /usr/include/gtk-2.0/gtk/gtkdialog.h:36,
                 from /usr/include/gtk-2.0/gtk/gtkaboutdialog.h:33,
                 from /usr/include/gtk-2.0/gtk/gtk.h:34,
                 from airpcap_dlg.c:34:
/usr/include/gtk-2.0/gtk/gtkwidget.h:956: error: expected '=', ',', ';', 'asm' or '__attribute__' before 'gchar'
In file included from /usr/include/gtk-2.0/gtk/gtkdialog.h:36,
                 from /usr/include/gtk-2.0/gtk/gtkaboutdialog.h:33,
                 from /usr/include/gtk-2.0/gtk/gtk.h:34,
                 from airpcap_dlg.c:34:
/usr/include/gtk-2.0/gtk/gtkwindow.h:182: error: expected '=', ',', ';', 'asm' or '__attribute__' before 'gchar'
/usr/include/gtk-2.0/gtk/gtkwindow.h:190: error: expected '=', ',', ';', 'asm' or '__attribute__' before 'gchar'
/usr/include/gtk-2.0/gtk/gtkwindow.h:293: error: expected '=', ',', ';', 'asm' or '__attribute__' before 'gchar'
/usr/include/gtk-2.0/gtk/gtkwindow.h:299: error: expected '=', ',', ';', 'asm' or '__attribute__' before 'gchar'
In file included from /usr/include/gtk-2.0/gtk/gtk.h:34,
                 from airpcap_dlg.c:34:
/usr/include/gtk-2.0/gtk/gtkaboutdialog.h:82: error: expected '=', ',', ';', 'asm' or '__attribute__' before 'gchar'
/usr/include/gtk-2.0/gtk/gtkaboutdialog.h:85: error: expected '=', ',', ';', 'asm' or '__attribute__' before 'gchar'
/usr/include/gtk-2.0/gtk/gtkaboutdialog.h:88: error: expected '=', ',', ';', 'asm' or '__attribute__' before 'gchar'
/usr/include/gtk-2.0/gtk/gtkaboutdialog.h:91: error: expected '=', ',', ';', 'asm' or '__attribute__' before 'gchar'
/usr/include/gtk-2.0/gtk/gtkaboutdialog.h:94: error: expected '=', ',', ';', 'asm' or '__attribute__' before 'gchar'
/usr/include/gtk-2.0/gtk/gtkaboutdialog.h:102: error: expected '=', ',', ';', 'asm' or '__attribute__' before 'gchar'
/usr/include/gtk-2.0/gtk/gtkaboutdialog.h:105: error: expected '=', ',', ';', 'asm' or '__attribute__' before 'gchar'
/usr/include/gtk-2.0/gtk/gtkaboutdialog.h:108: error: expected '=', ',', ';', 'asm' or '__attribute__' before 'gchar'
/usr/include/gtk-2.0/gtk/gtkaboutdialog.h:111: error: expected '=', ',', ';', 'asm' or '__attribute__' before 'gchar'
/usr/include/gtk-2.0/gtk/gtkaboutdialog.h:114: error: expected '=', ',', ';', 'asm' or '__attribute__' before 'gchar'
/usr/include/gtk-2.0/gtk/gtkaboutdialog.h:117: error: expected '=', ',', ';', 'asm' or '__attribute__' before 'gchar'
/usr/include/gtk-2.0/gtk/gtkaboutdialog.h:123: error: expected '=', ',', ';', 'asm' or '__attribute__' before 'gchar'
In file included from /usr/include/gtk-2.0/gtk/gtklabel.h:37,
                 from /usr/include/gtk-2.0/gtk/gtkaccellabel.h:39,
                 from /usr/include/gtk-2.0/gtk/gtk.h:36,
                 from airpcap_dlg.c:34:
/usr/include/gtk-2.0/gtk/gtkmenu.h:185: error: expected '=', ',', ';', 'asm' or '__attribute__' before 'gchar'
In file included from /usr/include/gtk-2.0/gtk/gtkaccellabel.h:39,
                 from /usr/include/gtk-2.0/gtk/gtk.h:36,
                 from airpcap_dlg.c:34:
/usr/include/gtk-2.0/gtk/gtklabel.h:114: error: expected '=', ',', ';', 'asm' or '__attribute__' before 'gchar'
/usr/include/gtk-2.0/gtk/gtklabel.h:120: error: expected '=', ',', ';', 'asm' or '__attribute__' before 'gchar'
/usr/include/gtk-2.0/gtk/gtklabel.h:180: error: expected '=', ',', ';', 'asm' or '__attribute__' before 'gchar'
In file included from /usr/include/gtk-2.0/gtk/gtk.h:39,
                 from airpcap_dlg.c:34:
/usr/include/gtk-2.0/gtk/gtkaction.h:93: error: expected '=', ',', ';', 'asm' or '__attribute__' before 'gchar'
/usr/include/gtk-2.0/gtk/gtkaction.h:111: error: expected '=', ',', ';', 'asm' or '__attribute__' before 'gchar'
In file included from /usr/include/gtk-2.0/gtk/gtk.h:39,
                 from airpcap_dlg.c:34:
/usr/include/gtk-2.0/gtk/gtkaction.h:148: error: expected '=', ',', ';', 'asm' or '__attribute__' before 'gchar'
/usr/include/gtk-2.0/gtk/gtkaction.h:151: error: expected '=', ',', ';', 'asm' or '__attribute__' before 'gchar'
/usr/include/gtk-2.0/gtk/gtkaction.h:154: error: expected '=', ',', ';', 'asm' or '__attribute__' before 'gchar'
/usr/include/gtk-2.0/gtk/gtkaction.h:157: error: expected '=', ',', ';', 'asm' or '__attribute__' before 'gchar'
/usr/include/gtk-2.0/gtk/gtkaction.h:163: error: expected '=', ',', ';', 'asm' or '__attribute__' before 'gchar'
In file included from /usr/include/gtk-2.0/gtk/gtk.h:40,
                 from airpcap_dlg.c:34:
/usr/include/gtk-2.0/gtk/gtkactiongroup.h:113: error: expected '=', ',', ';', 'asm' or '__attribute__' before 'gchar'
/usr/include/gtk-2.0/gtk/gtkactiongroup.h:167: error: expected '=', ',', ';', 'asm' or '__attribute__' before 'gchar'
In file included from /usr/include/gtk-2.0/gtk/gtkaspectframe.h:36,
                 from /usr/include/gtk-2.0/gtk/gtk.h:45,
                 from airpcap_dlg.c:34:
/usr/include/gtk-2.0/gtk/gtkframe.h:77: error: expected '=', ',', ';', 'asm' or '__attribute__' before 'gchar'
In file included from /usr/include/gtk-2.0/gtk/gtk.h:46,
                 from airpcap_dlg.c:34:
/usr/include/gtk-2.0/gtk/gtkassistant.h:149: error: expected '=', ',', ';', 'asm' or '__attribute__' before 'gchar'
In file included from /usr/include/gtk-2.0/gtk/gtkbutton.h:37,
                 from /usr/include/gtk-2.0/gtk/gtk.h:53,
                 from airpcap_dlg.c:34:
/usr/include/gtk-2.0/gtk/gtkimage.h:254: error: expected declaration specifiers or '...' before 'G_CONST_RETURN'
In file included from /usr/include/gtk-2.0/gtk/gtk.h:53,
                 from airpcap_dlg.c:34:
/usr/include/gtk-2.0/gtk/gtkbutton.h:111: error: expected '=', ',', ';', 'asm' or '__attribute__' before 'gchar'
In file included from /usr/include/gtk-2.0/gtk/gtkcelllayout.h:29,
                 from /usr/include/gtk-2.0/gtk/gtk.h:56,
                 from airpcap_dlg.c:34:
/usr/include/gtk-2.0/gtk/gtktreeviewcolumn.h:185: error: expected '=', ',', ';', 'asm' or '__attribute__' before 'gchar'
In file included from /usr/include/gtk-2.0/gtk/gtkcheckmenuitem.h:36,
                 from /usr/include/gtk-2.0/gtk/gtk.h:68,
                 from airpcap_dlg.c:34:
/usr/include/gtk-2.0/gtk/gtkmenuitem.h:91: error: expected specifier-qualifier-list before 'G_CONST_RETURN'
/usr/include/gtk-2.0/gtk/gtkmenuitem.h:118: error: expected '=', ',', ';', 'asm' or '__attribute__' before 'gchar'
/usr/include/gtk-2.0/gtk/gtkmenuitem.h:122: error: expected '=', ',', ';', 'asm' or '__attribute__' before 'gchar'
In file included from /usr/include/gtk-2.0/gtk/gtk.h:70,
                 from airpcap_dlg.c:34:
/usr/include/gtk-2.0/gtk/gtkcolorbutton.h:98: error: expected '=', ',', ';', 'asm' or '__attribute__' before 'gchar'
In file included from /usr/include/gtk-2.0/gtk/gtkentry.h:43,
                 from /usr/include/gtk-2.0/gtk/gtktreeview.h:32,
                 from /usr/include/gtk-2.0/gtk/gtkcombobox.h:30,
                 from /usr/include/gtk-2.0/gtk/gtk.h:73,
                 from airpcap_dlg.c:34:
/usr/include/gtk-2.0/gtk/gtkentrybuffer.h:102: error: expected '=', ',', ';', 'asm' or '__attribute__' before 'gchar'
In file included from /usr/include/gtk-2.0/gtk/gtktreeview.h:32,
                 from /usr/include/gtk-2.0/gtk/gtkcombobox.h:30,
                 from /usr/include/gtk-2.0/gtk/gtk.h:73,
                 from airpcap_dlg.c:34:
/usr/include/gtk-2.0/gtk/gtkentry.h:191: error: expected '=', ',', ';', 'asm' or '__attribute__' before 'GtkBorder'
/usr/include/gtk-2.0/gtk/gtkentry.h:216: error: expected '=', ',', ';', 'asm' or '__attribute__' before 'gchar'
In file included from /usr/include/gtk-2.0/gtk/gtk.h:73,
                 from airpcap_dlg.c:34:
/usr/include/gtk-2.0/gtk/gtkcombobox.h:89: error: expected '=', ',', ';', 'asm' or '__attribute__' before 'gchar'
In file included from /usr/include/gtk-2.0/gtk/gtk.h:86,
                 from airpcap_dlg.c:34:
/usr/include/gtk-2.0/gtk/gtkexpander.h:79: error: expected '=', ',', ';', 'asm' or '__attribute__' before 'gchar'
In file included from /usr/include/gtk-2.0/gtk/gtkfilechooser.h:29,
                 from /usr/include/gtk-2.0/gtk/gtk.h:88,
                 from airpcap_dlg.c:34:
/usr/include/gtk-2.0/gtk/gtkfilefilter.h:64: error: expected '=', ',', ';', 'asm' or '__attribute__' before 'gchar'
In file included from /usr/include/gtk-2.0/gtk/gtk.h:89,
                 from airpcap_dlg.c:34:
/usr/include/gtk-2.0/gtk/gtkfilechooserbutton.h:80: error: expected '=', ',', ';', 'asm' or '__attribute__' before 'gchar'
In file included from /usr/include/gtk-2.0/gtk/gtk.h:93,
                 from airpcap_dlg.c:34:
/usr/include/gtk-2.0/gtk/gtkfontbutton.h:78: error: expected '=', ',', ';', 'asm' or '__attribute__' before 'gchar'
/usr/include/gtk-2.0/gtk/gtkfontbutton.h:87: error: expected '=', ',', ';', 'asm' or '__attribute__' before 'gchar'
In file included from /usr/include/gtk-2.0/gtk/gtk.h:94,
                 from airpcap_dlg.c:34:
/usr/include/gtk-2.0/gtk/gtkfontsel.h:208: error: expected '=', ',', ';', 'asm' or '__attribute__' before 'gchar'
In file included from /usr/include/gtk-2.0/gtk/gtk.h:106,
                 from airpcap_dlg.c:34:
/usr/include/gtk-2.0/gtk/gtkiconfactory.h:115: error: expected '=', ',', ';', 'asm' or '__attribute__' before 'gchar'
/usr/include/gtk-2.0/gtk/gtkiconfactory.h:158: error: expected '=', ',', ';', 'asm' or '__attribute__' before 'gchar'
/usr/include/gtk-2.0/gtk/gtkiconfactory.h:159: error: expected '=', ',', ';', 'asm' or '__attribute__' before 'gchar'
In file included from /usr/include/gtk-2.0/gtk/gtk.h:107,
                 from airpcap_dlg.c:34:
/usr/include/gtk-2.0/gtk/gtkicontheme.h:178: error: expected '=', ',', ';', 'asm' or '__attribute__' before 'gchar'
/usr/include/gtk-2.0/gtk/gtkicontheme.h:190: error: expected '=', ',', ';', 'asm' or '__attribute__' before 'gchar'
In file included from /usr/include/gtk-2.0/gtk/gtk.h:119,
                 from airpcap_dlg.c:34:
/usr/include/gtk-2.0/gtk/gtklinkbutton.h:74: error: expected '=', ',', ';', 'asm' or '__attribute__' before 'gchar'
In file included from /usr/include/gtk-2.0/gtk/gtkmenutoolbutton.h:31,
                 from /usr/include/gtk-2.0/gtk/gtk.h:126,
                 from airpcap_dlg.c:34:
/usr/include/gtk-2.0/gtk/gtktoolbutton.h:76: error: expected '=', ',', ';', 'asm' or '__attribute__' before 'gchar'
/usr/include/gtk-2.0/gtk/gtktoolbutton.h:82: error: expected '=', ',', ';', 'asm' or '__attribute__' before 'gchar'
/usr/include/gtk-2.0/gtk/gtktoolbutton.h:85: error: expected '=', ',', ';', 'asm' or '__attribute__' before 'gchar'
In file included from /usr/include/gtk-2.0/gtk/gtk.h:131,
                 from airpcap_dlg.c:34:
/usr/include/gtk-2.0/gtk/gtknotebook.h:264: error: expected '=', ',', ';', 'asm' or '__attribute__' before 'gchar'
/usr/include/gtk-2.0/gtk/gtknotebook.h:274: error: expected '=', ',', ';', 'asm' or '__attribute__' before 'gchar'
In file included from /usr/include/gtk-2.0/gtk/gtkpagesetup.h:30,
                 from /usr/include/gtk-2.0/gtk/gtk.h:135,
                 from airpcap_dlg.c:34:
/usr/include/gtk-2.0/gtk/gtkpapersize.h:67: error: expected '=', ',', ';', 'asm' or '__attribute__' before 'gchar'
/usr/include/gtk-2.0/gtk/gtkpapersize.h:68: error: expected '=', ',', ';', 'asm' or '__attribute__' before 'gchar'
/usr/include/gtk-2.0/gtk/gtkpapersize.h:69: error: expected '=', ',', ';', 'asm' or '__attribute__' before 'gchar'
/usr/include/gtk-2.0/gtk/gtkpapersize.h:90: error: expected '=', ',', ';', 'asm' or '__attribute__' before 'gchar'
In file included from /usr/include/gtk-2.0/gtk/gtkprintoperation.h:34,
                 from /usr/include/gtk-2.0/gtk/gtk.h:140,
                 from airpcap_dlg.c:34:
/usr/include/gtk-2.0/gtk/gtkprintsettings.h:74: error: expected '=', ',', ';', 'asm' or '__attribute__' before 'gchar'
In file included from /usr/include/gtk-2.0/gtk/gtkprintoperation.h:34,
                 from /usr/include/gtk-2.0/gtk/gtk.h:140,
                 from airpcap_dlg.c:34:
/usr/include/gtk-2.0/gtk/gtkprintsettings.h:148: error: expected '=', ',', ';', 'asm' or '__attribute__' before 'gchar'
/usr/include/gtk-2.0/gtk/gtkprintsettings.h:216: error: expected '=', ',', ';', 'asm' or '__attribute__' before 'gchar'
/usr/include/gtk-2.0/gtk/gtkprintsettings.h:219: error: expected '=', ',', ';', 'asm' or '__attribute__' before 'gchar'
/usr/include/gtk-2.0/gtk/gtkprintsettings.h:222: error: expected '=', ',', ';', 'asm' or '__attribute__' before 'gchar'
/usr/include/gtk-2.0/gtk/gtkprintsettings.h:225: error: expected '=', ',', ';', 'asm' or '__attribute__' before 'gchar'
/usr/include/gtk-2.0/gtk/gtkprintsettings.h:228: error: expected '=', ',', ';', 'asm' or '__attribute__' before 'gchar'
In file included from /usr/include/gtk-2.0/gtk/gtk.h:140,
                 from airpcap_dlg.c:34:
/usr/include/gtk-2.0/gtk/gtkprintoperation.h:176: error: expected '=', ',', ';', 'asm' or '__attribute__' before 'gchar'
In file included from /usr/include/gtk-2.0/gtk/gtk.h:143,
                 from airpcap_dlg.c:34:
/usr/include/gtk-2.0/gtk/gtkprogressbar.h:139: error: expected '=', ',', ';', 'asm' or '__attribute__' before 'gchar'
In file included from /usr/include/gtk-2.0/gtk/gtkrecentaction.h:31,
                 from /usr/include/gtk-2.0/gtk/gtk.h:150,
                 from airpcap_dlg.c:34:
/usr/include/gtk-2.0/gtk/gtkrecentmanager.h:179: error: expected '=', ',', ';', 'asm' or '__attribute__' before 'gchar'
/usr/include/gtk-2.0/gtk/gtkrecentmanager.h:180: error: expected '=', ',', ';', 'asm' or '__attribute__' before 'gchar'
/usr/include/gtk-2.0/gtk/gtkrecentmanager.h:181: error: expected '=', ',', ';', 'asm' or '__attribute__' before 'gchar'
/usr/include/gtk-2.0/gtk/gtkrecentmanager.h:182: error: expected '=', ',', ';', 'asm' or '__attribute__' before 'gchar'
In file included from /usr/include/gtk-2.0/gtk/gtkrecentchooser.h:32,
                 from /usr/include/gtk-2.0/gtk/gtk.h:151,
                 from airpcap_dlg.c:34:
/usr/include/gtk-2.0/gtk/gtkrecentfilter.h:69: error: expected '=', ',', ';', 'asm' or '__attribute__' before 'gchar'
In file included from /usr/include/gtk-2.0/gtk/gtk.h:173,
                 from airpcap_dlg.c:34:
/usr/include/gtk-2.0/gtk/gtkstatusicon.h:103: error: expected '=', ',', ';', 'asm' or '__attribute__' before 'gchar'
/usr/include/gtk-2.0/gtk/gtkstatusicon.h:104: error: expected '=', ',', ';', 'asm' or '__attribute__' before 'gchar'
/usr/include/gtk-2.0/gtk/gtkstatusicon.h:125: error: expected '=', ',', ';', 'asm' or '__attribute__' before 'gchar'
In file included from /usr/include/gtk-2.0/gtk/gtktextbuffer.h:39,
                 from /usr/include/gtk-2.0/gtk/gtk.h:178,
                 from airpcap_dlg.c:34:
/usr/include/gtk-2.0/gtk/gtktextmark.h:97: error: expected '=', ',', ';', 'asm' or '__attribute__' before 'gchar'
In file included from /usr/include/gtk-2.0/gtk/gtk.h:192,
                 from airpcap_dlg.c:34:
/usr/include/gtk-2.0/gtk/gtktoolitemgroup.h:75: error: expected '=', ',', ';', 'asm' or '__attribute__' before 'gchar'
In file included from /usr/include/gtk-2.0/gtk/gtk.h:193,
                 from airpcap_dlg.c:34:
/usr/include/gtk-2.0/gtk/gtktoolpalette.h:138: error: expected '=', ',', ';', 'asm' or '__attribute__' before 'GtkTargetEntry'
/usr/include/gtk-2.0/gtk/gtktoolpalette.h:139: error: expected '=', ',', ';', 'asm' or '__attribute__' before 'GtkTargetEntry'
airpcap_dlg.c: In function 'on_add_key_ok_bt_clicked':
airpcap_dlg.c:609: warning: implicit declaration of function 'gtk_entry_get_text'
airpcap_dlg.c:609: warning: passing argument 1 of 'g_strdup' makes pointer from integer without a cast
/usr/include/glib-2.0/glib/gstrfuncs.h:190: note: expected 'const gchar *' but argument is of type 'int'
airpcap_dlg.c:610: warning: passing argument 1 of 'g_strdup' makes pointer from integer without a cast
/usr/include/glib-2.0/glib/gstrfuncs.h:190: note: expected 'const gchar *' but argument is of type 'int'
airpcap_dlg.c: In function 'on_edit_key_ok_bt_clicked':
airpcap_dlg.c:786: warning: passing argument 1 of 'g_strdup' makes pointer from integer without a cast
/usr/include/glib-2.0/glib/gstrfuncs.h:190: note: expected 'const gchar *' but argument is of type 'int'
airpcap_dlg.c:787: warning: passing argument 1 of 'g_strdup' makes pointer from integer without a cast
/usr/include/glib-2.0/glib/gstrfuncs.h:190: note: expected 'const gchar *' but argument is of type 'int'
make[2]: *** [libgtkui_a-airpcap_dlg.o] Error 1
make[2]: Leaving directory `/var/tmp/portage/net-analyzer/wireshark-1.8.3-r2/work/wireshark-1.8.3/ui/gtk'
make[1]: *** [all-recursive] Error 1
make[1]: Leaving directory `/var/tmp/portage/net-analyzer/wireshark-1.8.3-r2/work/wireshark-1.8.3'
make: *** [all] Error 2
 * ERROR: net-analyzer/wireshark-1.8.3-r2 failed (compile phase):
 *   emake failed
 *
 * If you need support, post the output of `emerge --info '=net-analyzer/wireshark-1.8.3-r2'`,
 * the complete build log and the output of `emerge -pqv '=net-analyzer/wireshark-1.8.3-r2'`.
 * The complete build log is located at '/var/tmp/portage/net-analyzer/wireshark-1.8.3-r2/temp/build.log'.
 * The ebuild environment file is located at '/var/tmp/portage/net-analyzer/wireshark-1.8.3-r2/temp/environment'.
 * Working directory: '/var/tmp/portage/net-analyzer/wireshark-1.8.3-r2/work/wireshark-1.8.3'
 * S: '/var/tmp/portage/net-analyzer/wireshark-1.8.3-r2/work/wireshark-1.8.3'

>>> Failed to emerge net-analyzer/wireshark-1.8.3-r2, Log file:

>>>  '/var/tmp/portage/net-analyzer/wireshark-1.8.3-r2/temp/build.log'

 * Messages for package net-analyzer/wireshark-1.8.3-r2:

 * ERROR: net-analyzer/wireshark-1.8.3-r2 failed (compile phase):
 *   emake failed
 *
 * If you need support, post the output of `emerge --info '=net-analyzer/wireshark-1.8.3-r2'`,
 * the complete build log and the output of `emerge -pqv '=net-analyzer/wireshark-1.8.3-r2'`.
 * The complete build log is located at '/var/tmp/portage/net-analyzer/wireshark-1.8.3-r2/temp/build.log'.
 * The ebuild environment file is located at '/var/tmp/portage/net-analyzer/wireshark-1.8.3-r2/temp/environment'.
 * Working directory: '/var/tmp/portage/net-analyzer/wireshark-1.8.3-r2/work/wireshark-1.8.3'
 * S: '/var/tmp/portage/net-analyzer/wireshark-1.8.3-r2/work/wireshark-1.8.3'


System info:

Code:

IgorsGentooOnNetwork igor # emerge --info
Portage 2.1.11.9 (default/linux/x86/10.0, gcc-4.4.5, glibc-2.11.3, 2.6.36-gentoo-r8 i686)
=================================================================
System uname: Linux-2.6.36-gentoo-r8-i686-Genuine_Intel-R-_CPU_T1350_@_1.86GHz-with-gentoo-1.12.14
Timestamp of tree: Fri, 12 Oct 2012 19:45:01 +0000
ccache version 2.4 [enabled]
app-shells/bash:          4.1_p9
dev-lang/python:          2.6.8, 3.1.5
dev-util/ccache:          2.4-r9
dev-util/cmake:           2.8.1-r2
dev-util/pkgconfig:       0.27.1
sys-apps/baselayout:      1.12.14-r1
sys-apps/sandbox:         2.4
sys-devel/autoconf:       2.13, 2.68
sys-devel/automake:       1.11.1
sys-devel/binutils:       2.20.1-r1
sys-devel/gcc:            4.4.5
sys-devel/gcc-config:     1.4.1
sys-devel/libtool:        2.2.10
sys-devel/make:           3.81-r2
sys-kernel/linux-headers: 2.6.36.1 (virtual/os-headers)
sys-libs/glibc:           2.11.3
Repositories: gentoo x-portage
ACCEPT_KEYWORDS="x86"
ACCEPT_LICENSE="* -@EULA AdobeFlash-10.1"
CBUILD="i686-pc-linux-gnu"
CFLAGS="-Os -march=prescott -pipe"
CHOST="i686-pc-linux-gnu"
CONFIG_PROTECT="/etc /usr/share/gnupg/qualified.txt"
CONFIG_PROTECT_MASK="/etc/ca-certificates.conf /etc/env.d /etc/fonts/fonts.conf /etc/gconf /etc/revdep-rebuild /etc/sandbox.d /etc/terminfo"
CXXFLAGS="-Os -march=prescott -pipe"
DISTDIR="/usr/portage/distfiles"
FCFLAGS="-O2 -march=i686 -pipe"
FEATURES="assume-digests binpkg-logs ccache config-protect-if-modified distlocks ebuild-locks fixlafiles news parallel-fetch parse-eapi-ebuild-head protect-owned sandbox sfperms strict unknown-features-warn unmerge-logs unmerge-orphans userfetch"
FFLAGS="-O2 -march=i686 -pipe"
GENTOO_MIRRORS="http://gentoo.osuosl.org/ "
LDFLAGS="-Wl,-O1 -Wl,--as-needed"
MAKEOPTS="-j2"
PKGDIR="/usr/portage/packages"
PORTAGE_CONFIGROOT="/"
PORTAGE_RSYNC_OPTS="--recursive --links --safe-links --perms --times --compress --force --whole-file --delete --stats --human-readable --timeout=180 --exclude=/distfiles --exclude=/local --exclude=/packages"
PORTAGE_TMPDIR="/var/tmp"
PORTDIR="/usr/portage"
PORTDIR_OVERLAY="/usr/local/portage"
SYNC="rsync://rsync.namerica.gentoo.org/gentoo-portage"
USE="X a52 acl acpi alsa apm berkdb bzip2 cdr clamav cli consolekit cracklib crypt cxx dbus dri dvd dvdr freetds gdbm gnome gpm gtk gtk2 iconv ipv6 lm_sensors modules mplayer mssql mudflap mysql ncurses nls nptl odbc opengl openmp pam pcre pmu policykit pppd pulseaudio readline session ssl sybase sybase-ct symlink tcpd theora truetype udev unicode usb wifi wxwindows x86 xine zlib" ALSA_CARDS="ali5451 als4000 atiixp atiixp-modem bt87x ca0106 cmipci emu10k1 emu10k1x ens1370 ens1371 es1938 es1968 fm801 hda-intel intel8x0 intel8x0m maestro3 trident usb-audio via82xx via82xx-modem ymfpci" ALSA_PCM_PLUGINS="adpcm alaw asym copy dmix dshare dsnoop empty extplug file hooks iec958 ioplug ladspa lfloat linear meter mmap_emul mulaw multi null plug rate route share shm softvol" APACHE2_MODULES="authn_core authz_core socache_shmcb unixd actions alias auth_basic authn_alias authn_anon authn_dbm authn_default authn_file authz_dbm authz_default authz_groupfile authz_host authz_owner authz_user autoindex cache cgi cgid dav dav_fs dav_lock deflate dir disk_cache env expires ext_filter file_cache filter headers include info log_config logio mem_cache mime mime_magic negotiation rewrite setenvif speling status unique_id userdir usertrack vhost_alias" CALLIGRA_FEATURES="kexi words flow plan sheets stage tables krita karbon braindump" CAMERAS="ptp2" COLLECTD_PLUGINS="df interface irq load memory rrdtool swap syslog" ELIBC="glibc" GPSD_PROTOCOLS="ashtech aivdm earthmate evermore fv18 garmin garmintxt gpsclock itrax mtk3301 nmea ntrip navcom oceanserver oldstyle oncore rtcm104v2 rtcm104v3 sirf superstar2 timing tsip tripmate tnt ubx" INPUT_DEVICES="evdev mouse keyboard synaptics" KERNEL="linux" LCD_DEVICES="bayrad cfontz cfontz633 glk hd44780 lb216 lcdm001 mtxorb ncurses text" LIBREOFFICE_EXTENSIONS="presenter-console presenter-minimizer" PHP_TARGETS="php5-3" PYTHON_TARGETS="python3_2 python2_7" RUBY_TARGETS="ruby18 ruby19" USERLAND="GNU" VIDEO_CARDS="intel" XTABLES_ADDONS="quota2 psd pknock lscan length2 ipv4options ipset ipp2p iface geoip fuzzy condition tee tarpit sysrq steal rawnat logmark ipmark dhcpmac delude chaos account"
Unset:  CPPFLAGS, CTARGET, EMERGE_DEFAULT_OPTS, INSTALL_MASK, LANG, LC_ALL, LINGUAS, PORTAGE_BUNZIP2_COMMAND, PORTAGE_COMPRESS, PORTAGE_COMPRESS_FLAGS, PORTAGE_RSYNC_EXTRA_OPTS, USE_PYTHON


I am on GNOME.

I can probably try to build the previous version in the mean time.

Thank you.
Back to top
View user's profile Send private message
ONEEYEMAN
Advocate
Advocate


Joined: 01 Mar 2005
Posts: 2066

PostPosted: Sat Oct 13, 2012 1:08 am    Post subject: Reply with quote

Older version of wireshark built and installed correctly.

Thank you.
Back to top
View user's profile Send private message
Display posts from previous:   
Reply to topic    Gentoo Forums Forum Index Portage & Programming All times are GMT
Page 1 of 1

 
Jump to:  
You cannot post new topics in this forum
You cannot reply to topics in this forum
You cannot edit your posts in this forum
You cannot delete your posts in this forum
You cannot vote in polls in this forum