Gentoo Forums
Gentoo Forums
Gentoo Forums
Quick Search: in
kde-base/kdelibs-3.5.10-r10 failed [cups-util.lo] Error 1
View unanswered posts
View posts from last 24 hours

 
Reply to topic    Gentoo Forums Forum Index Unsupported Software
View previous topic :: View next topic  
Author Message
padoor
Advocate
Advocate


Joined: 30 Dec 2005
Posts: 4055
Location: india

PostPosted: Wed Jul 25, 2012 2:45 am    Post subject: kde-base/kdelibs-3.5.10-r10 failed [cups-util.lo] Error 1 Reply with quote

Code:
hadow -Wpointer-arith -Wmissing-prototypes -Wwrite-strings -D_XOPEN_SOURCE=500 -D_BSD_SOURCE -DNDEBUG -O2  -O2 -march=i686 -pipe -Wformat-security -Wmissing-format-attribute -c -o cups-util.lo cups-util.c
cups-util.c: In function 'cupsGetConf':
cups-util.c:73:3: warning: implicit declaration of function 'snprintf'
cups-util.c:102:7: warning: implicit declaration of function 'fprintf'
cups-util.c:102:7: warning: incompatible implicit declaration of built-in function 'fprintf'
cups-util.c:102:15: error: 'stderr' undeclared (first use in this function)
cups-util.c:102:15: note: each undeclared identifier is reported only once for each function it appears in
cups-util.c: In function 'cupsPutConf':
cups-util.c:364:7: warning: incompatible implicit declaration of built-in function 'fprintf'
cups-util.c:364:15: error: 'stderr' undeclared (first use in this function)
cups-util.c: In function 'cups_local_auth':
cups-util.c:504:3: error: 'FILE' undeclared (first use in this function)
cups-util.c:504:10: error: 'fp' undeclared (first use in this function)
cups-util.c:515:9: warning: passing argument 1 of 'httpAddrLocalhost' from incompatible pointer type
/usr/include/cups/http.h:410:13: note: expected 'const union http_addr_t *' but argument is of type 'struct http_t *'
cups-util.c:532:3: warning: implicit declaration of function 'fopen'
cups-util.c:545:3: warning: implicit declaration of function 'fgets'
cups-util.c:546:3: warning: implicit declaration of function 'fclose'
cups-util.c: In function 'cupsGetConf':
cups-util.c:245:10: warning: ignoring return value of 'write', declared with attribute warn_unused_result
make[4]: *** [cups-util.lo] Error 1
make[4]: Leaving directory `/var/tmp/portage/kde-base/kdelibs-3.5.10-r10/work/kdelibs-3.5.10/kdeprint/cups/cupsdconf2'
make[3]: *** [all-recursive] Error 1
make[3]: Leaving directory `/var/tmp/portage/kde-base/kdelibs-3.5.10-r10/work/kdelibs-3.5.10/kdeprint/cups'
make[2]: *** [all-recursive] Error 1
make[2]: Leaving directory `/var/tmp/portage/kde-base/kdelibs-3.5.10-r10/work/kdelibs-3.5.10/kdeprint'
make[1]: *** [all-recursive] Error 1
make[1]: Leaving directory `/var/tmp/portage/kde-base/kdelibs-3.5.10-r10/work/kdelibs-3.5.10'
make: *** [all] Error 2
emake failed
 * ERROR: kde-base/kdelibs-3.5.10-r10 failed (compile phase):
 *   died running emake, kde_src_compile:make
 *
 * Call stack:
 *     ebuild.sh, line   85:  Called src_compile
 *   environment, line 4547:  Called kde_src_compile
 *   environment, line 3155:  Called kde_src_compile 'all'
 *   environment, line 3170:  Called kde_src_compile 'make'
 *   environment, line 3162:  Called die
 * The specific snippet of code:
 *                   emake || die "died running emake, $FUNCNAME:make"
 *
 * If you need support, post the output of `emerge --info '=kde-base/kdelibs-3.5.10-r10'`,
 * the complete build log and the output of `emerge -pqv '=kde-base/kdelibs-3.5.10-r10'`.
 * This ebuild used the following eclasses from overlays:
 *   /var/lib/layman/kde-sunset/eclass/kde.eclass
 *   /var/lib/layman/kde-sunset/eclass/kde-functions.eclass
 *   /var/lib/layman/kde-sunset/eclass/qt3.eclass
 * This ebuild is from an overlay named 'kde-sunset': '/var/lib/layman/kde-sunset/'
 * The complete build log is located at '/var/tmp/portage/kde-base/kdelibs-3.5.10-r10/temp/build.log'.
 * The ebuild environment file is located at '/var/tmp/portage/kde-base/kdelibs-3.5.10-r10/temp/environment'.
 * Working directory: '/var/tmp/portage/kde-base/kdelibs-3.5.10-r10/work/kdelibs-3.5.10'
 * S: '/var/tmp/portage/kde-base/kdelibs-3.5.10-r10/work/kdelibs-3.5.10'

>>> Failed to emerge kde-base/kdelibs-3.5.10-r10, Log file:


how do i solve this ?
_________________
reach out a little bit more to catch it (DON'T BELIEVE the advocate part under my user name)
Back to top
View user's profile Send private message
DaggyStyle
Advocate
Advocate


Joined: 22 Mar 2006
Posts: 4926

PostPosted: Wed Jul 25, 2012 6:04 am    Post subject: Reply with quote

an include is missing, most probably stdio.h but as kdelibs-3.5.10 is not officially supported, this post should go to unsupported sw.
_________________
Only two things are infinite, the universe and human stupidity and I'm not sure about the former - Albert Einstein
ProjectFootball
Back to top
View user's profile Send private message
John R. Graham
Administrator
Administrator


Joined: 08 Mar 2005
Posts: 7768
Location: Somewhere over Atlanta, Georgia

PostPosted: Wed Jul 25, 2012 11:29 am    Post subject: Reply with quote

Moved from Portage & Programming to Unsupported Software.

- John
_________________
This space intentionally left blank.
Back to top
View user's profile Send private message
proteusx
n00b
n00b


Joined: 21 Jan 2008
Posts: 43

PostPosted: Wed Jul 25, 2012 11:41 am    Post subject: Reply with quote

See this: kde-base/kdelibs-3.5.10-r10 failed (compile phase)[solved]
Back to top
View user's profile Send private message
Display posts from previous:   
Reply to topic    Gentoo Forums Forum Index Unsupported Software All times are GMT
Page 1 of 1

 
Jump to:  
You cannot post new topics in this forum
You cannot reply to topics in this forum
You cannot edit your posts in this forum
You cannot delete your posts in this forum
You cannot vote in polls in this forum