Gentoo Forums
Gentoo Forums
Gentoo Forums
Quick Search: in
Classic Gentoo "upgrade" [SOLVED]
View unanswered posts
View posts from last 24 hours

 
Reply to topic    Gentoo Forums Forum Index Gentoo on AMD64
View previous topic :: View next topic  
Author Message
earthy
Tux's lil' helper
Tux's lil' helper


Joined: 07 Jul 2006
Posts: 145

PostPosted: Tue Jul 17, 2012 4:19 pm    Post subject: Classic Gentoo "upgrade" [SOLVED] Reply with quote

was trying to play enemy-territory and posted my problems in another thread.Noone seems to have answers to that so I guessed I would try to update again.
Code:
emerge -e system

got up sandbox failure.
I think this is the relevant part from the middle:

Code:

!!! Please attach the following file when seeking support:
!!! /var/tmp/portage/sys-apps/sandbox-2.5/work/build-x86/config.log
 * ERROR: sys-apps/sandbox-2.5 failed (compile phase):
 *   econf failed
 *
 * Call stack:
 *          ebuild.sh, line   85:  Called src_compile
yes
checking for x86_64-pc-linux-gnu-gcc option to accept ISO C89...  *        environment, line 2576:  Called multijob_child_init 'sb_configure'
 *        environment, line 2105:  Called sb_configure
 *        environment, line 2523:  Called econf
 *   phase-helpers.sh, line  467:  Called die
 * The specific snippet of code:
 *                      die "econf failed"
 *
 * If you need support, post the output of `emerge --info '=sys-apps/sandbox-2.5'`,
 * the complete build log and the output of `emerge -pqv '=sys-apps/sandbox-2.5'`.
none needed
checking for style of include used by make...  * If configure failed with a 'cannot run C compiled programs' error, try this:
 * FEATURES=-sandbox emerge sandbox
GNU
/usr/lib64/portage/bin/isolated-functions.sh: line 214: wait: `econf failed': not a pid or valid job spec
checking dependency style of x86_64-pc-linux-gnu-gcc...  * The complete build log is located at '/var/tmp/portage/sys-apps/sandbox-2.5/temp/build.log'.
 * The ebuild environment file is located at '/var/tmp/portage/sys-apps/sandbox-2.5/temp/environment'.
 * Working directory: '/var/tmp/portage/sys-apps/sandbox-2.5/work/build-x86'
 * S: '/var/tmp/portage/sys-apps/sandbox-2.5/work/sandbox-2.5'





Code:
>>> Failed to emerge sys-apps/sandbox-2.5, Log file:

>>>  '/var/tmp/portage/sys-apps/sandbox-2.5/temp/build.log'

 * Messages for package sys-apps/sandbox-2.5:

 * ERROR: sys-apps/sandbox-2.5 failed (compile phase):
 *   econf failed
 *
 * Call stack:
 *          ebuild.sh, line   85:  Called src_compile
 *        environment, line 2576:  Called multijob_child_init 'sb_configure'
 *        environment, line 2105:  Called sb_configure
 *        environment, line 2523:  Called econf
 *   phase-helpers.sh, line  467:  Called die
 * The specific snippet of code:
 *                      die "econf failed"
 *
 * If you need support, post the output of `emerge --info '=sys-apps/sandbox-2.5'`,
 * the complete build log and the output of `emerge -pqv '=sys-apps/sandbox-2.5'`.
 * If configure failed with a 'cannot run C compiled programs' error, try this:
 * FEATURES=-sandbox emerge sandbox
 * The complete build log is located at '/var/tmp/portage/sys-apps/sandbox-2.5/temp/build.log'.
 * The ebuild environment file is located at '/var/tmp/portage/sys-apps/sandbox-2.5/temp/environment'.
 * Working directory: '/var/tmp/portage/sys-apps/sandbox-2.5/work/build-x86'
 * S: '/var/tmp/portage/sys-apps/sandbox-2.5/work/sandbox-2.5'[code/]


I tried emerge --resume-skipfirst as that has helped me in the past when I was stuck
Code:

emerge --resume-skipfirst
Usage: emerge [options]

emerge: error: no such option: --resume-skipfirst
I tried
[code]FEATURES=-sandbox emerge sandbox[/code]
with the same results.

I also did :
Code:

vomit earthy # emerge -uavDN world
--- Invalid atom in /etc/portage/package.use: =media-video/ffmpeg
--- Invalid atom in /etc/portage/package.use: =virtual/ffmpeg

These are the packages that would be merged, in order:

Calculating dependencies \ * EAPI assignment in ebuild 'media-gfx/blender-2.62::mistafunk' does not
 * conform with PMS section 7.3.1 (see bug #402167):
 *      valid EAPI assignment must occur on or before line: 8
 * NOTE: This error will soon become unconditionally fatal in a future
 * version of Portage, but at this time, it can by made non-fatal by
 * setting FEATURES=-parse-eapi-ebuild-head in make.conf.
 * EAPI assignment in ebuild 'media-gfx/blender-2.60::mistafunk' does not
 * conform with PMS section 7.3.1 (see bug #402167):
 *      valid EAPI assignment must occur on or before line: 8
 * NOTE: This error will soon become unconditionally fatal in a future
 * version of Portage, but at this time, it can by made non-fatal by
 * setting FEATURES=-parse-eapi-ebuild-head in make.conf.
 * EAPI assignment in ebuild 'media-gfx/blender-2.60_rc::mistafunk' does
 * not conform with PMS section 7.3.1 (see bug #402167):
 *      valid EAPI assignment must occur on or before line: 8
 * NOTE: This error will soon become unconditionally fatal in a future
 * version of Portage, but at this time, it can by made non-fatal by
 * setting FEATURES=-parse-eapi-ebuild-head in make.conf.
 * EAPI assignment in ebuild 'media-gfx/blender-2.59-r1::mistafunk' does
 * not conform with PMS section 7.3.1 (see bug #402167):
 *      valid EAPI assignment must occur on or before line: 8
 * NOTE: This error will soon become unconditionally fatal in a future
 * version of Portage, but at this time, it can by made non-fatal by
 * setting FEATURES=-parse-eapi-ebuild-head in make.conf.

put FEATURES=-parse-eapi-ebuild-head in make.conf.
and removed mistafunk overlay

then again
Code:
emerge -uavDN world
--- Invalid atom in /etc/portage/package.use: =media-video/ffmpeg
--- Invalid atom in /etc/portage/package.use: =virtual/ffmpeg

These are the packages that would be merged, in order:

Calculating dependencies... done!
[ebuild  N     ] app-emulation/wine-1.4  USE="X alsa gecko jpeg lcms ldap mp3 ncurses nls opengl oss perl png ssl threads truetype udisks win32 win64 xml -capi -cups -custom-cflags -fontconfig -gnutls -gphoto2 -gsm (-gstreamer) -hardened -odbc -openal -opencl -samba -scanner (-selinux) -test -v4l -xcomposite -xinerama" 0 kB
[ebuild     U  ] x11-libs/qt-core-4.8.2 [4.8.1-r3] USE="exceptions glib iconv qt3support ssl (-aqua) (-c++0x) -debug -icu -optimized-qmake -pch (-qpa)" 0 kB
[ebuild     U  ] x11-libs/qt-dbus-4.8.2 [4.8.1] USE="exceptions (-aqua) (-c++0x) -debug -pch (-qpa)" 0 kB
[blocks b      ] <x11-libs/qt-dbus-4.8.2:4 ("<x11-libs/qt-dbus-4.8.2:4" is blocking x11-libs/qt-declarative-4.8.2, x11-libs/qt-qt3support-4.8.2, x11-libs/qt-webkit-4.8.2, x11-libs/qt-svg-4.8.2, x11-libs/qt-test-4.8.2, x11-libs/qt-xmlpatterns-4.8.2, x11-libs/qt-sql-4.8.2, x11-libs/qt-script-4.8.2, x11-libs/qt-gui-4.8.2, x11-libs/qt-opengl-4.8.2, x11-libs/qt-core-4.8.2)
[ebuild     U  ] x11-libs/qt-script-4.8.2 [4.8.1] USE="exceptions iconv (-aqua) (-c++0x) -debug (-jit*) -pch (-qpa)" 0 kB
[blocks b      ] <x11-libs/qt-script-4.8.2:4 ("<x11-libs/qt-script-4.8.2:4" is blocking x11-libs/qt-declarative-4.8.2, x11-libs/qt-qt3support-4.8.2, x11-libs/qt-webkit-4.8.2, x11-libs/qt-svg-4.8.2, x11-libs/qt-test-4.8.2, x11-libs/qt-xmlpatterns-4.8.2, x11-libs/qt-sql-4.8.2, x11-libs/qt-core-4.8.2, x11-libs/qt-gui-4.8.2, x11-libs/qt-opengl-4.8.2, x11-libs/qt-dbus-4.8.2)
[ebuild     U  ] x11-libs/qt-gui-4.8.2 [4.8.1-r1] USE="accessibility dbus exceptions gif glib mng qt3support tiff xv (-aqua) (-c++0x) -cups -debug -egl -gtkstyle -nas -nis -pch (-qpa) -trace -xinerama" 0 kB
[blocks b      ] <x11-libs/qt-gui-4.8.2:4 ("<x11-libs/qt-gui-4.8.2:4" is blocking x11-libs/qt-declarative-4.8.2, x11-libs/qt-qt3support-4.8.2, x11-libs/qt-webkit-4.8.2, x11-libs/qt-svg-4.8.2, x11-libs/qt-test-4.8.2, x11-libs/qt-xmlpatterns-4.8.2, x11-libs/qt-sql-4.8.2, x11-libs/qt-script-4.8.2, x11-libs/qt-core-4.8.2, x11-libs/qt-opengl-4.8.2, x11-libs/qt-dbus-4.8.2)
[ebuild     U  ] x11-libs/qt-sql-4.8.2 [4.8.1] USE="exceptions mysql qt3support sqlite (-aqua) (-c++0x) -debug -firebird -freetds -oci8% -odbc -pch -postgres (-qpa)" 0 kB
[blocks b      ] <x11-libs/qt-sql-4.8.2:4 ("<x11-libs/qt-sql-4.8.2:4" is blocking x11-libs/qt-declarative-4.8.2, x11-libs/qt-qt3support-4.8.2, x11-libs/qt-webkit-4.8.2, x11-libs/qt-svg-4.8.2, x11-libs/qt-test-4.8.2, x11-libs/qt-xmlpatterns-4.8.2, x11-libs/qt-script-4.8.2, x11-libs/qt-gui-4.8.2, x11-libs/qt-core-4.8.2, x11-libs/qt-opengl-4.8.2, x11-libs/qt-dbus-4.8.2)
[ebuild     U  ] x11-libs/qt-qt3support-4.8.2 [4.8.1] USE="accessibility exceptions (-aqua) (-c++0x) -debug -pch (-qpa)" 0 kB
[blocks b      ] <x11-libs/qt-qt3support-4.8.2:4 ("<x11-libs/qt-qt3support-4.8.2:4" is blocking x11-libs/qt-declarative-4.8.2, x11-libs/qt-webkit-4.8.2, x11-libs/qt-svg-4.8.2, x11-libs/qt-test-4.8.2, x11-libs/qt-xmlpatterns-4.8.2, x11-libs/qt-sql-4.8.2, x11-libs/qt-script-4.8.2, x11-libs/qt-gui-4.8.2, x11-libs/qt-core-4.8.2, x11-libs/qt-opengl-4.8.2, x11-libs/qt-dbus-4.8.2)
[ebuild     U  ] x11-libs/qt-test-4.8.2 [4.8.1] USE="exceptions (-aqua) (-c++0x) -debug -pch (-qpa)" 0 kB
[blocks b      ] <x11-libs/qt-test-4.8.2:4 ("<x11-libs/qt-test-4.8.2:4" is blocking x11-libs/qt-declarative-4.8.2, x11-libs/qt-qt3support-4.8.2, x11-libs/qt-webkit-4.8.2, x11-libs/qt-svg-4.8.2, x11-libs/qt-core-4.8.2, x11-libs/qt-xmlpatterns-4.8.2, x11-libs/qt-sql-4.8.2, x11-libs/qt-script-4.8.2, x11-libs/qt-gui-4.8.2, x11-libs/qt-opengl-4.8.2, x11-libs/qt-dbus-4.8.2)
[ebuild     U  ] x11-libs/qt-svg-4.8.2 [4.8.1] USE="accessibility exceptions (-aqua) (-c++0x) -debug -pch (-qpa)" 0 kB
[blocks b      ] <x11-libs/qt-svg-4.8.2:4 ("<x11-libs/qt-svg-4.8.2:4" is blocking x11-libs/qt-declarative-4.8.2, x11-libs/qt-qt3support-4.8.2, x11-libs/qt-webkit-4.8.2, x11-libs/qt-test-4.8.2, x11-libs/qt-xmlpatterns-4.8.2, x11-libs/qt-sql-4.8.2, x11-libs/qt-script-4.8.2, x11-libs/qt-gui-4.8.2, x11-libs/qt-core-4.8.2, x11-libs/qt-opengl-4.8.2, x11-libs/qt-dbus-4.8.2)
[ebuild     U  ] x11-libs/qt-opengl-4.8.2 [4.8.1] USE="exceptions qt3support (-aqua) (-c++0x) -debug -egl -pch (-qpa)" 0 kB
[blocks b      ] <x11-libs/qt-opengl-4.8.2:4 ("<x11-libs/qt-opengl-4.8.2:4" is blocking x11-libs/qt-declarative-4.8.2, x11-libs/qt-qt3support-4.8.2, x11-libs/qt-webkit-4.8.2, x11-libs/qt-svg-4.8.2, x11-libs/qt-test-4.8.2, x11-libs/qt-xmlpatterns-4.8.2, x11-libs/qt-sql-4.8.2, x11-libs/qt-script-4.8.2, x11-libs/qt-gui-4.8.2, x11-libs/qt-core-4.8.2, x11-libs/qt-dbus-4.8.2)
[ebuild     U  ] x11-libs/qt-xmlpatterns-4.8.2 [4.8.1] USE="(-aqua) (-c++0x) -debug -pch (-qpa)" 0 kB
[blocks b      ] <x11-libs/qt-xmlpatterns-4.8.2:4 ("<x11-libs/qt-xmlpatterns-4.8.2:4" is blocking x11-libs/qt-declarative-4.8.2, x11-libs/qt-qt3support-4.8.2, x11-libs/qt-webkit-4.8.2, x11-libs/qt-svg-4.8.2, x11-libs/qt-test-4.8.2, x11-libs/qt-core-4.8.2, x11-libs/qt-sql-4.8.2, x11-libs/qt-script-4.8.2, x11-libs/qt-gui-4.8.2, x11-libs/qt-opengl-4.8.2, x11-libs/qt-dbus-4.8.2)
[ebuild     U  ] x11-libs/qt-webkit-4.8.2 [4.8.1] USE="exceptions gstreamer jit (-aqua) -debug -icu* -pch (-qpa)" 0 kB
[blocks b      ] <x11-libs/qt-webkit-4.8.2:4 ("<x11-libs/qt-webkit-4.8.2:4" is blocking x11-libs/qt-declarative-4.8.2, x11-libs/qt-qt3support-4.8.2, x11-libs/qt-svg-4.8.2, x11-libs/qt-test-4.8.2, x11-libs/qt-xmlpatterns-4.8.2, x11-libs/qt-sql-4.8.2, x11-libs/qt-script-4.8.2, x11-libs/qt-gui-4.8.2, x11-libs/qt-core-4.8.2, x11-libs/qt-opengl-4.8.2, x11-libs/qt-dbus-4.8.2)
[blocks b      ] >x11-libs/qt-declarative-4.8.1-r9999:4 (">x11-libs/qt-declarative-4.8.1-r9999:4" is blocking x11-libs/qt-gui-4.8.1-r1, x11-libs/qt-webkit-4.8.1, x11-libs/qt-qt3support-4.8.1, x11-libs/qt-test-4.8.1, x11-libs/qt-svg-4.8.1, x11-libs/qt-sql-4.8.1, x11-libs/qt-xmlpatterns-4.8.1, x11-libs/qt-core-4.8.1-r3, x11-libs/qt-script-4.8.1, x11-libs/qt-dbus-4.8.1, x11-libs/qt-opengl-4.8.1)
[ebuild     U  ] app-crypt/gnupg-2.0.19 [2.0.17] USE="bzip2 ldap nls readline%* usb%* -adns -doc (-selinux) -smartcard -static (-caps%) (-openct%) (-pcsc-lite%)" 0 kB
[ebuild     U  ] x11-libs/qt-declarative-4.8.2 [4.8.1] USE="accessibility exceptions qt3support (-aqua) (-c++0x) -debug -pch (-qpa) -webkit" 0 kB
[blocks b      ] >x11-libs/qt-webkit-4.8.1-r9999:4 (">x11-libs/qt-webkit-4.8.1-r9999:4" is blocking x11-libs/qt-gui-4.8.1-r1, x11-libs/qt-qt3support-4.8.1, x11-libs/qt-test-4.8.1, x11-libs/qt-svg-4.8.1, x11-libs/qt-sql-4.8.1, x11-libs/qt-xmlpatterns-4.8.1, x11-libs/qt-declarative-4.8.1, x11-libs/qt-core-4.8.1-r3, x11-libs/qt-script-4.8.1, x11-libs/qt-dbus-4.8.1, x11-libs/qt-opengl-4.8.1)
[blocks b      ] >x11-libs/qt-core-4.8.1-r9999:4 (">x11-libs/qt-core-4.8.1-r9999:4" is blocking x11-libs/qt-gui-4.8.1-r1, x11-libs/qt-webkit-4.8.1, x11-libs/qt-qt3support-4.8.1, x11-libs/qt-test-4.8.1, x11-libs/qt-svg-4.8.1, x11-libs/qt-sql-4.8.1, x11-libs/qt-xmlpatterns-4.8.1, x11-libs/qt-declarative-4.8.1, x11-libs/qt-script-4.8.1, x11-libs/qt-dbus-4.8.1, x11-libs/qt-opengl-4.8.1)
[blocks b      ] >x11-libs/qt-dbus-4.8.1-r9999:4 (">x11-libs/qt-dbus-4.8.1-r9999:4" is blocking x11-libs/qt-gui-4.8.1-r1, x11-libs/qt-webkit-4.8.1, x11-libs/qt-qt3support-4.8.1, x11-libs/qt-test-4.8.1, x11-libs/qt-svg-4.8.1, x11-libs/qt-sql-4.8.1, x11-libs/qt-xmlpatterns-4.8.1, x11-libs/qt-declarative-4.8.1, x11-libs/qt-core-4.8.1-r3, x11-libs/qt-script-4.8.1, x11-libs/qt-opengl-4.8.1)
[blocks b      ] >x11-libs/qt-test-4.8.1-r9999:4 (">x11-libs/qt-test-4.8.1-r9999:4" is blocking x11-libs/qt-gui-4.8.1-r1, x11-libs/qt-webkit-4.8.1, x11-libs/qt-qt3support-4.8.1, x11-libs/qt-core-4.8.1-r3, x11-libs/qt-svg-4.8.1, x11-libs/qt-sql-4.8.1, x11-libs/qt-xmlpatterns-4.8.1, x11-libs/qt-declarative-4.8.1, x11-libs/qt-script-4.8.1, x11-libs/qt-dbus-4.8.1, x11-libs/qt-opengl-4.8.1)
[blocks b      ] >x11-libs/qt-xmlpatterns-4.8.1-r9999:4 (">x11-libs/qt-xmlpatterns-4.8.1-r9999:4" is blocking x11-libs/qt-gui-4.8.1-r1, x11-libs/qt-webkit-4.8.1, x11-libs/qt-qt3support-4.8.1, x11-libs/qt-test-4.8.1, x11-libs/qt-svg-4.8.1, x11-libs/qt-sql-4.8.1, x11-libs/qt-declarative-4.8.1, x11-libs/qt-core-4.8.1-r3, x11-libs/qt-script-4.8.1, x11-libs/qt-dbus-4.8.1, x11-libs/qt-opengl-4.8.1)
[blocks b      ] >x11-libs/qt-svg-4.8.1-r9999:4 (">x11-libs/qt-svg-4.8.1-r9999:4" is blocking x11-libs/qt-gui-4.8.1-r1, x11-libs/qt-webkit-4.8.1, x11-libs/qt-qt3support-4.8.1, x11-libs/qt-test-4.8.1, x11-libs/qt-sql-4.8.1, x11-libs/qt-opengl-4.8.1, x11-libs/qt-declarative-4.8.1, x11-libs/qt-script-4.8.1, x11-libs/qt-xmlpatterns-4.8.1, x11-libs/qt-dbus-4.8.1, x11-libs/qt-core-4.8.1-r3)
[blocks b      ] >x11-libs/qt-gui-4.8.1-r9999:4 (">x11-libs/qt-gui-4.8.1-r9999:4" is blocking x11-libs/qt-declarative-4.8.1, x11-libs/qt-webkit-4.8.1, x11-libs/qt-qt3support-4.8.1, x11-libs/qt-test-4.8.1, x11-libs/qt-svg-4.8.1, x11-libs/qt-sql-4.8.1, x11-libs/qt-xmlpatterns-4.8.1, x11-libs/qt-core-4.8.1-r3, x11-libs/qt-script-4.8.1, x11-libs/qt-dbus-4.8.1, x11-libs/qt-opengl-4.8.1)
[blocks b      ] >x11-libs/qt-qt3support-4.8.1-r9999:4 (">x11-libs/qt-qt3support-4.8.1-r9999:4" is blocking x11-libs/qt-gui-4.8.1-r1, x11-libs/qt-webkit-4.8.1, x11-libs/qt-declarative-4.8.1, x11-libs/qt-test-4.8.1, x11-libs/qt-svg-4.8.1, x11-libs/qt-sql-4.8.1, x11-libs/qt-xmlpatterns-4.8.1, x11-libs/qt-core-4.8.1-r3, x11-libs/qt-script-4.8.1, x11-libs/qt-dbus-4.8.1, x11-libs/qt-opengl-4.8.1)
[blocks b      ] <x11-libs/qt-declarative-4.8.2:4 ("<x11-libs/qt-declarative-4.8.2:4" is blocking x11-libs/qt-qt3support-4.8.2, x11-libs/qt-webkit-4.8.2, x11-libs/qt-svg-4.8.2, x11-libs/qt-test-4.8.2, x11-libs/qt-xmlpatterns-4.8.2, x11-libs/qt-sql-4.8.2, x11-libs/qt-script-4.8.2, x11-libs/qt-gui-4.8.2, x11-libs/qt-core-4.8.2, x11-libs/qt-opengl-4.8.2, x11-libs/qt-dbus-4.8.2)
[blocks b      ] >x11-libs/qt-sql-4.8.1-r9999:4 (">x11-libs/qt-sql-4.8.1-r9999:4" is blocking x11-libs/qt-gui-4.8.1-r1, x11-libs/qt-webkit-4.8.1, x11-libs/qt-qt3support-4.8.1, x11-libs/qt-test-4.8.1, x11-libs/qt-svg-4.8.1, x11-libs/qt-xmlpatterns-4.8.1, x11-libs/qt-declarative-4.8.1, x11-libs/qt-core-4.8.1-r3, x11-libs/qt-script-4.8.1, x11-libs/qt-dbus-4.8.1, x11-libs/qt-opengl-4.8.1)
[blocks b      ] >x11-libs/qt-script-4.8.1-r9999:4 (">x11-libs/qt-script-4.8.1-r9999:4" is blocking x11-libs/qt-gui-4.8.1-r1, x11-libs/qt-webkit-4.8.1, x11-libs/qt-qt3support-4.8.1, x11-libs/qt-test-4.8.1, x11-libs/qt-svg-4.8.1, x11-libs/qt-sql-4.8.1, x11-libs/qt-xmlpatterns-4.8.1, x11-libs/qt-declarative-4.8.1, x11-libs/qt-core-4.8.1-r3, x11-libs/qt-dbus-4.8.1, x11-libs/qt-opengl-4.8.1)
[blocks b      ] >x11-libs/qt-opengl-4.8.1-r9999:4 (">x11-libs/qt-opengl-4.8.1-r9999:4" is blocking x11-libs/qt-gui-4.8.1-r1, x11-libs/qt-webkit-4.8.1, x11-libs/qt-qt3support-4.8.1, x11-libs/qt-test-4.8.1, x11-libs/qt-svg-4.8.1, x11-libs/qt-sql-4.8.1, x11-libs/qt-xmlpatterns-4.8.1, x11-libs/qt-declarative-4.8.1, x11-libs/qt-script-4.8.1, x11-libs/qt-dbus-4.8.1, x11-libs/qt-core-4.8.1-r3)
[ebuild     U  ] media-gfx/gimp-2.6.12-r2 [2.6.12] USE="alsa dbus exif jpeg lcms mmx mng pdf png python sse svg tiff webkit wmf -aalib (-altivec) -curl -debug -doc -gnome -smp" LINGUAS="-am% -ar% -ast% -az% -be% -bg% -ca% -ca@valencia% -cs% -da% -de% -dz% -el% -en_CA% -en_GB% -eo% -es% -et% -eu% -fa% -fi% -fr% -ga% -gl% -gu% -he% -hi% -hr% -hu% -id% -is% -it% -ja% -ka% -kk% -km% -kn% -ko% -lt% -lv% -mk% -ml% -mr% -ms% -my% -nb% -nds% -ne% -nl% -nn% -oc% -or% -pa% -pl% -pt% -pt_BR% -ro% -ru% -rw% -si% -sk% -sl% -sr% -sr@latin% -sv% -ta% -th% -tr% -tt% -uk% -vi% -xh% -yi% -zh_CN% -zh_HK% -zh_TW%" 0 kB
[ebuild  NS   ~] media-gfx/blender-2.63a::alice [2.62-r2::aluco] USE="dds elbeem eltopo ffmpeg game-engine oceansim openal openexr openmp player sdl sndfile sse -collada -contrib -cuda -fftw -intl -jack -jpeg2k -libav -ndof -redcode -sm_10 -sm_11 -sm_12 -sm_13 -sm_20 -sm_21" LINGUAS="-ar -bg -ca -cs -de -el -en -es -fi -fr -hr -it -ja -ko -nl -pl -pt_BR -ro -ru -sr -sv -uk -zh_CN" 0 kB
[ebuild   R    ] media-sound/kaudiocreator-1.3  USE="(-aqua) -debug" LINGUAS="-af -ar -be -bg -br -bs -ca -ca@valencia -cs -cy -da -de -el -en_GB -eo -es -et -eu -fa -fi -fr -ga -gl -hi -hne -hr -is -it -ja -kk -km -lt -lv -mai -mk -ms -nb -nds -ne -nl -nn -oc -pa -pl -pt -pt_BR -ro -ru -se -sk -sl -sr -sr@Latn% -sr@ijekavian -sr@ijekavianlatin -sv -ta -tg -th -tr -ug -uk -xh -zh_CN -zh_HK -zh_TW (-sr@latin%)" 0 kB
Total: 17 packages (14 upgrades, 1 new, 1 in new slot, 1 reinstall), Size of downloads: 0 kB
Conflict: 23 blocks

!!! The following updates are masked by LICENSE changes:
- www-plugins/adobe-flash-11.2.202.236::gentoo (masked by: AdobeFlash-10.3 license(s))
A copy of the 'AdobeFlash-10.3' license is located at '/usr/portage/licenses/AdobeFlash-10.3'.

For more information, see the MASKED PACKAGES section in the emerge
man page or refer to the Gentoo Handbook.


!!! The following installed packages are masked:
- www-plugins/adobe-flash-11.1.102.55::gentoo (masked by: AdobeFlash-10.3 license(s))
A copy of the 'AdobeFlash-10.3' license is located at '/usr/portage/licenses/AdobeFlash-10.3'.

For more information, see the MASKED PACKAGES section in the emerge
man page or refer to the Gentoo Handbook.



Once again a qt block WTF.
Last time,I manually removed every single of these packages,there must be a better way.
What am I doing wrong?
Anyway I did
Code:
y


Code:
 OpenGL and Direct3D won't be supported.
This is an error since --with-opengl was requested.

!!! Please attach the following file when seeking support:
!!! /var/tmp/portage/app-emulation/wine-1.4/work/wine32/config.log
 * ERROR: app-emulation/wine-1.4 failed (configure phase):
 *   econf failed
 *
 * Call stack:
 *          ebuild.sh, line   85:  Called src_configure
 *        environment, line 3371:  Called do_configure '32' '--with-wine64=../wine64'
 *        environment, line  987:  Called econf '--sysconfdir=/etc/wine' '--with-alsa' '--without-capi' '--with-cms' '--without-cups' '--with-curses' '--with-dbus' '--without-fontconfig' '--without-gnutls' '--without-gphoto' '--without-gsm' '--without-gstreamer' '--without-hal' '--with-jpeg' '--with-ldap' '--with-mpg123' '--with-gettext' '--without-openal' '--without-opencl' '--with-opengl' '--with-openssl' '--with-oss' '--with-png' '--with-pthread' '--without-sane' '--disable-tests' '--with-freetype' '--without-v4l' '--with-x' '--without-xcomposite' '--without-xinerama' '--with-xml' '--with-xslt' '--with-wine64=../wine64'
 *   phase-helpers.sh, line  467:  Called die
 * The specific snippet of code:
 *                      die "econf failed"
 *
 * If you need support, post the output of `emerge --info '=app-emulation/wine-1.4'`,
 * the complete build log and the output of `emerge -pqv '=app-emulation/wine-1.4'`.
/usr/lib64/portage/bin/isolated-functions.sh: line 214: wait: `econf failed': not a pid or valid job spec
 * The complete build log is located at '/var/tmp/portage/app-emulation/wine-1.4/temp/build.log'.
 * The ebuild environment file is located at '/var/tmp/portage/app-emulation/wine-1.4/temp/environment'.
 * Working directory: '/var/tmp/portage/app-emulation/wine-1.4/work/wine32'
 * S: '/var/tmp/portage/app-emulation/wine-1.4/work/wine-1.4'

>>> Failed to emerge app-emulation/wine-1.4, Log file:

>>>  '/var/tmp/portage/app-emulation/wine-1.4/temp/build.log'

 * Messages for package app-emulation/wine-1.4:

 * ERROR: app-emulation/wine-1.4 failed (configure phase):
 *   econf failed
 *
 * Call stack:
 *          ebuild.sh, line   85:  Called src_configure
 *        environment, line 3371:  Called do_configure '32' '--with-wine64=../wine64'
 *        environment, line  987:  Called econf '--sysconfdir=/etc/wine' '--with-alsa' '--without-capi' '--with-cms' '--without-cups' '--with-curses' '--with-dbus' '--without-fontconfig' '--without-gnutls' '--without-gphoto' '--without-gsm' '--without-gstreamer' '--without-hal' '--with-jpeg' '--with-ldap' '--with-mpg123' '--with-gettext' '--without-openal' '--without-opencl' '--with-opengl' '--with-openssl' '--with-oss' '--with-png' '--with-pthread' '--without-sane' '--disable-tests' '--with-freetype' '--without-v4l' '--with-x' '--without-xcomposite' '--without-xinerama' '--with-xml' '--with-xslt' '--with-wine64=../wine64'
 *   phase-helpers.sh, line  467:  Called die
 * The specific snippet of code:
 *                      die "econf failed"
 *
 * If you need support, post the output of `emerge --info '=app-emulation/wine-1.4'`,
 * the complete build log and the output of `emerge -pqv '=app-emulation/wine-1.4'`.
 * The complete build log is located at '/var/tmp/portage/app-emulation/wine-1.4/temp/build.log'.
 * The ebuild environment file is located at '/var/tmp/portage/app-emulation/wine-1.4/temp/environment'.
 * Working directory: '/var/tmp/portage/app-emulation/wine-1.4/work/wine32'
 * S: '/var/tmp/portage/app-emulation/wine-1.4/work/wine-1.4'


Last edited by earthy on Wed Jul 25, 2012 4:54 pm; edited 3 times in total
Back to top
View user's profile Send private message
John R. Graham
Administrator
Administrator


Joined: 08 Mar 2005
Posts: 7883
Location: Somewhere over Atlanta, Georgia

PostPosted: Tue Jul 17, 2012 4:35 pm    Post subject: Reply with quote

I'm going to yell at you a little bit, so brace yourself. :P
  • Never run
    Code:
    emerge -e
    on an out of date system. Update first.
  • If the failure says to attach a file, as in
    Code:
    !!! Please attach the following file when seeking support:
    !!! /var/tmp/portage/sys-apps/sandbox-2.5/work/build-x86/config.log
    then it might be advisable to attach the file. There are other "post the output of..." recommendations there as well. wgetpaste is your friend.
  • You remembered the option wrong. It's not "--resume-skipfirst"; it's "--resume --skipfirst". Man page would've told you that.
  • Little 'b' blocks are those that Portage knows how to solve itself. They aren't any big deal: merely informative in nature. The emerge will not fail because of them.
  • You've got license updates to deal with. Read up on that and fix those issues.
  • You've got syntax errors in some of your /etc/portage/package.* files. Read up on that and fix those, too, while you're at it.
The long and short of it is, please clean up what you can clean up and give us what we need to help you.

Now, that said, Gentoo does tend to punish you if you go too long between updates. I think that's more of a "nature of the beast" issue and a "problem to fix", but it's definitely true. You might want to update a little more often.

- John
_________________
I can confirm that I have received between 0 and 999 National Security Letters.
Back to top
View user's profile Send private message
earthy
Tux's lil' helper
Tux's lil' helper


Joined: 07 Jul 2006
Posts: 145

PostPosted: Tue Jul 17, 2012 4:43 pm    Post subject: Reply with quote

Thank you.
How do I update if not with emerge -e system ?
Back to top
View user's profile Send private message
John R. Graham
Administrator
Administrator


Joined: 08 Mar 2005
Posts: 7883
Location: Somewhere over Atlanta, Georgia

PostPosted: Tue Jul 17, 2012 4:52 pm    Post subject: Reply with quote

--emptytree (short form -e) isn't for updating at all. It's for recompiling everything. The only time it's necessary is if you got a shiny new compiler version and/or have discovered new CFLAGS to try out and believe that you'll benefit from recompiling all of your packages with the new compiler and/or CFLAGS. To just update those things that are out of date, use --update (short for -u). There are several additional nuances to updating that have their own command line options. Here are some of them:
  • --deep (short for -D) forces a (usually unnecessary deep dependency analysis.
  • --newuse (short for -N) will recompile any package for which the USE flags have changes since it was last compiled.
  • --with-bdeps=y (no short form) will update out of date packages that are on your system only because they're needed to build a package that you explicitly wanted.
There are other nuances. The emerge and portage man pages are your friends. :wink:

A good old standard rule of thumb update command is
Code:
emerge --update --deep --newuse --verbose --ask world
short form
Code:
emerge -uDNva world
Also note that "system" isn't your whole system, "world" is. That's what you should be using for routine updates. You might want to re-read A Portage Introduction from the Handbook.

- John
_________________
I can confirm that I have received between 0 and 999 National Security Letters.


Last edited by John R. Graham on Tue Jul 17, 2012 5:00 pm; edited 3 times in total
Back to top
View user's profile Send private message
earthy
Tux's lil' helper
Tux's lil' helper


Joined: 07 Jul 2006
Posts: 145

PostPosted: Tue Jul 17, 2012 4:53 pm    Post subject: Reply with quote

Code:
vomit earthy # emerge --info '=sys-apps/sandbox-2.5' | wgetpaste
--- Invalid atom in /etc/portage/package.use: =media-video/ffmpeg
--- Invalid atom in /etc/portage/package.use: =virtual/ffmpeg
Your paste can be seen here: http://bpaste.net/show/35445/
Back to top
View user's profile Send private message
earthy
Tux's lil' helper
Tux's lil' helper


Joined: 07 Jul 2006
Posts: 145

PostPosted: Tue Jul 17, 2012 4:57 pm    Post subject: Reply with quote

Code:
emerge -pqv '=sys-apps/sandbox-2.5' | wgetpaste
--- Invalid atom in /etc/portage/package.use: =media-video/ffmpeg
--- Invalid atom in /etc/portage/package.use: =virtual/ffmpeg

!!! The following installed packages are masked:
- www-plugins/adobe-flash-11.1.102.55::gentoo (masked by: AdobeFlash-10.3 license(s))
A copy of the 'AdobeFlash-10.3' license is located at '/usr/portage/licenses/AdobeFlash-10.3'.

For more information, see the MASKED PACKAGES section in the emerge
man page or refer to the Gentoo Handbook.

Your paste can be seen here: http://bpaste.net/show/35446/


Code:

vomit earthy # wgetpaste /var/tmp/portage/sys-apps/sandbox-2.5/temp/build.log
Your paste can be seen here: http://bpaste.net/show/35448/
Back to top
View user's profile Send private message
John R. Graham
Administrator
Administrator


Joined: 08 Mar 2005
Posts: 7883
Location: Somewhere over Atlanta, Georgia

PostPosted: Tue Jul 17, 2012 5:04 pm    Post subject: Reply with quote

Do this one, too, please:
Code:
wgetpaste /var/tmp/portage/sys-apps/sandbox-2.5/temp/build.log
- John
_________________
I can confirm that I have received between 0 and 999 National Security Letters.
Back to top
View user's profile Send private message
earthy
Tux's lil' helper
Tux's lil' helper


Joined: 07 Jul 2006
Posts: 145

PostPosted: Tue Jul 17, 2012 5:17 pm    Post subject: Reply with quote

This is the 2nd day of my update.Thats why I tend to update seldom.I simply don't have time to update more often as I have 3 other boxes and as strangely as that sounds I installed Gentoo to use it ,not to update and fix it.I have a policy of updating the other boxes,and checking wether they have some problems,before I update this main box.1 of them has AMD64 and all updates went without problems.

Code:

 emerge --info | wgetpaste
--- Invalid atom in /etc/portage/package.use: =media-video/ffmpeg
--- Invalid atom in /etc/portage/package.use: =virtual/ffmpeg
Your paste can be seen here: http://bpaste.net/show/35449/


Code:
wgetpaste /var/tmp/portage/app-emulation/wine-1.4/work/wine32/config.log --verbose       
Apparently nothing was received. Perhaps the connection failed.
--2012-07-17 17:12:08--  http://bpaste.net/
Resolving bpaste.net... 178.79.129.106, 2a01:7e00::14:e002
Connecting to bpaste.net|178.79.129.106|:80... connected.
HTTP request sent, awaiting response... 200 OK
Length: 370682 (362K) [text/html]
Saving to: `/dev/null'

     0K .......... .......... .......... .......... .......... 13%  378K 1s
    50K .......... .......... .......... .......... .......... 27%  742K 1s
   100K .......... .......... .......... .......... .......... 41%  941K 0s
   150K .......... .......... .......... .......... .......... 55% 1.11M 0s
   200K .......... .......... .......... .......... .......... 69% 1.22M 0s
   250K .......... .......... .......... .......... .......... 82% 1.20M 0s
   300K .......... .......... .......... .......... .......... 96% 1.22M 0s
   350K .......... .                                          100% 1.30M=0.4s

2012-07-17 17:12:11 (849 KB/s) - `/dev/null' saved [370682/370682]

Lets forget wgetpaste,it produces for me more problems than it solves

Code:

 emerge --info '=app-emulation/wine-1.4'
Portage 2.1.10.65 (default/linux/amd64/10.0/desktop, gcc-4.5.3, glibc-2.14.1-r3, 3.2.1-gentoo-r2 x86_64)
=================================================================
                         System Settings
=================================================================
System uname: Linux-3.2.1-gentoo-r2-x86_64-AMD_FX-tm-4100_Quad-Core_Processor-with-gentoo-2.1
Timestamp of tree: Tue, 17 Jul 2012 02:45:01 +0000
app-shells/bash:          4.2_p20
dev-java/java-config:     2.1.11-r3
dev-lang/python:          2.6.6-r2, 2.7.3-r2, 3.1.4-r3, 3.2.3-r1
dev-util/cmake:           2.8.7-r5
dev-util/pkgconfig:       0.26
sys-apps/baselayout:      2.1-r1
sys-apps/openrc:          0.9.8.4
sys-apps/sandbox:         2.5
sys-devel/autoconf:       2.13, 2.68
sys-devel/automake:       1.9.6-r3, 1.10.3, 1.11.1
sys-devel/binutils:       2.21.1-r1
sys-devel/gcc:            4.4.6-r1, 4.5.3-r2
sys-devel/gcc-config:     1.6
sys-devel/libtool:        2.4-r1
sys-devel/make:           3.82-r1
sys-kernel/linux-headers: 3.4-r1 (virtual/os-headers)
sys-libs/glibc:           2.14.1-r3
Repositories: gentoo proaudio wavilen alice zugaina aluco
ACCEPT_KEYWORDS="amd64"
ACCEPT_LICENSE="* -@EULA"
CBUILD="x86_64-pc-linux-gnu"
CFLAGS="-O2 -pipe -march=amdfam10 -mtune=amdfam10 -mcx16 -msahf -maes -mpclmul -mpopcnt -mabm -mlwp -mavx"
CHOST="x86_64-pc-linux-gnu"
CONFIG_PROTECT="/etc /usr/share/config /usr/share/gnupg/qualified.txt"
CONFIG_PROTECT_MASK="/etc/ca-certificates.conf /etc/env.d /etc/env.d/java/ /etc/fonts/fonts.conf /etc/gconf /etc/gentoo-release /etc/revdep-rebuild /etc/sandbox.d /etc/terminfo /etc/texmf/language.dat.d /etc/texmf/language.def.d /etc/texmf/updmap.d /etc/texmf/web2c"
CXXFLAGS="-O2 -pipe"
DISTDIR="/usr/portage/distfiles"
FCFLAGS="-O2 -pipe"
FEATURES="assume-digests binpkg-logs config-protect-if-modified distlocks ebuild-locks fixlafiles news parallel-fetch protect-owned sfperms strict unknown-features-warn unmerge-logs unmerge-orphans userfetch"
FFLAGS="-O2 -pipe"
GENTOO_MIRRORS="ftp://mirror.bytemark.co.uk/gentoo/"
LANG="C"
LDFLAGS="-Wl,-O1 -Wl,--as-needed"
MAKEOPTS="-j5"
PKGDIR="/usr/portage/packages"
PORTAGE_CONFIGROOT="/"
PORTAGE_RSYNC_OPTS="--recursive --links --safe-links --perms --times --compress --force --whole-file --delete --stats --human-readable --timeout=180 --exclude=/distfiles --exclude=/local --exclude=/packages"
PORTAGE_TMPDIR="/var/tmp"
PORTDIR="/usr/portage"
PORTDIR_OVERLAY="/var/lib/layman/pro-audio /var/lib/layman/wavilen /var/lib/layman/alice /var/lib/layman/zugaina /var/lib/layman/aluco"
SYNC="rsync://rsync.uk.gentoo.org/gentoo-portage"
USE="3dnow 3dnowext X \ a52 aac acl acpi alsa amd64 amr apache2 berkdb bluetooth branding bzip2 cairo cdda cdr cli consolekit cracklib crypt curl cxx dba dbus dri dts dvd dvdr emboss encode examples exif expat fam ffmpeg firefox flac fortran fpm gd gdbm gif gpm gtk iconv imagemagick innodb ipv6 jpeg ladspa lash lcms ldap libnotify libsamplerate lm_sensors mad mmx mmxext mng modules mp3 mp4 mpeg mudflap multilib mysql ncurses nls nptl ntlm ogg openexr opengl openmp oss pam pango pcre pdf png policykit ppds pppd qt3support qt4 quicktime readline reiserfs sdl server session soundtouch spell sse sse2 sse3 sse4 ssl startup-notification svg symlinks tcpd tiff truetype twolame udev udisks unicode upower usb vhosts vorbis wxwidgets x264 xcb xml xml2 xorg xv xvid zlib" ALSA_CARDS="ali5451 als4000 atiixp atiixp-modem bt87x ca0106 cmipci emu10k1x ens1370 ens1371 es1938 es1968 fm801 hda-intel intel8x0 intel8x0m maestro3 trident usb-audio via82xx via82xx-modem ymfpci" ALSA_PCM_PLUGINS="adpcm alaw asym copy dmix dshare dsnoop empty extplug file hooks iec958 ioplug ladspa lfloat linear meter mmap_emul mulaw multi null plug rate route share shm softvol" APACHE2_MODULES="actions alias auth_basic authn_alias authn_anon authn_dbm authn_default authn_file authz_dbm authz_default authz_groupfile authz_host authz_owner authz_user autoindex cache cgi cgid dav dav_fs dav_lock deflate dir disk_cache env expires ext_filter file_cache filter headers include info log_config logio mem_cache mime mime_magic negotiation rewrite setenvif speling status unique_id userdir usertrack vhost_alias" CALLIGRA_FEATURES="kexi words flow plan sheets stage tables krita karbon braindump" CAMERAS="ptp2" COLLECTD_PLUGINS="df interface irq load memory rrdtool swap syslog" ELIBC="glibc" GPSD_PROTOCOLS="ashtech aivdm earthmate evermore fv18 garmin garmintxt gpsclock itrax mtk3301 nmea ntrip navcom oceanserver oldstyle oncore rtcm104v2 rtcm104v3 sirf superstar2 timing tsip tripmate tnt ubx" INPUT_DEVICES="evdev" KERNEL="linux" LCD_DEVICES="bayrad cfontz cfontz633 glk hd44780 lb216 lcdm001 mtxorb ncurses text" LIBREOFFICE_EXTENSIONS="presenter-console presenter-minimizer" PHP_TARGETS="php5-3" PYTHON_TARGETS="python3_2 python2_7" RUBY_TARGETS="ruby18 ruby19" USERLAND="GNU" VIDEO_CARDS="nvidia" XTABLES_ADDONS="quota2 psd pknock lscan length2 ipv4options ipset ipp2p iface geoip fuzzy condition tee tarpit sysrq steal rawnat logmark
ipmark dhcpmac delude chaos account"
Unset:  CPPFLAGS, CTARGET, EMERGE_DEFAULT_OPTS, INSTALL_MASK, LC_ALL, LINGUAS, PORTAGE_BUNZIP2_COMMAND, PORTAGE_COMPRESS, PORTAGE_COMPRESS_FLAGS, PORTAGE_RSYNC_EXTRA_OPTS, USE_PYTHON
Back to top
View user's profile Send private message
earthy
Tux's lil' helper
Tux's lil' helper


Joined: 07 Jul 2006
Posts: 145

PostPosted: Tue Jul 17, 2012 5:18 pm    Post subject: Reply with quote

vomit earthy # wgetpaste /var/tmp/portage/sys-apps/sandbox-2.5/temp/build.log
Your paste can be seen here: http://bpaste.net/show/35451/
Back to top
View user's profile Send private message
John R. Graham
Administrator
Administrator


Joined: 08 Mar 2005
Posts: 7883
Location: Somewhere over Atlanta, Georgia

PostPosted: Tue Jul 17, 2012 5:35 pm    Post subject: Reply with quote

This pastebin is truncated. Can you look at the pastebin, look at the actual build log on your system, and see if they match? If the do, then rebuild sandbox, like so
Code:
emerge -1v sandbox
and, if it fails, paste the build log. In any case, report back.

- John
_________________
I can confirm that I have received between 0 and 999 National Security Letters.
Back to top
View user's profile Send private message
earthy
Tux's lil' helper
Tux's lil' helper


Joined: 07 Jul 2006
Posts: 145

PostPosted: Tue Jul 17, 2012 5:54 pm    Post subject: Reply with quote

They matched so I am doing as suggested
Code:
 emerge -1v sandbox | wgetpaste
Your paste can be seen here: http://bpaste.net/show/35454/
Back to top
View user's profile Send private message
Thistled
Guru
Guru


Joined: 06 Jan 2011
Posts: 478
Location: Scotland

PostPosted: Tue Jul 17, 2012 5:58 pm    Post subject: Reply with quote

Hey earthy

You will lose the complaint about invalid atom
Code:
--- Invalid atom in /etc/portage/package.use: =media-video/ffmpeg
--- Invalid atom in /etc/portage/package.use: =virtual/ffmpeg

if you add the specific package version to the package.
eg:
Code:
=media-video/ffmpeg-0.10.3 sdl

Or drop the "=" completely.
So if you want the SDL (like above eg) USE flag on ffmpeg (for example), you would put the following:
Code:
media-video/ffmpeg sdl


In the short term I fixed my "sandbox" problem by disabling it for the troubled package.
Code:
USE="-sandbox" emerge blah blah blah etc

Then I resumed the emerge.

There is no such emerge flag as --resume-skip-first.
Try --resume or --keep-going
_________________
Whatever you do, do it properly!


Last edited by Thistled on Tue Jul 17, 2012 6:05 pm; edited 2 times in total
Back to top
View user's profile Send private message
John R. Graham
Administrator
Administrator


Joined: 08 Mar 2005
Posts: 7883
Location: Somewhere over Atlanta, Georgia

PostPosted: Tue Jul 17, 2012 6:04 pm    Post subject: Reply with quote

The important lines from the build log are:
build log:
checking for suffix of object files... configure: error: in `/var/tmp/portage/sys-apps/sandbox-2.5/work/build-x86':
configure: error: cannot run C compiled programs.
First try,
Code:
USE="-sandbox" emerge -1v sandbox
and report back. Oh, yeah. Could you also report the output of
Code:
gcc-config -l
please?

- John
_________________
I can confirm that I have received between 0 and 999 National Security Letters.
Back to top
View user's profile Send private message
earthy
Tux's lil' helper
Tux's lil' helper


Joined: 07 Jul 2006
Posts: 145

PostPosted: Tue Jul 17, 2012 6:18 pm    Post subject: Reply with quote

Quote:
Hey earthy

You will lose the complaint about invalid atom
Code:
--- Invalid atom in /etc/portage/package.use: =media-video/ffmpeg
--- Invalid atom in /etc/portage/package.use: =virtual/ffmpeg

if you add the specific package version to the package.
eg:

Already did.

Already tried USE="-sandbox" emerge blah blah blah etc
And I have FEATURES="-sandbox -ccache -distcc -parse-eapi-ebuild-head" in make.conf.
anyway:
Code:
 emerge --update system
Calculating dependencies... done!
>>> Auto-cleaning packages...

>>> No outdated packages were found on your system.

Threw out wine as I don use it ATM.and doing
Code:
emerge -uavDN world
Back to top
View user's profile Send private message
earthy
Tux's lil' helper
Tux's lil' helper


Joined: 07 Jul 2006
Posts: 145

PostPosted: Tue Jul 17, 2012 6:24 pm    Post subject: Reply with quote

@John R. Graham
Code:
 USE="-sandbox" emerge -1v sandbox | wgetpaste
Your paste can be seen here: http://bpaste.net/show/35463/


Code:
gcc-config -l | wgetpaste
Your paste can be seen here: http://bpaste.net/show/35464/


Code:
gcc-config -l | wgetpaste
Your paste can be seen here: http://bpaste.net/show/35464/


Thank You.
Back to top
View user's profile Send private message
John R. Graham
Administrator
Administrator


Joined: 08 Mar 2005
Posts: 7883
Location: Somewhere over Atlanta, Georgia

PostPosted: Tue Jul 17, 2012 6:28 pm    Post subject: Reply with quote

How's your
Code:
emerge -uavDN world
going?

- John
_________________
I can confirm that I have received between 0 and 999 National Security Letters.
Back to top
View user's profile Send private message
earthy
Tux's lil' helper
Tux's lil' helper


Joined: 07 Jul 2006
Posts: 145

PostPosted: Tue Jul 17, 2012 6:29 pm    Post subject: Reply with quote

6 of 17

Last edited by earthy on Tue Jul 17, 2012 6:41 pm; edited 1 time in total
Back to top
View user's profile Send private message
John R. Graham
Administrator
Administrator


Joined: 08 Mar 2005
Posts: 7883
Location: Somewhere over Atlanta, Georgia

PostPosted: Tue Jul 17, 2012 6:37 pm    Post subject: Reply with quote

That should include an update to sandbox-2.6. We'll see if the problem persists with that new version.

- John
_________________
I can confirm that I have received between 0 and 999 National Security Letters.
Back to top
View user's profile Send private message
earthy
Tux's lil' helper
Tux's lil' helper


Joined: 07 Jul 2006
Posts: 145

PostPosted: Tue Jul 17, 2012 7:26 pm    Post subject: Reply with quote

It is finished but did not update sandbox.I am not a cat so I don't need a sandbox :D.
http://bpaste.net/show/35466/
Seems like system works fully,I will close thread tomorrow if noone objects to that.
Back to top
View user's profile Send private message
Display posts from previous:   
Reply to topic    Gentoo Forums Forum Index Gentoo on AMD64 All times are GMT
Page 1 of 1

 
Jump to:  
You cannot post new topics in this forum
You cannot reply to topics in this forum
You cannot edit your posts in this forum
You cannot delete your posts in this forum
You cannot vote in polls in this forum