Gentoo Forums
Gentoo Forums
Gentoo Forums
Quick Search: in
Can't emerge sys-devel/binutils-2.21.1-r1
View unanswered posts
View posts from last 24 hours

 
Reply to topic    Gentoo Forums Forum Index Duplicate Threads
View previous topic :: View next topic  
Author Message
destroyedlolo
Guru
Guru


Joined: 17 Jun 2011
Posts: 451
Location: Close to Annecy (France)

PostPosted: Tue Nov 29, 2011 10:40 pm    Post subject: Can't emerge sys-devel/binutils-2.21.1-r1 Reply with quote

Hello,

I did a world update but binutils won't be updated.

Quote:

* ERROR: sys-devel/binutils-2.21.1-r1 failed (compile phase):
* emake failed
*
* Call stack:
* ebuild.sh, line 56: Called src_compile
* environment, line 3226: Called toolchain-binutils_src_compile
* environment, line 3926: Called die
* The specific snippet of code:
* emake all || die "emake failed";
*
* If you need support, post the output of 'emerge --info =sys-devel/binutils-2.21.1-r1',
* the complete build log and the output of 'emerge -pqv =sys-devel/binutils-2.21.1-r1'.
* The complete build log is located at '/var/tmp/portage/sys-devel/binutils-2.21.1-r1/temp/build.log'.
* The ebuild environment file is located at '/var/tmp/portage/sys-devel/binutils-2.21.1-r1/temp/environment'.
* S: '/var/tmp/portage/sys-devel/binutils-2.21.1-r1/work/binutils-2.21.1'


Requested info are :
Quote:
celeron ~ # emerge --info =sys-devel/binutils-2.21.1-r1
Portage 2.1.10.11 (default/linux/x86/10.0, gcc-4.5.3, glibc-2.12.2-r0, 2.6.39-gentoo-r3 i686)
=================================================================
System Settings
=================================================================
System uname: Linux-2.6.39-gentoo-r3-i686-Intel-R-_Celeron-R-_CPU_2.66GHz-with-gentoo-2.0.3
Timestamp of tree: Tue, 29 Nov 2011 21:15:01 +0000
distcc 3.1 i686-pc-linux-gnu [disabled]
app-shells/bash: 4.1_p9
dev-java/java-config: 2.1.11-r3
dev-lang/python: 2.7.2-r3, 3.1.4-r3
dev-util/cmake: 2.8.4-r1
dev-util/pkgconfig: 0.26
sys-apps/baselayout: 2.0.3
sys-apps/openrc: 0.9.4
sys-apps/sandbox: 2.5
sys-devel/autoconf: 2.13, 2.68
sys-devel/automake: 1.9.6-r3, 1.11.1
sys-devel/binutils: 2.21.1-r1
sys-devel/gcc: 4.5.3-r1
sys-devel/gcc-config: 1.4.1-r1
sys-devel/libtool: 2.4-r1
sys-devel/make: 3.82-r1
sys-kernel/linux-headers: 2.6.39 (virtual/os-headers)
sys-libs/glibc: 2.12.2
Repositories: gentoo
ACCEPT_KEYWORDS="x86"
ACCEPT_LICENSE="* -@EULA"
CBUILD="i686-pc-linux-gnu"
CFLAGS="-O2 -march=i686 -pipe -fomit-frame-pointer"
CHOST="i686-pc-linux-gnu"
CONFIG_PROTECT="/etc"
CONFIG_PROTECT_MASK="/etc/ca-certificates.conf /etc/env.d /etc/env.d/java/ /etc/fonts/fonts.conf /etc/gconf /etc/gentoo-release /etc/php/apache2-php5.3/ext-active/ /etc/php/cgi-php5.3/ext-active/ /etc/php/cli-php5.3/ext-active/ /etc/revdep-rebuild /etc/sandbox.d /etc/terminfo"
CXXFLAGS="-O2 -march=i686 -pipe -fomit-frame-pointer"
DISTDIR="/usr/portage/distfiles"
FEATURES="assume-digests binpkg-logs buildpkg distlocks ebuild-locks fixlafiles fixpackages news parallel-fetch protect-owned sandbox sfperms strict unknown-features-warn unmerge-logs unmerge-orphans userfetch"
FFLAGS=""
GENTOO_MIRRORS="ftp://ftp.free.fr/mirrors/ftp.gentoo.org/"
LDFLAGS="-Wl,-O1 -Wl,--as-needed"
LINGUAS="en fr"
MAKEOPTS="-j4 -l3.0"
PKGDIR="/usr/portage/packages"
PORTAGE_CONFIGROOT="/"
PORTAGE_RSYNC_OPTS="--recursive --links --safe-links --perms --times --compress --force --whole-file --delete --stats --timeout=180 --exclude=/distfiles --exclude=/local --exclude=/packages"
PORTAGE_TMPDIR="/var/tmp"
PORTDIR="/usr/portage"
PORTDIR_OVERLAY=""
SYNC="rsync://rsync.fr.gentoo.org/gentoo-portage"
USE="X a52 aac acl alsa apng archive bash-completion berkdb bzip2 cairo cdda cli consolekit cracklib crypt cups cxx dbus device-mapper dga dri dv dvd exif faac fbcon ffmpeg flac fuse gdbm gif gphoto2 gpm gtk gvfs iconv imlib jpeg jpeg2k libcaca libnotify lm_sensors lxde matroska mmx modules mp3 mpeg mudflap ncurses nls nptl nptlonly nsplugin ogg oggvorbis openmp pam pcre png policykit pppd python readline sdl session speex sse sse2 ssl svg sysfs syslog tcpd theora threads tiff udev unicode usb vorbis win32codecs x264 x86 xinerama xml xorg xosd xv zlib" ALSA_CARDS="ali5451 als4000 atiixp atiixp-modem bt87x ca0106 cmipci emu10k1 emu10k1x ens1370 ens1371 es1938 es1968 fm801 hda-intel intel8x0 intel8x0m maestro3 trident usb-audio via82xx via82xx-modem ymfpci" ALSA_PCM_PLUGINS="adpcm alaw asym copy dmix dshare dsnoop empty extplug file hooks iec958 ioplug ladspa lfloat linear meter mmap_emul mulaw multi null plug rate route share shm softvol" APACHE2_MODULES="actions alias auth_basic authn_alias authn_anon authn_dbm authn_default authn_file authz_dbm authz_default authz_groupfile authz_host authz_owner authz_user autoindex cache cgi cgid dav dav_fs dav_lock deflate dir disk_cache env expires ext_filter file_cache filter headers include info log_config logio mem_cache mime mime_magic negotiation rewrite setenvif speling status unique_id userdir usertrack vhost_alias" CALLIGRA_FEATURES="kexi words flow plan stage tables krita karbon braindump" CAMERAS="ptp2 canon" COLLECTD_PLUGINS="df interface irq load memory rrdtool swap syslog" ELIBC="glibc" GPSD_PROTOCOLS="ashtech aivdm earthmate evermore fv18 garmin garmintxt gpsclock itrax mtk3301 nmea ntrip navcom oceanserver oldstyle oncore rtcm104v2 rtcm104v3 sirf superstar2 timing tsip tripmate tnt ubx" INPUT_DEVICES="evdev" KERNEL="linux" LCD_DEVICES="bayrad cfontz cfontz633 glk hd44780 lb216 lcdm001 mtxorb ncurses text" LINGUAS="en fr" PHP_TARGETS="php5-3" RUBY_TARGETS="ruby18" USERLAND="GNU" VIDEO_CARDS="intel mga sis vesa fbdev" XTABLES_ADDONS="quota2 psd pknock lscan length2 ipv4options ipset ipp2p iface geoip fuzzy condition tee tarpit sysrq steal rawnat logmark ipmark dhcpmac delude chaos account"
Unset: CPPFLAGS, CTARGET, EMERGE_DEFAULT_OPTS, INSTALL_MASK, LANG, LC_ALL, PORTAGE_BUNZIP2_COMMAND, PORTAGE_COMPRESS, PORTAGE_COMPRESS_FLAGS, PORTAGE_RSYNC_EXTRA_OPTS

=================================================================
Package Settings
=================================================================

sys-devel/binutils-2.21.1-r1 was built with the following:
USE="nls -multislot -multitarget -static-libs -test -vanilla"
CFLAGS="-O2 -march=i686 -pipe"
CXXFLAGS="-O2 -march=i686 -pipe"

Quote:
celeron ~ # emerge -pqv =sys-devel/binutils-2.21.1-r1
[ebuild R ] sys-devel/binutils-2.21.1-r1 USE="nls zlib%* -multislot -multitarget -static-libs -test -vanilla"

* IMPORTANT: 1 news items need reading for repository 'gentoo'.
* Use eselect news to read news items.


And in the build log, I found this very suspicious :
Quote:

/bin/sh ./libtool --tag=CC --mode=link gcc -W -Wall -Wstrict-prototypes -Wmissing-prototypes -Wshadow -O2 -march=i686 -pipe -Wl,-O1 -Wl,--as-needed -o objdump objdump.o dwarf.o prdbg.o rddbg.o debug.o stabs.o ieee.o rdcoff.o bucomm.o version.o filemode.o elfcomm.o ../opcodes/libopcodes.la ../bfd/libbfd.la ../libiberty/libiberty.a yes
libtool: link: gcc -W -Wall -Wstrict-prototypes -Wmissing-prototypes -Wshadow -O2 -march=i686 -pipe -Wl,-O1 -o .libs/size size.o bucomm.o version.o filemode.o yes -Wl,--as-needed ../bfd/.libs/libbfd.so -L/var/tmp/portage/sys-devel/binutils-2.21.1-r1/work/build/bfd/../libiberty/pic -liberty -ldl ../libiberty/libiberty.a -Wl,-rpath -Wl,/usr/lib/binutils/i686-pc-linux-gnu/2.21.1
gcc: yes: No such file or directory
make[4]: *** [size] Error 1


In addition, during configure stage, I got following strange things :
Quote:

checking whether gcc and cc understand -c and -o together... yes
checking for inline... inline
checking for sys/types.h... yes
checking for sys/stat.h... yes
checking for an ANSI C-conforming const... yes
yes
checking for inline... checking for stdlib.h... inline
checking for grep that handles long lines and -e... /bin/grep
checking for egrep... /bin/grep -E
checking for ANSI C header files... yes
checking for string.h... yes
checking for memory.h... yes
checking for strings.h... yes
checking for sys/types.h... yes
yes
checking for sys/stat.h... checking for inttypes.h... yes
checking for stdlib.h... yes
checking for string.h... yes
checking for stdint.h... yes
checking for memory.h... yes
checking for strings.h... yes
yes
checking for unistd.h... checking for inttypes.h... yes
checking for stdint.h... yes
checking for unistd.h... yes
checking for off_t... yes
checking whether byte ordering is bigendian... no


Any clue ?

Thanks

Laurent
Back to top
View user's profile Send private message
wolfieh
n00b
n00b


Joined: 17 Nov 2009
Posts: 52

PostPosted: Tue Nov 29, 2011 11:08 pm    Post subject: Reply with quote

same problem here, there is another error inside the logs:

Code:
x86_64-pc-linux-gnu-gcc -DHAVE_CONFIG_H -I. -I/var/tmp/portage/sys-devel/binutils-2.21.1-r1/work/binutils-2.21.1/binutils  -I. -I/var/tmp/portage/sys-devel/binutils-2.21.1-r1/work/binutils-2.21.1/binutils -I../bfd -I/var/tmp/portage/sys-devel/binutils-2.21.1-r1/work/binutils-2.21.1/binutils/../bfd -I/var/tmp/portage/sys-devel/binutils-2.21.1-r1/work/binutils-2.21.1/binutils/../include -DLOCALEDIR="\"/usr/share/binutils-data/x86_64-pc-linux-gnu/2.21.1/locale\"" -Dbin_dummy_emulation=bin_vanilla_emulation  -W -Wall -Wstrict-prototypes -Wmissing-prototypes -Wshadow -march=native -O2 -pipe -MT nm.o -MD -MP -MF .deps/nm.Tpo -c -o nm.o /var/tmp/portage/sys-devel/binutils-2.21.1-r1/work/binutils-2.21.1/binutils/nm.c
/var/tmp/portage/sys-devel/binutils-2.21.1-r1/work/binutils-2.21.1/gold/fileread.cc:50:8: error: redefinición de 'struct iovec'
/usr/include/bits/uio.h:45:3: error: definición previa de 'struct iovec'
make[4]: *** [fileread.o] Error 1
make[4]: *** Se espera a que terminen otras tareas....


then starts with the missing "yes" file errors
Back to top
View user's profile Send private message
destroyedlolo
Guru
Guru


Joined: 17 Jun 2011
Posts: 451
Location: Close to Annecy (France)

PostPosted: Tue Nov 29, 2011 11:56 pm    Post subject: Reply with quote

I got this error too ... but after the "yes".

In addition, this system is used as a binhost for another system I'm installing. On this second system, I need to do some local compilation (because it has some specific packages not needed elsewhere).
And I have also on it a strange compilation problem :

Quote:
kmk: Entering directory `/var/tmp/portage/dev-util/kbuild-0.1.5_p2-r1/work/kBuild-0.1.5-p2'
kBuild: Pass - Build Programs
kBuild: Pass - Libraries
kBuild: Compiling kDep - /var/tmp/portage/dev-util/kbuild-0.1.5_p2-r1/work/kBuild-0.1.5-p2/src/lib/kDep.c
gcc: argument to '-o' is missing
distcc[18029] ERROR: compile (null) on localhost failed
kmk: *** [/var/tmp/portage/dev-util/kbuild-0.1.5_p2-r1/work/kBuild-0.1.5-p2/out/linux.x86/release/obj/kDep/kDep.o] Error 1
The failing command:
@gcc -c -O2 -g -O3 -m32 -I/var/tmp/portage/dev-util/kbuild-0.1.5_p2-r1/work/kBuild-0.1.5-p2/src/lib -DKBUILD_VERSION_MAJOR=0 -DKBUILD_VERSION_MINOR=1 -DKBUILD_VERSION_PATCH=5 -DKBUILD_OS_LINUX -DKBUILD_ARCH_X86 -DNDEBUG -Wp,-MD,/var/tmp/portage/dev-util/kbuild-0.1.5_p2-r1/work/kBuild-0.1.5-p2/out/linux.x86/release/obj/kDep/kDep.o.dep -Wp,-MT,/var/tmp/portage/dev-util/kbuild-0.1.5_p2-r1/work/kBuild-0.1.5-p2/out/linux.x86/release/obj/kDep/kDep.o -Wp,-MP -o /var/tmp/portage/dev-util/kbuild-0.1.5_p2-r1/work/kBuild-0.1.5-p2/out/linux.x86/release/obj/kDep/kDep.o /var/tmp/portage/dev-util/kbuild-0.1.5_p2-r1/work/kBuild-0.1.5-p2/src/lib/kDep.c
kmk: Leaving directory `/var/tmp/portage/dev-util/kbuild-0.1.5_p2-r1/work/kBuild-0.1.5-p2'
make: *** [/var/tmp/portage/dev-util/kbuild-0.1.5_p2-r1/work/kBuild-0.1.5-p2/out/linux.x86/release/bootstrap/ts-stage2-build] Error 2
kBuild/env.sh: info: rc=2: make -f bootstrap.gmk AUTORECONF=true
* ERROR: dev-util/kbuild-0.1.5_p2-r1 failed (compile phase):
* bootstrap failed
*
* Call stack:
* ebuild.sh, line 56: Called src_compile
* environment, line 2728: Called die
* The specific snippet of code:
* kBuild/env.sh --full make -f bootstrap.gmk AUTORECONF=true || die "bootstrap failed"
*
* If you need support, post the output of 'emerge --info =dev-util/kbuild-0.1.5_p2-r1',
* the complete build log and the output of 'emerge -pqv =dev-util/kbuild-0.1.5_p2-r1'.
* The complete build log is located at '/var/tmp/portage/dev-util/kbuild-0.1.5_p2-r1/temp/build.log'.
* The ebuild environment file is located at '/var/tmp/portage/dev-util/kbuild-0.1.5_p2-r1/temp/environment'.
* S: '/var/tmp/portage/dev-util/kbuild-0.1.5_p2-r1/work/kBuild-0.1.5-p2'

>>> Failed to emerge dev-util/kbuild-0.1.5_p2-r1, Log file:

>>> '/var/tmp/portage/dev-util/kbuild-0.1.5_p2-r1/temp/build.log'


So something seems having messed up my (our ?) compile chain :?
Back to top
View user's profile Send private message
NTICompass
Tux's lil' helper
Tux's lil' helper


Joined: 11 Jun 2008
Posts: 147
Location: /home/nticompass/

PostPosted: Wed Nov 30, 2011 1:20 am    Post subject: Reply with quote

I just ran emerge --ask --update --newuse --deep world and got this same issue =(
Back to top
View user's profile Send private message
NTICompass
Tux's lil' helper
Tux's lil' helper


Joined: 11 Jun 2008
Posts: 147
Location: /home/nticompass/

PostPosted: Wed Nov 30, 2011 1:29 am    Post subject: Reply with quote

Fixed: https://bugs.gentoo.org/show_bug.cgi?id=392471
Back to top
View user's profile Send private message
John R. Graham
Administrator
Administrator


Joined: 08 Mar 2005
Posts: 7838
Location: Somewhere over Atlanta, Georgia

PostPosted: Wed Nov 30, 2011 2:50 am    Post subject: Reply with quote

Moved from Portage & Programming to Duplicate Threads. See binutils-2.21-r1 fails with USE=zlib.

- John
_________________
This space intentionally left blank.
Back to top
View user's profile Send private message
Display posts from previous:   
Reply to topic    Gentoo Forums Forum Index Duplicate Threads All times are GMT
Page 1 of 1

 
Jump to:  
You cannot post new topics in this forum
You cannot reply to topics in this forum
You cannot edit your posts in this forum
You cannot delete your posts in this forum
You cannot vote in polls in this forum