Gentoo Forums
Gentoo Forums
Gentoo Forums
Quick Search: in
The desktop-effects overlay
View unanswered posts
View posts from last 24 hours

Goto page Previous  1, 2, 3 ... 15, 16, 17  
Reply to topic    Gentoo Forums Forum Index Unsupported Software
View previous topic :: View next topic  
Author Message
Loko123
Tux's lil' helper
Tux's lil' helper


Joined: 05 Feb 2011
Posts: 91

PostPosted: Sun Jul 10, 2011 7:44 pm    Post subject: Reply with quote

Still no update. :'( What a bummer! :-( Please jmbsvicetto, if you have any freetime (up to 15 minutes) bump the ebuilds and fix the kde issue! I (and I am sure many other gentoouser) would be very grateful to you!

Loko123
Back to top
View user's profile Send private message
Jupiter1TX
Guru
Guru


Joined: 24 Feb 2006
Posts: 546
Location: 3rd Rock

PostPosted: Sun Jul 10, 2011 9:32 pm    Post subject: Reply with quote

Loko123 wrote:
Still no update. :'( What a bummer! :-( Please jmbsvicetto, if you have any freetime (up to 15 minutes) bump the ebuilds and fix the kde issue! I (and I am sure many other gentoouser) would be very grateful to you!

Loko123


I just talked to smspillaz 'compiz dev' and the error is an outdated macro in the
CMakeLists.txt file. He did say he would try and fix it in the next few days, time
permitting.
_________________
Core i7 920 D0 | Asus P6T DLX | Patriot Viper 1600 6GB | Antec Quattro 850W
Geforce 8800GTX OC2 768MB | Dell 22" LCD | Koolance Exos2/Swiftech GTZ
GCC 4.6.1 | 3.7.x-geek | Xorg-7.4-x | KDE-4.7.x | Compiz
Back to top
View user's profile Send private message
keenblade
Veteran
Veteran


Joined: 03 Oct 2004
Posts: 1085

PostPosted: Mon Jul 11, 2011 4:44 am    Post subject: Reply with quote

Jupiter1TX wrote:

I just talked to smspillaz 'compiz dev' and the error is an outdated macro in the
CMakeLists.txt file. He did say he would try and fix it in the next few days, time
permitting.

Wow!. That's great. Finally something is happening.
_________________
Anyway it's all the same at the end...
Need help to get it working: "x-fi surround 5.1"
Back to top
View user's profile Send private message
Jupiter1TX
Guru
Guru


Joined: 24 Feb 2006
Posts: 546
Location: 3rd Rock

PostPosted: Mon Jul 11, 2011 4:34 pm    Post subject: Reply with quote

keenblade wrote:
Jupiter1TX wrote:

I just talked to smspillaz 'compiz dev' and the error is an outdated macro in the
CMakeLists.txt file. He did say he would try and fix it in the next few days, time
permitting.

Wow!. That's great. Finally something is happening.


Well since speaking to smspillaz i have also talked to a couple of other compiz devs.
Keep in mind that smspillaz has always been a stand up guy BUT his time is in VERY
short supply and never involved in the kde components of compiz. smspillaz is
working for Canonical now (in case you didn't know already) and he is the current
main developer of compiz. This means he is mostly working on their unity interface,
primarily for gnome and they really don't have anyone working on the kde stuff for
0.9x right now. So far as kde-window-decorator and kconfig4 backend, they're
pretty broken and nobody assigned to work on them.

The following quote shows what has ALWAYS been the case with kde/compiz.
Quote:
So far as kde devs are concerned, kwin is THE only window manager for kde and shun compiz at all costs.

We kde users are at a crossroads with compiz at this time. We can either start using
kwin for a compositor or change to gnome. Both solutions SUCK imho. What is needed
is a kde/compiz dev to step up to the plate. To be sure compiz is NOT going away
especially with Canonical supporting it for their gnome project.

Compiz project NEEDS a kde dev or kde support will fade away.
_________________
Core i7 920 D0 | Asus P6T DLX | Patriot Viper 1600 6GB | Antec Quattro 850W
Geforce 8800GTX OC2 768MB | Dell 22" LCD | Koolance Exos2/Swiftech GTZ
GCC 4.6.1 | 3.7.x-geek | Xorg-7.4-x | KDE-4.7.x | Compiz
Back to top
View user's profile Send private message
keenblade
Veteran
Veteran


Joined: 03 Oct 2004
Posts: 1085

PostPosted: Thu Jul 14, 2011 6:43 pm    Post subject: Reply with quote

keenblade wrote:
Maybe, we would be more lucky for the compiz-fusion-0.9.5

Yay! Now compiz-fusion-0.9.5.0 sources available.
Let's see if we are lucky to get it in portage.
_________________
Anyway it's all the same at the end...
Need help to get it working: "x-fi surround 5.1"
Back to top
View user's profile Send private message
gqman69
n00b
n00b


Joined: 11 Jul 2007
Posts: 50

PostPosted: Thu Jul 14, 2011 10:05 pm    Post subject: Reply with quote

YAY... but it seems that kde integration is kaput...
Back to top
View user's profile Send private message
Loko123
Tux's lil' helper
Tux's lil' helper


Joined: 05 Feb 2011
Posts: 91

PostPosted: Fri Jul 15, 2011 6:43 pm    Post subject: Reply with quote

keenblade wrote:
keenblade wrote:
Maybe, we would be more lucky for the compiz-fusion-0.9.5

Yay! Now compiz-fusion-0.9.5.0 sources available.
Let's see if we are lucky to get it in portage.


Alright! So... We just need ebuilds for the latest (and probably last) development release or updated (and working) live ebuilds ;-). I've tried to fix the issues (without sandbox useflag) but it was also not working.:'(... So I hope that any gentoo user/developer will look into this matter, fix the issue and support the community with his/her local overlay.:) There are so many gentoouser and gentoodeveloper any of them should be able to fix the ebuild related issues, I am sure. :) As far as I know, many people have the opinion, that compiz is jusz a waste of resources, but thats a myth. The new gnome shell is a waste of resource, compiz has many cute effects AND RUNS ALSO ON OLD COMPUTERS, without any framebuffererror.

Have a nice weekend,

Loko123

P.S. If I am able to fix the issues, I am going to make an own public overlay and I will take care of it. :)
Back to top
View user's profile Send private message
Loko123
Tux's lil' helper
Tux's lil' helper


Joined: 05 Feb 2011
Posts: 91

PostPosted: Wed Jul 20, 2011 4:45 pm    Post subject: Reply with quote

Update:

Compiz 0.9.5.0 is usable and stable! :-) It works like a charm, yay!

I´ve tested it under Xubuntu Oneric Ocelot Alpha 2 (I hate Unity and Gnome-Shell :) Xubuntu works like a charm, but remember - (X)Ubuntu is not Gentoo :'(

So, maybe someone could bump and correct the ebuilds of compiz-9999 in Gentoo (I don't like to compile a package with -sandbox useflag)

Loko123
Back to top
View user's profile Send private message
billydv
l33t
l33t


Joined: 22 Dec 2006
Posts: 873
Location: Mount Vernon, NY

PostPosted: Thu Jul 21, 2011 11:01 am    Post subject: Reply with quote

Which ebuilds are not emerging successfully when doing the live versions (sandbox)? The first thing I would try is removing any patches from the ebuilds. They may be unnecessary in newer versions.
_________________
Billy DeVincentis
Back to top
View user's profile Send private message
Loko123
Tux's lil' helper
Tux's lil' helper


Joined: 05 Feb 2011
Posts: 91

PostPosted: Thu Jul 21, 2011 3:49 pm    Post subject: Reply with quote

Hey billydv,

x11-libs/libcompizconfig fails to compile with sanbox enabled, when disabling sandbox use-flag it compiles fine

Hopefully this bug will be fixed soon (Or compiz 1.0 is going to be released) :)
Back to top
View user's profile Send private message
billydv
l33t
l33t


Joined: 22 Dec 2006
Posts: 873
Location: Mount Vernon, NY

PostPosted: Thu Jul 21, 2011 10:50 pm    Post subject: Reply with quote

Try commenting out my make arguments and such in the ebuild until you find what the problem is.
_________________
Billy DeVincentis
Back to top
View user's profile Send private message
jasn
Guru
Guru


Joined: 05 May 2005
Posts: 412
Location: Maryland, US

PostPosted: Mon Aug 22, 2011 1:25 pm    Post subject: Reply with quote

Loko123 wrote:
Compiz 0.9.5.0 is usable and stable! :-) It works like a charm, yay!

Rather than using the live ebuilds, does anyone know if 0.9.5.0 ebuilds will get pushed to the desktop-effects overlay? Otherwise would using the ebuilds from this bugzilla entry, and then copying them to 0.9.5 ebuild names, work for emerging 0.9.5.0?

Thanks..
Back to top
View user's profile Send private message
gqman69
n00b
n00b


Joined: 11 Jul 2007
Posts: 50

PostPosted: Sun Aug 28, 2011 9:45 pm    Post subject: nope Reply with quote

jasn wrote:
Loko123 wrote:
Compiz 0.9.5.0 is usable and stable! :-) It works like a charm, yay!

Rather than using the live ebuilds, does anyone know if 0.9.5.0 ebuilds will get pushed to the desktop-effects overlay? Otherwise would using the ebuilds from this bugzilla entry, and then copying them to 0.9.5 ebuild names, work for emerging 0.9.5.0?

Thanks..


Nope. Doesn't work. The structure has changed.
Back to top
View user's profile Send private message
billydv
l33t
l33t


Joined: 22 Dec 2006
Posts: 873
Location: Mount Vernon, NY

PostPosted: Mon Aug 29, 2011 12:12 am    Post subject: Reply with quote

I also have fedora on another box and it seems that 0.9.5 has some problem because it keeps crashing
_________________
Billy DeVincentis
Back to top
View user's profile Send private message
Jupiter1TX
Guru
Guru


Joined: 24 Feb 2006
Posts: 546
Location: 3rd Rock

PostPosted: Mon Aug 29, 2011 10:53 pm    Post subject: Reply with quote

I used the desktop-effects 9999 ebuilds and compiz-0.9.5.92.1 built fine using 'MAKEOPTS="-j1"'.

HOWEVER it is VERY UNSTABLE. Making changes in ccsm can cause it to crash.
Closing a window can make it crash. I think even a sneeze or if you fart it can
cause it to crash. It's just not ready for prime time. I think it built for me because
i already have all the deps it requires.

I built everything BUT kde backend which is only needed if your using that backend.
Like most people i use flat-file configuration so no need for kde backend. Also for a
decorator, kde4-window-decorator didn't work at all but kde-window-decorator did.
Also keep in mind guys there is no fusion-icon or emerald decorator.
_________________
Core i7 920 D0 | Asus P6T DLX | Patriot Viper 1600 6GB | Antec Quattro 850W
Geforce 8800GTX OC2 768MB | Dell 22" LCD | Koolance Exos2/Swiftech GTZ
GCC 4.6.1 | 3.7.x-geek | Xorg-7.4-x | KDE-4.7.x | Compiz
Back to top
View user's profile Send private message
kernelOfTruth
Watchman
Watchman


Joined: 20 Dec 2005
Posts: 5696
Location: Vienna, Austria; Germany; hello world :)

PostPosted: Tue Aug 30, 2011 1:39 am    Post subject: Reply with quote

it's been for me like that since the beginning

indeed - it's more usable right now

but it's still not 100% ready for prime time

(e.g. the svg, png, etc. plugins screw it up and let it crash, there's some graphical glitches/corruption in appearing progress bars, it loses the focus when closing a window - then you have to switch between windows to re-gain it, it's rather slow compared to compiz 0.8.x, ...)


best thing: at least with compiz++ my box doesn't hardlock anymore ^^

since 2.6.38, 2.6.39 something compiz 0.8 (which was running perfectly fast & stable in the past) tended to hardlock my box

so: bye bye old compiz-fusion


welcome new WIP compiz++
_________________
https://github.com/kernelOfTruth/ZFS-for-SystemRescueCD
2.6.37.2_plus_v1: BFS, CFS,THP,compaction, zcache or TOI
Hardcore Linux user since 2004 :D
Back to top
View user's profile Send private message
keenblade
Veteran
Veteran


Joined: 03 Oct 2004
Posts: 1085

PostPosted: Tue Aug 30, 2011 11:30 pm    Post subject: Reply with quote

kernelOfTruth wrote:
...best thing: at least with compiz++ my box doesn't hardlock anymore ^^
...
welcome new WIP compiz++

How do we install compiz++?
Does the live (compiz-fusion-9999) from desktop-effects install compiz++?
_________________
Anyway it's all the same at the end...
Need help to get it working: "x-fi surround 5.1"
Back to top
View user's profile Send private message
Jupiter1TX
Guru
Guru


Joined: 24 Feb 2006
Posts: 546
Location: 3rd Rock

PostPosted: Tue Aug 30, 2011 11:50 pm    Post subject: Reply with quote

keenblade wrote:
kernelOfTruth wrote:
...best thing: at least with compiz++ my box doesn't hardlock anymore ^^
...
welcome new WIP compiz++

How do we install compiz++?
Does the live (compiz-fusion-9999) from desktop-effects install compiz++?

I used the 9999 ebuilds and yes anything >=compiz-9.x is compiz++
_________________
Core i7 920 D0 | Asus P6T DLX | Patriot Viper 1600 6GB | Antec Quattro 850W
Geforce 8800GTX OC2 768MB | Dell 22" LCD | Koolance Exos2/Swiftech GTZ
GCC 4.6.1 | 3.7.x-geek | Xorg-7.4-x | KDE-4.7.x | Compiz
Back to top
View user's profile Send private message
keenblade
Veteran
Veteran


Joined: 03 Oct 2004
Posts: 1085

PostPosted: Wed Aug 31, 2011 2:41 pm    Post subject: Reply with quote

Jupiter1TX wrote:

I used the 9999 ebuilds and yes anything >=compiz-9.x is compiz++

Thanks. I'll try compiz++. I wish there were gentoo devs who are interested in compiz.
_________________
Anyway it's all the same at the end...
Need help to get it working: "x-fi surround 5.1"
Back to top
View user's profile Send private message
Loko123
Tux's lil' helper
Tux's lil' helper


Joined: 05 Feb 2011
Posts: 91

PostPosted: Mon Sep 05, 2011 3:53 pm    Post subject: Reply with quote

kernelOfTruth wrote:
it's been for me like that since the beginning

indeed - it's more usable right now

but it's still not 100% ready for prime time

(e.g. the svg, png, etc. plugins screw it up and let it crash, there's some graphical glitches/corruption in appearing progress bars, it loses the focus when closing a window - then you have to switch between windows to re-gain it, it's rather slow compared to compiz 0.8.x, ...)


best thing: at least with compiz++ my box doesn't hardlock anymore ^^

since 2.6.38, 2.6.39 something compiz 0.8 (which was running perfectly fast & stable in the past) tended to hardlock my box

so: bye bye old compiz-fusion


welcome new WIP compiz++


That sounds strange... I have made a journey to Archlinux and 'pacmaned' via AUR the live ebuilds of compiz, and they worked like a charm. Some little bugs (When resizing windows) and the focus would not work as it has worked under 0.8 but it was ready for daily use. :)

Now I'll be back and fly with Gentoo and I'll try to emerge -9999 from desktop-effects. :) I hope, that it will also work and if not I am going to study the ebuild and make it better (stable :D).

Loko123
Back to top
View user's profile Send private message
Loko123
Tux's lil' helper
Tux's lil' helper


Joined: 05 Feb 2011
Posts: 91

PostPosted: Mon Sep 05, 2011 7:17 pm    Post subject: Reply with quote

I am not able to install compiz-plugins-mains because of "ACCESS VIOLATION".

However, I am going to wait, till 0.9 is tagged as stable and after that I'll give it another shot.
Back to top
View user's profile Send private message
Yamakuzure
Veteran
Veteran


Joined: 21 Jun 2006
Posts: 1382
Location: Bardowick, Germany

PostPosted: Tue Sep 13, 2011 2:38 pm    Post subject: Reply with quote

Strange. I can't emerge neither compitz-0.9.2 nor 9999. configure always fails with
Code:
-- Looking for wnck_window_has_name
Parse error in command line argument: -DQT_SHARED
Should be: VAR:type=value
CMake Error: No cmake script provided.
CMake Error: Internal CMake error, TryCompile configure of cmake failed
and
Code:
************************************************************

WARNING:
"FindCompiz.cmake" file not found in cmake module directories.
It should be installed to allow building of external compiz packages.
Call "sudo make findcompiz_install" to install it.

************************************************************

-- <<< Gentoo configuration >>>
Build type      Gentoo
Install path    /usr
Compiler flags:
C               -march=native -pipe -ftree-vectorize -ggdb -O2  -Wall -Wall
C++             -march=native -pipe -ftree-vectorize -ggdb -O2  -Wall -Wall
Linker flags:
Executable      -Wl,-O1 -Wl,--as-needed -Wl,--sort-common -Wl,--hash-style=gnu
Module          -Wl,-O1 -Wl,--as-needed -Wl,--sort-common -Wl,--hash-style=gnu
Shared          -Wl,-O1 -Wl,--as-needed -Wl,--sort-common -Wl,--hash-style=gnu

-- Configuring incomplete, errors occurred!
 * ERROR: x11-wm/compiz-9999 failed (configure phase):
Does anybody have an idea? I am completely at sea...

Edith now learned: for compiz it is necessary to use -gtk USE flag and MAKEOPTS="-j1"... According to this thread: http://forums.gentoo.org/viewtopic-t-827051.html - Let's see whether this is true...
_________________
I *do* know that I easily aggravate people due to my condensed writing. Rule of thumb: If I wrote anything that can be understood in two different ways, and one way offends you, then I meant the other! ;)
Back to top
View user's profile Send private message
jordanwb
l33t
l33t


Joined: 10 Jul 2008
Posts: 642
Location: Ottawa, Canada

PostPosted: Sun Nov 06, 2011 1:23 am    Post subject: Reply with quote

I'm trying to install x11-wm/compiz-0.9.2 from the desktop-effects overlay; how come boost isn't marked as a dependency for compiz?

BRB, compiling boost.

[Edit #1]

compiling compiz seems to work with no gtk support and with MAKEOPTS="-j1"

[Edit #2]

compizconfig-python-0.9.2 fails to compile because of this:

Code:
src/compizconfig.c:1:2: error: #error Do not use this file, it is the result of a failed Cython compilation.
Back to top
View user's profile Send private message
Loko123
Tux's lil' helper
Tux's lil' helper


Joined: 05 Feb 2011
Posts: 91

PostPosted: Tue Nov 15, 2011 8:26 am    Post subject: Reply with quote

jordanwb,

forget it. 9999 aKa git-builds of compiz are (yet) not ready for daily use. I think, that we have to wait on 0.9 stable (Hopefully with emerald).
Back to top
View user's profile Send private message
BrummieJim
l33t
l33t


Joined: 22 Jul 2005
Posts: 621

PostPosted: Sun Apr 01, 2012 6:04 pm    Post subject: Reply with quote

Hi,
Can anyone help with this, I'm trying to compile the 0.9.2 version of compiz-plugins-extra from the desktop-effects overlay but get the following error?
Thanks
James

Code:

ja@Columbian ~ $ emerge compiz-plugins-extra
/usr/lib64/portage/pym/portage/package/ebuild/config.py:353: UserWarning: 'cache.metadata_overlay.database' is deprecated: /etc/portage/modules
  (user_auxdbmodule, modules_file))
emerge: superuser access is required
ja@Columbian ~ $ su
nPassword:
Columbian ja #  emerge compiz-plugins-extra
/usr/lib64/portage/pym/portage/package/ebuild/config.py:353: UserWarning: 'cache.metadata_overlay.database' is deprecated: /etc/portage/modules
  (user_auxdbmodule, modules_file))

 * IMPORTANT: 7 news items need reading for repository 'gentoo'.
 * Use eselect news to read news items.

Calculating dependencies... done!

>>> Verifying ebuild manifests

>>> Emerging (1 of 1) x11-plugins/compiz-plugins-extra-0.9.2 from desktop-effects
 * compiz-plugins-extra-0.9.2.tar.bz2 RMD160 SHA1 SHA256 size ;-) ...    [ ok ]
>>> Unpacking source...
>>> Unpacking compiz-plugins-extra-0.9.2.tar.bz2 to /var/tmp/portage/x11-plugins/compiz-plugins-extra-0.9.2/work
>>> Source unpacked in /var/tmp/portage/x11-plugins/compiz-plugins-extra-0.9.2/work
>>> Preparing source in /var/tmp/portage/x11-plugins/compiz-plugins-extra-0.9.2/work/plugins-extra ...
>>> Source prepared.
>>> Configuring source in /var/tmp/portage/x11-plugins/compiz-plugins-extra-0.9.2/work/plugins-extra ...
>>> Working in BUILD_DIR: "/var/tmp/portage/x11-plugins/compiz-plugins-extra-0.9.2/work/compiz-plugins-extra-0.9.2_build"
cmake --no-warn-unused-cli -C /var/tmp/portage/x11-plugins/compiz-plugins-extra-0.9.2/temp/gentoo_common_config.cmake -DCMAKE_INSTALL_PREFIX=/usr -DCOMPIZ_DISABLE_SCHEMAS_INSTALL=ON -DCMAKE_BUILD_TYPE=Gentoo -DCMAKE_INSTALL_DO_STRIP=OFF -DCMAKE_USER_MAKE_RULES_OVERRIDE=/var/tmp/portage/x11-plugins/compiz-plugins-extra-0.9.2/temp/gentoo_rules.cmake  /var/tmp/portage/x11-plugins/compiz-plugins-extra-0.9.2/work/plugins-extra
Not searching for unused variables given on the command line.
loading initial cache file /var/tmp/portage/x11-plugins/compiz-plugins-extra-0.9.2/temp/gentoo_common_config.cmake
-- The C compiler identification is GNU
-- The CXX compiler identification is GNU
-- Check for working C compiler: /usr/bin/x86_64-pc-linux-gnu-gcc
-- Check for working C compiler: /usr/bin/x86_64-pc-linux-gnu-gcc -- works
-- Detecting C compiler ABI info
-- Detecting C compiler ABI info - done
-- Check for working CXX compiler: /usr/bin/x86_64-pc-linux-gnu-g++
-- Check for working CXX compiler: /usr/bin/x86_64-pc-linux-gnu-g++ -- works
-- Detecting CXX compiler ABI info
-- Detecting CXX compiler ABI info - done
-- checking for module 'compiz'
--   found compiz, version 0.9.0
-- Performing Test HAVE_SCANDIR_POSIX
-- Performing Test HAVE_SCANDIR_POSIX - Success
-- Boost version: 1.46.1
-- Found the following Boost libraries:
--   serialization
-- checking for module 'compiz-composite'
--   found compiz-composite, version 0.9.0
-- checking for module 'compiz-opengl'
--   found compiz-opengl, version 0.9.0
-- checking for module 'compiz'
--   found compiz, version 0.9.0
-- checking for module 'compiz-scale'
--   found compiz-scale, version 0.9.0
-- checking for module 'compiz-text'
--   found compiz-text, version 0.9.0
-- checking for module 'compiz-cube'
--   found compiz-cube, version 0.9.0
-- checking for module 'compiz-mousepoll'
--   found compiz-mousepoll, version 0.9.0
-- checking for module 'cairo'
--   found cairo, version 1.10.2
-- checking for module 'cairo-xlib-xrender'
--   found cairo-xlib-xrender, version 1.10.2
-- checking for module 'libnotify'
--   found libnotify, version 0.7.4
-- checking for module 'gtk+-2.0'
--   found gtk+-2.0, version 2.24.8
-- Looking for XOpenDisplay in /usr/lib64/libX11.so;/usr/lib64/libXext.so
-- Looking for XOpenDisplay in /usr/lib64/libX11.so;/usr/lib64/libXext.so - found
-- Looking for gethostbyname
-- Looking for gethostbyname - found
-- Looking for connect
-- Looking for connect - found
-- Looking for remove
-- Looking for remove - found
-- Looking for shmat
-- Looking for shmat - found
-- Looking for IceConnectionNumber in ICE
-- Looking for IceConnectionNumber in ICE - found
-- Found X11: /usr/lib64/libX11.so
-- Found OpenGL: /usr/lib64/libGL.so
-- checking for module 'compiz-animation'
--   found compiz-animation, version 0.9.0

************************************************************
* Compiz Buildsystem                                       *
*                                                          *
* Package : Compiz Plugins Extra                           *
* Version : 0.9.0                                          *
************************************************************

Plugin configure check results:

  splash        : Yes
  mblur         : Yes
  crashhandler  : Yes
  bicubic       : Yes
  scalefilter   : Yes
  cubeaddon     : Yes
  firepaint     : Yes
  wallpaper     : Yes
  maximumize    : Yes
  addhelper     : Yes
  group         : Yes
  trailfocus    : Yes
  showdesktop   : Yes
  grid          : Yes
  showmouse     : Yes
  notification  : Yes
  extrawm       : Yes
  animationaddon: Yes
  reflex        : Yes
  bench         : Yes
  fadedesktop   : Yes
  td            : Yes
  widget        : Yes
  gears         : Yes
  shelf         : Yes
  loginout      : Yes

************************************************************

-- <<< Gentoo configuration >>>
Build type      Gentoo
Install path    /usr
Compiler flags:
C               -Wall
C++             -Wall
Linker flags:
Executable       -Wl,-O1 -Wl,--as-needed
Module           -Wl,-O1 -Wl,--as-needed
Shared           -Wl,-O1 -Wl,--as-needed

-- Configuring done
-- Generating done
-- Build files have been written to: /var/tmp/portage/x11-plugins/compiz-plugins-extra-0.9.2/work/compiz-plugins-extra-0.9.2_build
>>> Source configured.
>>> Compiling source in /var/tmp/portage/x11-plugins/compiz-plugins-extra-0.9.2/work/plugins-extra ...
>>> Working in BUILD_DIR: "/var/tmp/portage/x11-plugins/compiz-plugins-extra-0.9.2/work/compiz-plugins-extra-0.9.2_build"
make -j3
[  1%] [  1%] [  2%] Generating ../generated/splash.xml
Generating ../generated/crashhandler.xml
Generating ../generated/mblur.xml
[  2%] [  3%] [  4%] Generating ../generated/mblur_options.h
Generating ../generated/splash_options.h
Generating ../generated/crashhandler_options.h
[  4%] [  5%] [  6%] Generating ../generated/splash_options.cpp
Generating ../generated/crashhandler_options.cpp
Generating ../generated/mblur_options.cpp
Scanning dependencies of target crashhandler
Scanning dependencies of target splash
Scanning dependencies of target mblur
[  7%] Building CXX object crashhandler/CMakeFiles/crashhandler.dir/src/crashhandler.cpp.o
[  7%] Building CXX object splash/CMakeFiles/splash.dir/src/splash.cpp.o
[  8%] Building CXX object mblur/CMakeFiles/mblur.dir/src/mblur.cpp.o
[  8%] Building CXX object crashhandler/CMakeFiles/crashhandler.dir/__/generated/crashhandler_options.cpp.o
In file included from /usr/include/boost-1_46/boost/serialization/static_warning.hpp:73:0,
                 from /usr/include/boost-1_46/boost/serialization/extended_type_info_typeid.hpp:27,
                 from /usr/include/boost-1_46/boost/archive/detail/iserializer.hpp:47,
                 from /usr/include/boost-1_46/boost/archive/detail/interface_iarchive.hpp:22,
                 from /usr/include/boost-1_46/boost/archive/detail/common_iarchive.hpp:23,
                 from /usr/include/boost-1_46/boost/archive/basic_text_iarchive.hpp:31,
                 from /usr/include/boost-1_46/boost/archive/text_iarchive.hpp:24,
                 from /usr/include/compiz/core/serialization.h:36,
                 from /var/tmp/portage/x11-plugins/compiz-plugins-extra-0.9.2/work/plugins-extra/mblur/src/mblur.h:29,
                 from /var/tmp/portage/x11-plugins/compiz-plugins-extra-0.9.2/work/plugins-extra/mblur/src/mblur.cpp:25:
/usr/include/boost-1_46/boost/mpl/print.hpp: In instantiation of ‘boost::mpl::print<boost::serialization::BOOST_SERIALIZATION_STATIC_WARNING_LINE<98> >’:
/usr/include/boost-1_46/boost/serialization/static_warning.hpp:92:13:   instantiated from ‘boost::serialization::static_warning_test<false, 98>’
/usr/include/boost-1_46/boost/archive/detail/check.hpp:98:1:   instantiated from ‘void boost::archive::detail::check_object_tracking() [with T = PluginStateWriter<MblurScreen>]’
/usr/include/boost-1_46/boost/archive/detail/oserializer.hpp:313:9:   instantiated from ‘static void boost::archive::detail::save_non_pointer_type<Archive>::invoke(Archive&, T&) [with T = PluginStateWriter<MblurScreen>, Archive = boost::archive::text_oarchive]’
/usr/include/boost-1_46/boost/archive/detail/oserializer.hpp:525:5:   instantiated from ‘void boost::archive::save(Archive&, T&) [with Archive = boost::archive::text_oarchive, T = PluginStateWriter<MblurScreen>]’
/usr/include/boost-1_46/boost/archive/detail/common_oarchive.hpp:69:9:   instantiated from ‘void boost::archive::detail::common_oarchive<Archive>::save_override(T&, int) [with T = PluginStateWriter<MblurScreen>, Archive = boost::archive::text_oarchive]’
/usr/include/boost-1_46/boost/archive/basic_text_oarchive.hpp:80:9:   instantiated from ‘void boost::archive::basic_text_oarchive<Archive>::save_override(T&, int) [with T = PluginStateWriter<MblurScreen>, Archive = boost::archive::text_oarchive]’
/usr/include/boost-1_46/boost/archive/detail/interface_oarchive.hpp:63:9:   instantiated from ‘Archive& boost::archive::detail::interface_oarchive<Archive>::operator<<(T&) [with T = PluginStateWriter<MblurScreen>, Archive = boost::archive::text_oarchive]’
/usr/include/compiz/core/serialization.h:122:6:   instantiated from ‘void PluginStateWriter<T>::writeSerializedData() [with T = MblurScreen]’
/var/tmp/portage/x11-plugins/compiz-plugins-extra-0.9.2/work/plugins-extra/mblur/src/mblur.cpp:298:5:   instantiated from here
/usr/include/boost-1_46/boost/mpl/print.hpp:55:5: warning: comparison between signed and unsigned integer expressions
Linking CXX shared library libcrashhandler.so
[  9%] Building CXX object splash/CMakeFiles/splash.dir/__/generated/splash_options.cpp.o
[  9%] Built target crashhandler
[ 10%] Generating ../generated/bicubic.xml
[ 11%] Generating ../generated/bicubic_options.h
[ 11%] [ 12%] Generating ../generated/bicubic_options.cpp
Building CXX object mblur/CMakeFiles/mblur.dir/__/generated/mblur_options.cpp.o
Scanning dependencies of target bicubic
[ 12%] Building CXX object bicubic/CMakeFiles/bicubic.dir/src/bicubic.cpp.o
Linking CXX shared library libsplash.so
[ 12%] Built target splash
[ 13%] Generating ../generated/scalefilter.xml
[ 13%] Linking CXX shared library libmblur.so
Generating ../generated/scalefilter_options.h
[ 14%] Generating ../generated/scalefilter_options.cpp
Scanning dependencies of target scalefilter
[ 15%] [ 15%] Building CXX object bicubic/CMakeFiles/bicubic.dir/__/generated/bicubic_options.cpp.o
Built target mblur
[ 16%] Generating ../generated/cubeaddon.xml
[ 16%] Generating ../generated/cubeaddon_options.h
[ 17%] Generating ../generated/cubeaddon_options.cpp
[ 18%] Scanning dependencies of target cubeaddon
Building CXX object scalefilter/CMakeFiles/scalefilter.dir/src/scalefilter.cpp.o
[ 19%] Building CXX object cubeaddon/CMakeFiles/cubeaddon.dir/src/cubeaddon.cpp.o
Linking CXX shared library libbicubic.so
[ 19%] Built target bicubic
[ 20%] Generating ../generated/firepaint.xml
[ 20%] Generating ../generated/firepaint_options.h
[ 21%] Generating ../generated/firepaint_options.cpp
Scanning dependencies of target firepaint
[ 22%] Building CXX object firepaint/CMakeFiles/firepaint.dir/src/firepaint.cpp.o
[ 23%] Building CXX object cubeaddon/CMakeFiles/cubeaddon.dir/__/generated/cubeaddon_options.cpp.o
[ 24%] Building CXX object scalefilter/CMakeFiles/scalefilter.dir/__/generated/scalefilter_options.cpp.o
Linking CXX shared library libcubeaddon.so
In file included from /usr/include/boost-1_46/boost/serialization/static_warning.hpp:73:0,
                 from /usr/include/boost-1_46/boost/serialization/extended_type_info_typeid.hpp:27,
                 from /usr/include/boost-1_46/boost/archive/detail/iserializer.hpp:47,
                 from /usr/include/boost-1_46/boost/archive/detail/interface_iarchive.hpp:22,
                 from /usr/include/boost-1_46/boost/archive/detail/common_iarchive.hpp:23,
                 from /usr/include/boost-1_46/boost/archive/basic_text_iarchive.hpp:31,
                 from /usr/include/boost-1_46/boost/archive/text_iarchive.hpp:24,
                 from /usr/include/compiz/core/serialization.h:36,
                 from /var/tmp/portage/x11-plugins/compiz-plugins-extra-0.9.2/work/plugins-extra/firepaint/src/firepaint.h:27,
                 from /var/tmp/portage/x11-plugins/compiz-plugins-extra-0.9.2/work/plugins-extra/firepaint/src/firepaint.cpp:22:
/usr/include/boost-1_46/boost/mpl/print.hpp: In instantiation of ‘boost::mpl::print<boost::serialization::BOOST_SERIALIZATION_STATIC_WARNING_LINE<98> >’:
/usr/include/boost-1_46/boost/serialization/static_warning.hpp:92:13:   instantiated from ‘boost::serialization::static_warning_test<false, 98>’
/usr/include/boost-1_46/boost/archive/detail/check.hpp:98:1:   instantiated from ‘void boost::archive::detail::check_object_tracking() [with T = PluginStateWriter<FireScreen>]’
/usr/include/boost-1_46/boost/archive/detail/oserializer.hpp:313:9:   instantiated from ‘static void boost::archive::detail::save_non_pointer_type<Archive>::invoke(Archive&, T&) [with T = PluginStateWriter<FireScreen>, Archive = boost::archive::text_oarchive]’
/usr/include/boost-1_46/boost/archive/detail/oserializer.hpp:525:5:   instantiated from ‘void boost::archive::save(Archive&, T&) [with Archive = boost::archive::text_oarchive, T = PluginStateWriter<FireScreen>]’
/usr/include/boost-1_46/boost/archive/detail/common_oarchive.hpp:69:9:   instantiated from ‘void boost::archive::detail::common_oarchive<Archive>::save_override(T&, int) [with T = PluginStateWriter<FireScreen>, Archive = boost::archive::text_oarchive]’
/usr/include/boost-1_46/boost/archive/basic_text_oarchive.hpp:80:9:   instantiated from ‘void boost::archive::basic_text_oarchive<Archive>::save_override(T&, int) [with T = PluginStateWriter<FireScreen>, Archive = boost::archive::text_oarchive]’
/usr/include/boost-1_46/boost/archive/detail/interface_oarchive.hpp:63:9:   instantiated from ‘Archive& boost::archive::detail::interface_oarchive<Archive>::operator<<(T&) [with T = PluginStateWriter<FireScreen>, Archive = boost::archive::text_oarchive]’
/usr/include/compiz/core/serialization.h:122:6:   instantiated from ‘void PluginStateWriter<T>::writeSerializedData() [with T = FireScreen]’
/var/tmp/portage/x11-plugins/compiz-plugins-extra-0.9.2/work/plugins-extra/firepaint/src/firepaint.cpp:750:5:   instantiated from here
/usr/include/boost-1_46/boost/mpl/print.hpp:55:5: warning: comparison between signed and unsigned integer expressions
Linking CXX shared library libscalefilter.so
[ 24%] Built target cubeaddon
[ 25%] Generating ../generated/wallpaper.xml
[ 26%] Generating ../generated/wallpaper_options.h
[ 26%] Generating ../generated/wallpaper_options.cpp
Scanning dependencies of target wallpaper
[ 26%] Built target scalefilter
[ 26%] Generating ../generated/maximumize.xml
[ 27%] Generating ../generated/maximumize_options.h
[ 27%] Building CXX object wallpaper/CMakeFiles/wallpaper.dir/src/wallpaper.cpp.o
[ 28%] Generating ../generated/maximumize_options.cpp
Scanning dependencies of target maximumize
[ 29%] Building CXX object maximumize/CMakeFiles/maximumize.dir/src/maximumize.cpp.o
[ 30%] Building CXX object firepaint/CMakeFiles/firepaint.dir/__/generated/firepaint_options.cpp.o
Linking CXX shared library libfirepaint.so
[ 30%] Built target firepaint
[ 31%] Generating ../generated/addhelper.xml
[ 32%] Generating ../generated/addhelper_options.h
[ 32%] Generating ../generated/addhelper_options.cpp
Scanning dependencies of target addhelper
[ 32%] Building CXX object maximumize/CMakeFiles/maximumize.dir/__/generated/maximumize_options.cpp.o
[ 33%] Building CXX object wallpaper/CMakeFiles/wallpaper.dir/__/generated/wallpaper_options.cpp.o
[ 33%] Building CXX object addhelper/CMakeFiles/addhelper.dir/src/addhelper.cpp.o
/var/tmp/portage/x11-plugins/compiz-plugins-extra-0.9.2/work/compiz-plugins-extra-0.9.2_build/generated/wallpaper_options.cpp: In constructor ‘WallpaperOptions::WallpaperOptions()’:
/var/tmp/portage/x11-plugins/compiz-plugins-extra-0.9.2/work/compiz-plugins-extra-0.9.2_build/generated/wallpaper_options.cpp:21:27: warning: unused variable ‘color’
Linking CXX shared library libmaximumize.so
[ 33%] Built target maximumize
[ 34%] Linking CXX shared library libwallpaper.so
Generating ../generated/group.xml
[ 34%] Generating ../generated/group_options.h
[ 34%] Built target wallpaper
[ 35%] Generating ../generated/trailfocus.xml
[ 35%] Generating ../generated/trailfocus_options.h
[ 36%] Generating ../generated/group_options.cpp
[ 37%] Generating ../generated/trailfocus_options.cpp
Scanning dependencies of target trailfocus
Scanning dependencies of target group
In file included from /usr/include/boost-1_46/boost/serialization/static_warning.hpp:73:0,
                 from /usr/include/boost-1_46/boost/serialization/extended_type_info_typeid.hpp:27,
                 from /usr/include/boost-1_46/boost/archive/detail/iserializer.hpp:47,
                 from /usr/include/boost-1_46/boost/archive/detail/interface_iarchive.hpp:22,
                 from /usr/include/boost-1_46/boost/archive/detail/common_iarchive.hpp:23,
                 from /usr/include/boost-1_46/boost/archive/basic_text_iarchive.hpp:31,
                 from /usr/include/boost-1_46/boost/archive/text_iarchive.hpp:24,
                 from /usr/include/compiz/core/serialization.h:36,
                 from /var/tmp/portage/x11-plugins/compiz-plugins-extra-0.9.2/work/plugins-extra/addhelper/src/addhelper.h:30,
                 from /var/tmp/portage/x11-plugins/compiz-plugins-extra-0.9.2/work/plugins-extra/addhelper/src/addhelper.cpp:29:
/usr/include/boost-1_46/boost/mpl/print.hpp: In instantiation of ‘boost::mpl::print<boost::serialization::BOOST_SERIALIZATION_STATIC_WARNING_LINE<98> >’:
/usr/include/boost-1_46/boost/serialization/static_warning.hpp:92:13:   instantiated from ‘boost::serialization::static_warning_test<false, 98>’
/usr/include/boost-1_46/boost/archive/detail/check.hpp:98:1:   instantiated from ‘void boost::archive::detail::check_object_tracking() [with T = PluginStateWriter<AddWindow>]’
/usr/include/boost-1_46/boost/archive/detail/oserializer.hpp:313:9:   instantiated from ‘static void boost::archive::detail::save_non_pointer_type<Archive>::invoke(Archive&, T&) [with T = PluginStateWriter<AddWindow>, Archive = boost::archive::text_oarchive]’
/usr/include/boost-1_46/boost/archive/detail/oserializer.hpp:525:5:   instantiated from ‘void boost::archive::save(Archive&, T&) [with Archive = boost::archive::text_oarchive, T = PluginStateWriter<AddWindow>]’
/usr/include/boost-1_46/boost/archive/detail/common_oarchive.hpp:69:9:   instantiated from ‘void boost::archive::detail::common_oarchive<Archive>::save_override(T&, int) [with T = PluginStateWriter<AddWindow>, Archive = boost::archive::text_oarchive]’
/usr/include/boost-1_46/boost/archive/basic_text_oarchive.hpp:80:9:   instantiated from ‘void boost::archive::basic_text_oarchive<Archive>::save_override(T&, int) [with T = PluginStateWriter<AddWindow>, Archive = boost::archive::text_oarchive]’
/usr/include/boost-1_46/boost/archive/detail/interface_oarchive.hpp:63:9:   instantiated from ‘Archive& boost::archive::detail::interface_oarchive<Archive>::operator<<(T&) [with T = PluginStateWriter<AddWindow>, Archive = boost::archive::text_oarchive]’
/usr/include/compiz/core/serialization.h:122:6:   instantiated from ‘void PluginStateWriter<T>::writeSerializedData() [with T = AddWindow]’
/var/tmp/portage/x11-plugins/compiz-plugins-extra-0.9.2/work/plugins-extra/addhelper/src/addhelper.cpp:221:5:   instantiated from here
/usr/include/boost-1_46/boost/mpl/print.hpp:55:5: warning: comparison between signed and unsigned integer expressions
[ 38%] Building CXX object trailfocus/CMakeFiles/trailfocus.dir/src/trailfocus.cpp.o
[ 39%] Building CXX object group/CMakeFiles/group.dir/src/queues.cpp.o
[ 40%] Building CXX object addhelper/CMakeFiles/addhelper.dir/__/generated/addhelper_options.cpp.o
Linking CXX shared library libaddhelper.so
[ 41%] Building CXX object trailfocus/CMakeFiles/trailfocus.dir/__/generated/trailfocus_options.cpp.o
[ 41%] Built target addhelper
[ 41%] Generating ../generated/showdesktop.xml
[ 42%] Generating ../generated/showdesktop_options.h
[ 43%] Generating ../generated/showdesktop_options.cpp
Scanning dependencies of target showdesktop
[ 44%] Building CXX object group/CMakeFiles/group.dir/src/glow.cpp.o
[ 45%] Building CXX object showdesktop/CMakeFiles/showdesktop.dir/src/showdesktop.cpp.o
/var/tmp/portage/x11-plugins/compiz-plugins-extra-0.9.2/work/plugins-extra/showdesktop/src/showdesktop.cpp:81:2: warning: #warning need to make window->managed wrappable
Linking CXX shared library libtrailfocus.so
[ 45%] Built target trailfocus
[ 45%] Generating ../generated/grid.xml
[ 46%] Generating ../generated/grid_options.h
[ 47%] Generating ../generated/grid_options.cpp
Scanning dependencies of target grid
[ 47%] Building CXX object group/CMakeFiles/group.dir/src/init.cpp.o
[ 48%] Building CXX object grid/CMakeFiles/grid.dir/src/grid.cpp.o
[ 48%] Building CXX object showdesktop/CMakeFiles/showdesktop.dir/__/generated/showdesktop_options.cpp.o
Linking CXX shared library libshowdesktop.so
[ 48%] Built target showdesktop
[ 49%] Generating ../generated/showmouse.xml
[ 49%] Generating ../generated/showmouse_options.h
[ 50%] Generating ../generated/showmouse_options.cpp
Scanning dependencies of target showmouse
[ 51%] Building CXX object showmouse/CMakeFiles/showmouse.dir/src/showmouse.cpp.o
/var/tmp/portage/x11-plugins/compiz-plugins-extra-0.9.2/work/plugins-extra/group/src/init.cpp: In constructor ‘GroupScreen::GroupScreen(CompScreen*)’:
/var/tmp/portage/x11-plugins/compiz-plugins-extra-0.9.2/work/plugins-extra/group/src/init.cpp:373:29: warning: passing NULL to non-pointer argument 1 of ‘std::list<_Tp, _Alloc>::list(std::list::size_type, const value_type&, const allocator_type&) [with _Tp = GroupSelection*, _Alloc = std::allocator<GroupSelection*>, std::list::size_type = long unsigned int, value_type = GroupSelection*, allocator_type = std::allocator<GroupSelection*>]’
In file included from /usr/include/boost-1_46/boost/serialization/static_warning.hpp:73:0,
                 from /usr/include/boost-1_46/boost/serialization/extended_type_info_typeid.hpp:27,
                 from /usr/include/boost-1_46/boost/archive/detail/iserializer.hpp:47,
                 from /usr/include/boost-1_46/boost/archive/detail/interface_iarchive.hpp:22,
                 from /usr/include/boost-1_46/boost/archive/detail/common_iarchive.hpp:23,
                 from /usr/include/boost-1_46/boost/archive/basic_text_iarchive.hpp:31,
                 from /usr/include/boost-1_46/boost/archive/text_iarchive.hpp:24,
                 from /usr/include/compiz/core/serialization.h:36,
                 from /var/tmp/portage/x11-plugins/compiz-plugins-extra-0.9.2/work/plugins-extra/group/src/group.h:77,
                 from /var/tmp/portage/x11-plugins/compiz-plugins-extra-0.9.2/work/plugins-extra/group/src/init.cpp:27:
/usr/include/boost-1_46/boost/mpl/print.hpp: At global scope:
/usr/include/boost-1_46/boost/mpl/print.hpp: In instantiation of ‘boost::mpl::print<boost::serialization::BOOST_SERIALIZATION_STATIC_WARNING_LINE<98> >’:
/usr/include/boost-1_46/boost/serialization/static_warning.hpp:92:13:   instantiated from ‘boost::serialization::static_warning_test<false, 98>’
/usr/include/boost-1_46/boost/archive/detail/check.hpp:98:1:   instantiated from ‘void boost::archive::detail::check_object_tracking() [with T = PluginStateWriter<GroupScreen>]’
/usr/include/boost-1_46/boost/archive/detail/oserializer.hpp:313:9:   instantiated from ‘static void boost::archive::detail::save_non_pointer_type<Archive>::invoke(Archive&, T&) [with T = PluginStateWriter<GroupScreen>, Archive = boost::archive::text_oarchive]’
/usr/include/boost-1_46/boost/archive/detail/oserializer.hpp:525:5:   instantiated from ‘void boost::archive::save(Archive&, T&) [with Archive = boost::archive::text_oarchive, T = PluginStateWriter<GroupScreen>]’
/usr/include/boost-1_46/boost/archive/detail/common_oarchive.hpp:69:9:   instantiated from ‘void boost::archive::detail::common_oarchive<Archive>::save_override(T&, int) [with T = PluginStateWriter<GroupScreen>, Archive = boost::archive::text_oarchive]’
/usr/include/boost-1_46/boost/archive/basic_text_oarchive.hpp:80:9:   instantiated from ‘void boost::archive::basic_text_oarchive<Archive>::save_override(T&, int) [with T = PluginStateWriter<GroupScreen>, Archive = boost::archive::text_oarchive]’
/usr/include/boost-1_46/boost/archive/detail/interface_oarchive.hpp:63:9:   instantiated from ‘Archive& boost::archive::detail::interface_oarchive<Archive>::operator<<(T&) [with T = PluginStateWriter<GroupScreen>, Archive = boost::archive::text_oarchive]’
/usr/include/compiz/core/serialization.h:122:6:   instantiated from ‘void PluginStateWriter<T>::writeSerializedData() [with T = GroupScreen]’
/var/tmp/portage/x11-plugins/compiz-plugins-extra-0.9.2/work/plugins-extra/group/src/init.cpp:460:5:   instantiated from here
/usr/include/boost-1_46/boost/mpl/print.hpp:55:5: warning: comparison between signed and unsigned integer expressions
[ 51%] Building CXX object grid/CMakeFiles/grid.dir/__/generated/grid_options.cpp.o
In file included from /usr/include/boost-1_46/boost/serialization/static_warning.hpp:73:0,
                 from /usr/include/boost-1_46/boost/serialization/extended_type_info_typeid.hpp:27,
                 from /usr/include/boost-1_46/boost/archive/detail/iserializer.hpp:47,
                 from /usr/include/boost-1_46/boost/archive/detail/interface_iarchive.hpp:22,
                 from /usr/include/boost-1_46/boost/archive/detail/common_iarchive.hpp:23,
                 from /usr/include/boost-1_46/boost/archive/basic_text_iarchive.hpp:31,
                 from /usr/include/boost-1_46/boost/archive/text_iarchive.hpp:24,
                 from /usr/include/compiz/core/serialization.h:36,
                 from /var/tmp/portage/x11-plugins/compiz-plugins-extra-0.9.2/work/plugins-extra/showmouse/src/showmouse.h:26,
                 from /var/tmp/portage/x11-plugins/compiz-plugins-extra-0.9.2/work/plugins-extra/showmouse/src/showmouse.cpp:27:
/usr/include/boost-1_46/boost/mpl/print.hpp: In instantiation of ‘boost::mpl::print<boost::serialization::BOOST_SERIALIZATION_STATIC_WARNING_LINE<98> >’:
/usr/include/boost-1_46/boost/serialization/static_warning.hpp:92:13:   instantiated from ‘boost::serialization::static_warning_test<false, 98>’
/usr/include/boost-1_46/boost/archive/detail/check.hpp:98:1:   instantiated from ‘void boost::archive::detail::check_object_tracking() [with T = PluginStateWriter<ShowmouseScreen>]’
/usr/include/boost-1_46/boost/archive/detail/oserializer.hpp:313:9:   instantiated from ‘static void boost::archive::detail::save_non_pointer_type<Archive>::invoke(Archive&, T&) [with T = PluginStateWriter<ShowmouseScreen>, Archive = boost::archive::text_oarchive]’
/usr/include/boost-1_46/boost/archive/detail/oserializer.hpp:525:5:   instantiated from ‘void boost::archive::save(Archive&, T&) [with Archive = boost::archive::text_oarchive, T = PluginStateWriter<ShowmouseScreen>]’
/usr/include/boost-1_46/boost/archive/detail/common_oarchive.hpp:69:9:   instantiated from ‘void boost::archive::detail::common_oarchive<Archive>::save_override(T&, int) [with T = PluginStateWriter<ShowmouseScreen>, Archive = boost::archive::text_oarchive]’
/usr/include/boost-1_46/boost/archive/basic_text_oarchive.hpp:80:9:   instantiated from ‘void boost::archive::basic_text_oarchive<Archive>::save_override(T&, int) [with T = PluginStateWriter<ShowmouseScreen>, Archive = boost::archive::text_oarchive]’
/usr/include/boost-1_46/boost/archive/detail/interface_oarchive.hpp:63:9:   instantiated from ‘Archive& boost::archive::detail::interface_oarchive<Archive>::operator<<(T&) [with T = PluginStateWriter<ShowmouseScreen>, Archive = boost::archive::text_oarchive]’
/usr/include/compiz/core/serialization.h:122:6:   instantiated from ‘void PluginStateWriter<T>::writeSerializedData() [with T = ShowmouseScreen]’
/var/tmp/portage/x11-plugins/compiz-plugins-extra-0.9.2/work/plugins-extra/showmouse/src/showmouse.cpp:701:5:   instantiated from here
/usr/include/boost-1_46/boost/mpl/print.hpp:55:5: warning: comparison between signed and unsigned integer expressions
Linking CXX shared library libgrid.so
[ 51%] Built target grid
[ 52%] Generating ../generated/notification.xml
[ 53%] Generating ../generated/notification_options.h
[ 53%] Generating ../generated/notification_options.cpp
Scanning dependencies of target notification
[ 53%] Building CXX object notification/CMakeFiles/notification.dir/src/notification.cpp.o
[ 54%] Building CXX object group/CMakeFiles/group.dir/src/selection.cpp.o
[ 55%] Building CXX object showmouse/CMakeFiles/showmouse.dir/__/generated/showmouse_options.cpp.o
/var/tmp/portage/x11-plugins/compiz-plugins-extra-0.9.2/work/plugins-extra/notification/src/notification.cpp: In member function ‘virtual void NotificationScreen::logMessage(const char*, CompLogLevel, const char*)’:
/var/tmp/portage/x11-plugins/compiz-plugins-extra-0.9.2/work/plugins-extra/notification/src/notification.cpp:58:28: error: too many arguments to function ‘NotifyNotification* notify_notification_new(const char*, const char*, const char*)’
/usr/include/libnotify/notification.h:114:21: note: declared here
make[2]: *** [notification/CMakeFiles/notification.dir/src/notification.cpp.o] Error 1
make[1]: *** [notification/CMakeFiles/notification.dir/all] Error 2
make[1]: *** Waiting for unfinished jobs....
[ 56%] Building CXX object group/CMakeFiles/group.dir/src/cairo.cpp.o
Linking CXX shared library libshowmouse.so
[ 56%] Built target showmouse
[ 56%] Building CXX object group/CMakeFiles/group.dir/src/tab.cpp.o
[ 57%] Building CXX object group/CMakeFiles/group.dir/src/group.cpp.o
[ 58%] Building CXX object group/CMakeFiles/group.dir/src/paint.cpp.o
In file included from /usr/include/boost-1_46/boost/serialization/static_warning.hpp:73:0,
                 from /usr/include/boost-1_46/boost/serialization/extended_type_info_typeid.hpp:27,
                 from /usr/include/boost-1_46/boost/archive/detail/iserializer.hpp:47,
                 from /usr/include/boost-1_46/boost/archive/detail/interface_iarchive.hpp:22,
                 from /usr/include/boost-1_46/boost/archive/detail/common_iarchive.hpp:23,
                 from /usr/include/boost-1_46/boost/archive/basic_text_iarchive.hpp:31,
                 from /usr/include/boost-1_46/boost/archive/text_iarchive.hpp:24,
                 from /usr/include/compiz/core/serialization.h:36,
                 from /var/tmp/portage/x11-plugins/compiz-plugins-extra-0.9.2/work/plugins-extra/group/src/group.h:77,
                 from /var/tmp/portage/x11-plugins/compiz-plugins-extra-0.9.2/work/plugins-extra/group/src/tab.cpp:27:
/usr/include/boost-1_46/boost/mpl/print.hpp: In instantiation of ‘boost::mpl::print<boost::serialization::BOOST_SERIALIZATION_STATIC_WARNING_LINE<98> >’:
/usr/include/boost-1_46/boost/serialization/static_warning.hpp:92:13:   instantiated from ‘boost::serialization::static_warning_test<false, 98>’
/usr/include/boost-1_46/boost/archive/detail/check.hpp:98:1:   instantiated from ‘void boost::archive::detail::check_object_tracking() [with T = PluginStateWriter<GroupScreen>]’
/usr/include/boost-1_46/boost/archive/detail/oserializer.hpp:313:9:   instantiated from ‘static void boost::archive::detail::save_non_pointer_type<Archive>::invoke(Archive&, T&) [with T = PluginStateWriter<GroupScreen>, Archive = boost::archive::text_oarchive]’
/usr/include/boost-1_46/boost/archive/detail/oserializer.hpp:525:5:   instantiated from ‘void boost::archive::save(Archive&, T&) [with Archive = boost::archive::text_oarchive, T = PluginStateWriter<GroupScreen>]’
/usr/include/boost-1_46/boost/archive/detail/common_oarchive.hpp:69:9:   instantiated from ‘void boost::archive::detail::common_oarchive<Archive>::save_override(T&, int) [with T = PluginStateWriter<GroupScreen>, Archive = boost::archive::text_oarchive]’
/usr/include/boost-1_46/boost/archive/basic_text_oarchive.hpp:80:9:   instantiated from ‘void boost::archive::basic_text_oarchive<Archive>::save_override(T&, int) [with T = PluginStateWriter<GroupScreen>, Archive = boost::archive::text_oarchive]’
/usr/include/boost-1_46/boost/archive/detail/interface_oarchive.hpp:63:9:   instantiated from ‘Archive& boost::archive::detail::interface_oarchive<Archive>::operator<<(T&) [with T = PluginStateWriter<GroupScreen>, Archive = boost::archive::text_oarchive]’
/usr/include/compiz/core/serialization.h:122:6:   instantiated from ‘void PluginStateWriter<T>::writeSerializedData() [with T = GroupScreen]’
/var/tmp/portage/x11-plugins/compiz-plugins-extra-0.9.2/work/plugins-extra/group/src/tab.cpp:2548:30:   instantiated from here
/usr/include/boost-1_46/boost/mpl/print.hpp:55:5: warning: comparison between signed and unsigned integer expressions
In file included from /usr/include/boost-1_46/boost/serialization/static_warning.hpp:73:0,
                 from /usr/include/boost-1_46/boost/serialization/extended_type_info_typeid.hpp:27,
                 from /usr/include/boost-1_46/boost/archive/detail/iserializer.hpp:47,
                 from /usr/include/boost-1_46/boost/archive/detail/interface_iarchive.hpp:22,
                 from /usr/include/boost-1_46/boost/archive/detail/common_iarchive.hpp:23,
                 from /usr/include/boost-1_46/boost/archive/basic_text_iarchive.hpp:31,
                 from /usr/include/boost-1_46/boost/archive/text_iarchive.hpp:24,
                 from /usr/include/compiz/core/serialization.h:36,
                 from /var/tmp/portage/x11-plugins/compiz-plugins-extra-0.9.2/work/plugins-extra/group/src/group.h:77,
                 from /var/tmp/portage/x11-plugins/compiz-plugins-extra-0.9.2/work/plugins-extra/group/src/group.cpp:27:
/usr/include/boost-1_46/boost/mpl/print.hpp: In instantiation of ‘boost::mpl::print<boost::serialization::BOOST_SERIALIZATION_STATIC_WARNING_LINE<98> >’:
/usr/include/boost-1_46/boost/serialization/static_warning.hpp:92:13:   instantiated from ‘boost::serialization::static_warning_test<false, 98>’
/usr/include/boost-1_46/boost/archive/detail/check.hpp:98:1:   instantiated from ‘void boost::archive::detail::check_object_tracking() [with T = PluginStateWriter<GroupScreen>]’
/usr/include/boost-1_46/boost/archive/detail/oserializer.hpp:313:9:   instantiated from ‘static void boost::archive::detail::save_non_pointer_type<Archive>::invoke(Archive&, T&) [with T = PluginStateWriter<GroupScreen>, Archive = boost::archive::text_oarchive]’
/usr/include/boost-1_46/boost/archive/detail/oserializer.hpp:525:5:   instantiated from ‘void boost::archive::save(Archive&, T&) [with Archive = boost::archive::text_oarchive, T = PluginStateWriter<GroupScreen>]’
/usr/include/boost-1_46/boost/archive/detail/common_oarchive.hpp:69:9:   instantiated from ‘void boost::archive::detail::common_oarchive<Archive>::save_override(T&, int) [with T = PluginStateWriter<GroupScreen>, Archive = boost::archive::text_oarchive]’
/usr/include/boost-1_46/boost/archive/basic_text_oarchive.hpp:80:9:   instantiated from ‘void boost::archive::basic_text_oarchive<Archive>::save_override(T&, int) [with T = PluginStateWriter<GroupScreen>, Archive = boost::archive::text_oarchive]’
/usr/include/boost-1_46/boost/archive/detail/interface_oarchive.hpp:63:9:   instantiated from ‘Archive& boost::archive::detail::interface_oarchive<Archive>::operator<<(T&) [with T = PluginStateWriter<GroupScreen>, Archive = boost::archive::text_oarchive]’
/usr/include/compiz/core/serialization.h:122:6:   instantiated from ‘void PluginStateWriter<T>::writeSerializedData() [with T = GroupScreen]’
/var/tmp/portage/x11-plugins/compiz-plugins-extra-0.9.2/work/plugins-extra/group/src/group.cpp:553:27:   instantiated from here
/usr/include/boost-1_46/boost/mpl/print.hpp:55:5: warning: comparison between signed and unsigned integer expressions
[ 59%] Building CXX object group/CMakeFiles/group.dir/__/generated/group_options.cpp.o
Linking CXX shared library libgroup.so
[ 59%] Built target group
make: *** [all] Error 2
emake failed
 * ERROR: x11-plugins/compiz-plugins-extra-0.9.2 failed (compile phase):
 *   Make failed!
 *
 * Call stack:
 *     ebuild.sh, line   85:  Called src_compile
 *   environment, line 2520:  Called cmake-utils_src_compile
 *   environment, line  620:  Called _execute_optionaly 'src_compile'
 *   environment, line  221:  Called enable_cmake-utils_src_compile
 *   environment, line  869:  Called cmake-utils_src_make
 *   environment, line  639:  Called die
 * The specific snippet of code:
 *           emake "$@" || die "Make failed!";
 *
 * If you need support, post the output of 'emerge --info =x11-plugins/compiz-plugins-extra-0.9.2',
 * the complete build log and the output of 'emerge -pqv =x11-plugins/compiz-plugins-extra-0.9.2'.
 * This ebuild is from an overlay named 'desktop-effects': '/var/lib/layman/desktop-effects/'
 * The complete build log is located at '/var/tmp/portage/x11-plugins/compiz-plugins-extra-0.9.2/temp/build.log'.
 * The ebuild environment file is located at '/var/tmp/portage/x11-plugins/compiz-plugins-extra-0.9.2/temp/environment'.
 * S: '/var/tmp/portage/x11-plugins/compiz-plugins-extra-0.9.2/work/plugins-extra'

>>> Failed to emerge x11-plugins/compiz-plugins-extra-0.9.2, Log file:

>>>  '/var/tmp/portage/x11-plugins/compiz-plugins-extra-0.9.2/temp/build.log'

 * Messages for package x11-plugins/compiz-plugins-extra-0.9.2:

 * ERROR: x11-plugins/compiz-plugins-extra-0.9.2 failed (compile phase):
 *   Make failed!
 *
 * Call stack:
 *     ebuild.sh, line   85:  Called src_compile
 *   environment, line 2520:  Called cmake-utils_src_compile
 *   environment, line  620:  Called _execute_optionaly 'src_compile'
 *   environment, line  221:  Called enable_cmake-utils_src_compile
 *   environment, line  869:  Called cmake-utils_src_make
 *   environment, line  639:  Called die
 * The specific snippet of code:
 *           emake "$@" || die "Make failed!";
 *
 * If you need support, post the output of 'emerge --info =x11-plugins/compiz-plugins-extra-0.9.2',
 * the complete build log and the output of 'emerge -pqv =x11-plugins/compiz-plugins-extra-0.9.2'.
 * This ebuild is from an overlay named 'desktop-effects': '/var/lib/layman/desktop-effects/'
 * The complete build log is located at '/var/tmp/portage/x11-plugins/compiz-plugins-extra-0.9.2/temp/build.log'.
 * The ebuild environment file is located at '/var/tmp/portage/x11-plugins/compiz-plugins-extra-0.9.2/temp/environment'.
 * S: '/var/tmp/portage/x11-plugins/compiz-plugins-extra-0.9.2/work/plugins-extra'

_________________
Intel 2.2 Core 2 Duo, 4Gb Ram, 320GB Sata Drive and Nvidia card.
Back to top
View user's profile Send private message
Display posts from previous:   
Reply to topic    Gentoo Forums Forum Index Unsupported Software All times are GMT
Goto page Previous  1, 2, 3 ... 15, 16, 17
Page 17 of 17

 
Jump to:  
You cannot post new topics in this forum
You cannot reply to topics in this forum
You cannot edit your posts in this forum
You cannot delete your posts in this forum
You cannot vote in polls in this forum