Gentoo Forums
Gentoo Forums
Gentoo Forums
Quick Search: in
Aterm fails.
View unanswered posts
View posts from last 24 hours

 
This topic is locked: you cannot edit posts or make replies.    Gentoo Forums Forum Index Gentoo for Mac OS X (Portage for Mac OS X)
View previous topic :: View next topic  
Author Message
Hydraulix
Guru
Guru


Joined: 12 Dec 2003
Posts: 447
Location: Baltimore, Maryland

PostPosted: Thu Sep 09, 2004 9:09 pm    Post subject: Aterm fails. Reply with quote

Code:
> /usr/portage/x11-terms/aterm/aterm-0.4.2-r9.ebuild has been updated; recreating WORKDIR...
>>> Unpacking source...
>>> Unpacking aterm-0.4.2.tar.bz2 to /var/tmp/portage/aterm-0.4.2-r9/work
sed: 1: "command.c": command c expects \ followed by text
 * Applying aterm-0.4.2-borderless.patch...                               [ ok ]
 * Applying aterm-0.4.2-paste.patch...                                    [ ok ]
 * Applying aterm-0.4.2-paste_mouse_outside.patch...                      [ ok ]
 * Applying aterm-0.4.2-copynpaste-r3.patch...                            [ ok ]
 * Applying aterm-0.4.2-patch-pack000.patch...                            [ ok ]
>>> Source unpacked.
creating cache ./config.cache
configuring for aterm 0.4.2
checking for gcc... gcc
checking whether the C compiler (gcc -O2 -pipe  -Wl,-z,now) works... no
configure: error: installation or configuration problem: C compiler cannot create executables.

!!! ERROR: x11-terms/aterm-0.4.2-r9 failed.
!!! Function econf, Line 425, Exitcode 1
!!! econf failed


Hydraulixs-Computer:/usr/portage root#


What's up with GCC? How come it can't create executables?
_________________
It is the fate of operating systems to become free.
- Neal Stephenson

If only You and Dead people can read hex, how many people can read hex?
Back to top
View user's profile Send private message
Hydraulix
Guru
Guru


Joined: 12 Dec 2003
Posts: 447
Location: Baltimore, Maryland

PostPosted: Fri Sep 10, 2004 8:37 am    Post subject: Reply with quote

Ok I kinda found out what's wrong. I needed Xcode 1.5 installed. So now I've reinstalled gentoo with Xcode 1.5 and still I get the same problem. How do I fix this?



Thanks :)
_________________
It is the fate of operating systems to become free.
- Neal Stephenson

If only You and Dead people can read hex, how many people can read hex?
Back to top
View user's profile Send private message
BennyP
Guru
Guru


Joined: 09 May 2003
Posts: 497
Location: Toronto, Canada

PostPosted: Fri Sep 10, 2004 8:39 am    Post subject: Reply with quote

update portage?
i seem to recall that
Code:
emerge portage
is broken atm
_________________
Could it be?
Back to top
View user's profile Send private message
Hydraulix
Guru
Guru


Joined: 12 Dec 2003
Posts: 447
Location: Baltimore, Maryland

PostPosted: Fri Sep 10, 2004 10:30 pm    Post subject: Reply with quote

Hmm now portage won't compile.

Code:
emerge portage
Calculating dependencies ...done!
>>> emerge (1 of 1) sys-apps/portage-2.0.50-r11 to /
>>> md5 src_uri ;-) portage-2.0.50-r11.tar.bz2
>>> Checking portage-2.0.50-r11.tar.bz2's mtime...
>>> WORKDIR is up-to-date, keeping...
cc   -D_GNU_SOURCE -DPIC -fPIC -D_REENTRANT -Wall -c libsandbox.c
libsandbox.c: In function `open':
libsandbox.c:541: warning: `mode_t' is promoted to `int' when passed through `..
.'
libsandbox.c:541: warning: (so you should pass `int' not `mode_t' to `va_arg')
libsandbox.c: In function `init_env_entries':
libsandbox.c:955: warning: implicit declaration of function `strndupa'
libsandbox.c:955: warning: assignment makes pointer from integer without a cast
libsandbox.c:964: warning: implicit declaration of function `strndup'
libsandbox.c:964: warning: assignment makes pointer from integer without a cast
In file included from libsandbox.c:1363:
getcwd.c:224:1: warning: "__lstat" redefined
getcwd.c:207:1: warning: this is the location of the previous definition
In file included from libsandbox.c:1363:
getcwd.c: In function `__egetcwd':
getcwd.c:346: error: `__ptr_t' undeclared (first use in this function)
getcwd.c:346: error: (Each undeclared identifier is reported only once
getcwd.c:346: error: for each function it appears in.)
getcwd.c:346: error: parse error before "dotlist"
getcwd.c:388: warning: implicit declaration of function `_D_ALLOC_NAMLEN'
getcwd.c:419: warning: implicit declaration of function `_D_EXACT_NAMLEN'
getcwd.c:443: error: void value not ignored as it ought to be
getcwd.c:461: error: parse error before "dotlist"
getcwd.c:472: error: parse error before "dotlist"
getcwd.c: In function `egetcwd':
getcwd.c:483: error: argument `size' doesn't match prototype
libsandbox.c:136: error: prototype declaration
In file included from libsandbox.c:1364:
canonicalize.c: In function `erealpath':
canonicalize.c:153: warning: implicit declaration of function `__mempcpy'
canonicalize.c:153: warning: assignment makes pointer from integer without a cas
t
canonicalize.c:163: error: void value not ignored as it ought to be
make: *** [libsandbox.o] Error 1

!!! ERROR: sys-apps/portage-2.0.50-r11 failed.
!!! Function src_compile, Line 71, Exitcode 2
!!! (no error message)

_________________
It is the fate of operating systems to become free.
- Neal Stephenson

If only You and Dead people can read hex, how many people can read hex?
Back to top
View user's profile Send private message
JoseJX
Developer
Developer


Joined: 28 Apr 2002
Posts: 2774

PostPosted: Tue Sep 21, 2004 2:26 pm    Post subject: Reply with quote

The only versions of portage that will work with OSX are the 2.0.51 series. I would recommend installing 2.0.51_rc1 or waiting for the next version of the installer (which will be coming out soon).
Back to top
View user's profile Send private message
Display posts from previous:   
This topic is locked: you cannot edit posts or make replies.    Gentoo Forums Forum Index Gentoo for Mac OS X (Portage for Mac OS X) All times are GMT
Page 1 of 1

 
Jump to:  
You cannot post new topics in this forum
You cannot reply to topics in this forum
You cannot edit your posts in this forum
You cannot delete your posts in this forum
You cannot vote in polls in this forum